activemq-commits mailing list archives

Site index · List index
Message view « Date » · « Thread »
Top « Date » · « Thread »
From Apache Jenkins Server <jenk...@builds.apache.org>
Subject Build failed in Jenkins: ActiveMQ-Artemis-Master #757
Date Tue, 06 Dec 2016 14:59:15 GMT
See <https://builds.apache.org/job/ActiveMQ-Artemis-Master/757/changes>

Changes:

[clebertsuconic] [maven-release-plugin] prepare release 1.5.1

[clebertsuconic] [maven-release-plugin] prepare for next development iteration

------------------------------------------
Started by an SCM change
[EnvInject] - Loading node environment variables.
Building remotely on proserpina-test (ubuntu) in workspace <https://builds.apache.org/job/ActiveMQ-Artemis-Master/ws/>
 > git rev-parse --is-inside-work-tree # timeout=10
Fetching changes from the remote Git repository
 > git config remote.origin.url https://git-wip-us.apache.org/repos/asf/activemq-artemis.git
# timeout=10
Cleaning workspace
 > git rev-parse --verify HEAD # timeout=10
Resetting working tree
 > git reset --hard # timeout=10
 > git clean -fdx # timeout=10
Fetching upstream changes from https://git-wip-us.apache.org/repos/asf/activemq-artemis.git
 > git --version # timeout=10
 > git -c core.askpass=true fetch --tags --progress https://git-wip-us.apache.org/repos/asf/activemq-artemis.git
+refs/heads/*:refs/remotes/origin/*
 > git rev-parse origin/master^{commit} # timeout=10
Checking out Revision 5f55cd44ecf87ef97aa6c4203b3db1860f66d437 (origin/master)
 > git config core.sparsecheckout # timeout=10
 > git checkout -f 5f55cd44ecf87ef97aa6c4203b3db1860f66d437
 > git rev-list 38e25caf1db971cc23cecb2fc232d2f900729f74 # timeout=10
[ActiveMQ-Artemis-Master] $ /home/jenkins/tools/maven/apache-maven-3.2.5/bin/mvn compile test-compile
-Pfast-tests -Pextra-tests test
[INFO] Scanning for projects...
[ERROR] The build could not read 1 project -> [Help 1]
[ERROR]   
[ERROR]   The project org.apache.activemq.tests:extra-tests:[unknown-version] (<https://builds.apache.org/job/ActiveMQ-Artemis-Master/ws/tests/extra-tests/pom.xml)>
has 1 error
[ERROR]     Non-resolvable parent POM: Could not find artifact org.apache.activemq.tests:artemis-tests-pom:pom:1.6.0-SNAPSHOT
and 'parent.relativePath' points at wrong local POM @ line 25, column 12 -> [Help 2]
[ERROR] 
[ERROR] To see the full stack trace of the errors, re-run Maven with the -e switch.
[ERROR] Re-run Maven using the -X switch to enable full debug logging.
[ERROR] 
[ERROR] For more information about the errors and possible solutions, please read the following
articles:
[ERROR] [Help 1] http://cwiki.apache.org/confluence/display/MAVEN/ProjectBuildingException
[ERROR] [Help 2] http://cwiki.apache.org/confluence/display/MAVEN/UnresolvableModelException
Build step 'Invoke top-level Maven targets' marked build as failure
Performing Post build task...
Could not match :Too many files with unapproved license  : False
Logical operation result is FALSE
Skipping script  : cat ratReport.txt
END OF POST BUILD TASK 	: 0
Recording test results
ERROR: Step ?Publish JUnit test result report? failed: No test report files were found. Configuration
error?


Mime
View raw message