activemq-commits mailing list archives

Site index · List index
Message view « Date » · « Thread »
Top « Date » · « Thread »
From Apache Jenkins Server <jenk...@builds.apache.org>
Subject Build failed in Jenkins: ActiveMQ-Artemis-Master #730
Date Thu, 03 Nov 2016 20:29:14 GMT
See <https://builds.apache.org/job/ActiveMQ-Artemis-Master/730/changes>

Changes:

[clebertsuconic] NO-JIRA: fixing extra-tests pom after the release

------------------------------------------
[...truncated 17335 lines...]
[main] 20:28:37,094 INFO  [org.apache.activemq.artemis.core.server] #*#*# Starting test: testCreateIteratorAfterAddElements()...
#test testCreateIteratorAfterAddElements
[main] 20:28:37,101 INFO  [org.apache.activemq.artemis.core.server] #*#*# Finished test: testCreateIteratorAfterAddElements()...
[main] 20:28:37,101 INFO  [org.apache.activemq.artemis.core.server] #*#*# Starting test: testClear()...
#test testClear
[main] 20:28:37,110 INFO  [org.apache.activemq.artemis.core.server] #*#*# Finished test: testClear()...
[main] 20:28:37,110 INFO  [org.apache.activemq.artemis.core.server] #*#*# Starting test: testPoll()...
#test testPoll
[main] 20:28:37,115 INFO  [org.apache.activemq.artemis.core.server] #*#*# Finished test: testPoll()...
[main] 20:28:37,117 INFO  [org.apache.activemq.artemis.core.server] #*#*# Starting test: testRemoveHead1()...
#test testRemoveHead1
[main] 20:28:37,122 INFO  [org.apache.activemq.artemis.core.server] #*#*# Finished test: testRemoveHead1()...
[main] 20:28:37,122 INFO  [org.apache.activemq.artemis.core.server] #*#*# Starting test: testRemoveHead2()...
#test testRemoveHead2
[main] 20:28:37,125 INFO  [org.apache.activemq.artemis.core.server] #*#*# Finished test: testRemoveHead2()...
[main] 20:28:37,126 INFO  [org.apache.activemq.artemis.core.server] #*#*# Starting test: testRemoveHead3()...
#test testRemoveHead3
[main] 20:28:37,129 INFO  [org.apache.activemq.artemis.core.server] #*#*# Finished test: testRemoveHead3()...
[main] 20:28:37,130 INFO  [org.apache.activemq.artemis.core.server] #*#*# Starting test: testRemoveTail1()...
#test testRemoveTail1
[main] 20:28:37,133 INFO  [org.apache.activemq.artemis.core.server] #*#*# Finished test: testRemoveTail1()...
[main] 20:28:37,134 INFO  [org.apache.activemq.artemis.core.server] #*#*# Starting test: testRemoveTail2()...
#test testRemoveTail2
[main] 20:28:37,138 INFO  [org.apache.activemq.artemis.core.server] #*#*# Finished test: testRemoveTail2()...
[main] 20:28:37,138 INFO  [org.apache.activemq.artemis.core.server] #*#*# Starting test: testRemoveTail3()...
#test testRemoveTail3
[main] 20:28:37,142 INFO  [org.apache.activemq.artemis.core.server] #*#*# Finished test: testRemoveTail3()...
[main] 20:28:37,142 INFO  [org.apache.activemq.artemis.core.server] #*#*# Starting test: testRemoveInTurn()...
#test testRemoveInTurn
[main] 20:28:37,147 INFO  [org.apache.activemq.artemis.core.server] #*#*# Finished test: testRemoveInTurn()...
[main] 20:28:37,147 INFO  [org.apache.activemq.artemis.core.server] #*#*# Starting test: testRemoveMiddle()...
#test testRemoveMiddle
[main] 20:28:37,151 INFO  [org.apache.activemq.artemis.core.server] #*#*# Finished test: testRemoveMiddle()...
[main] 20:28:37,151 INFO  [org.apache.activemq.artemis.core.server] #*#*# Starting test: testAddHeadAndRemove()...
#test testAddHeadAndRemove
Jumping 500
[main] 20:28:37,155 INFO  [org.apache.activemq.artemis.utils.ThreadLeakCheckRule] #test forceGC
[main] 20:28:37,336 INFO  [org.apache.activemq.artemis.utils.ThreadLeakCheckRule] #test forceGC
Done 
[main] 20:28:37,339 INFO  [org.apache.activemq.artemis.core.server] #*#*# Finished test: testAddHeadAndRemove()...
[main] 20:28:37,340 INFO  [org.apache.activemq.artemis.core.server] #*#*# Starting test: testMultipleIterators1()...
#test testMultipleIterators1
[main] 20:28:37,343 INFO  [org.apache.activemq.artemis.core.server] #*#*# Finished test: testMultipleIterators1()...
[main] 20:28:37,344 INFO  [org.apache.activemq.artemis.core.server] #*#*# Starting test: testMultipleIterators2()...
#test testMultipleIterators2
[main] 20:28:37,347 INFO  [org.apache.activemq.artemis.core.server] #*#*# Finished test: testMultipleIterators2()...
[main] 20:28:37,347 INFO  [org.apache.activemq.artemis.core.server] #*#*# Starting test: testResizing()...
#test testResizing
[main] 20:28:37,356 INFO  [org.apache.activemq.artemis.core.server] #*#*# Finished test: testResizing()...
[main] 20:28:37,357 INFO  [org.apache.activemq.artemis.core.server] #*#*# Starting test: testRepeatAndRemove()...
#test testRepeatAndRemove
[main] 20:28:37,363 INFO  [org.apache.activemq.artemis.core.server] #*#*# Finished test: testRepeatAndRemove()...
[main] 20:28:37,363 INFO  [org.apache.activemq.artemis.core.server] #*#*# Starting test: testIterateNoElements()...
#test testIterateNoElements
[main] 20:28:37,369 INFO  [org.apache.activemq.artemis.core.server] #*#*# Finished test: testIterateNoElements()...
[main] 20:28:37,371 INFO  [org.apache.activemq.artemis.core.server] #*#*# Starting test: testAddAndRemove()...
#test testAddAndRemove
[main] 20:28:37,380 INFO  [org.apache.activemq.artemis.utils.ThreadLeakCheckRule] #test forceGC
[main] 20:28:37,442 INFO  [org.apache.activemq.artemis.utils.ThreadLeakCheckRule] #test forceGC
Done 
[main] 20:28:37,745 INFO  [org.apache.activemq.artemis.utils.ThreadLeakCheckRule] #test forceGC
[main] 20:28:38,983 INFO  [org.apache.activemq.artemis.utils.ThreadLeakCheckRule] #test forceGC
Done 
[main] 20:28:39,235 INFO  [org.apache.activemq.artemis.utils.ThreadLeakCheckRule] #test forceGC
[main] 20:28:40,145 INFO  [org.apache.activemq.artemis.utils.ThreadLeakCheckRule] #test forceGC
Done 
[main] 20:28:40,146 INFO  [org.apache.activemq.artemis.utils.ThreadLeakCheckRule] #test forceGC
[main] 20:28:40,343 INFO  [org.apache.activemq.artemis.utils.ThreadLeakCheckRule] #test forceGC
Done 
[main] 20:28:40,344 INFO  [org.apache.activemq.artemis.utils.ThreadLeakCheckRule] #test forceGC
[main] 20:28:40,482 INFO  [org.apache.activemq.artemis.utils.ThreadLeakCheckRule] #test forceGC
Done 
[main] 20:28:40,483 INFO  [org.apache.activemq.artemis.utils.ThreadLeakCheckRule] #test forceGC
[main] 20:28:40,559 INFO  [org.apache.activemq.artemis.utils.ThreadLeakCheckRule] #test forceGC
Done 
[main] 20:28:41,040 INFO  [org.apache.activemq.artemis.utils.ThreadLeakCheckRule] #test forceGC
[main] 20:28:41,319 INFO  [org.apache.activemq.artemis.utils.ThreadLeakCheckRule] #test forceGC
Done 
[main] 20:28:41,830 INFO  [org.apache.activemq.artemis.utils.ThreadLeakCheckRule] #test forceGC
[main] 20:28:41,985 INFO  [org.apache.activemq.artemis.utils.ThreadLeakCheckRule] #test forceGC
Done 
[main] 20:28:42,529 INFO  [org.apache.activemq.artemis.utils.ThreadLeakCheckRule] #test forceGC
[main] 20:28:42,610 INFO  [org.apache.activemq.artemis.utils.ThreadLeakCheckRule] #test forceGC
Done 
[main] 20:28:42,610 INFO  [org.apache.activemq.artemis.utils.ThreadLeakCheckRule] #test forceGC
[main] 20:28:42,658 INFO  [org.apache.activemq.artemis.utils.ThreadLeakCheckRule] #test forceGC
Done 
[main] 20:28:42,661 INFO  [org.apache.activemq.artemis.core.server] #*#*# Finished test: testAddAndRemove()...
[main] 20:28:42,661 INFO  [org.apache.activemq.artemis.core.server] #*#*# Starting test: testRemoveHeadAndTail1()...
#test testRemoveHeadAndTail1
[main] 20:28:42,664 INFO  [org.apache.activemq.artemis.core.server] #*#*# Finished test: testRemoveHeadAndTail1()...
[main] 20:28:42,665 INFO  [org.apache.activemq.artemis.core.server] #*#*# Starting test: testRemoveHeadAndTail2()...
#test testRemoveHeadAndTail2
[main] 20:28:42,669 INFO  [org.apache.activemq.artemis.core.server] #*#*# Finished test: testRemoveHeadAndTail2()...
[main] 20:28:42,670 INFO  [org.apache.activemq.artemis.core.server] #*#*# Starting test: testRemoveHeadAndTail3()...
#test testRemoveHeadAndTail3
[main] 20:28:42,676 INFO  [org.apache.activemq.artemis.core.server] #*#*# Finished test: testRemoveHeadAndTail3()...
[main] 20:28:42,676 INFO  [org.apache.activemq.artemis.core.server] #*#*# Starting test: testRepeat()...
#test testRepeat
[main] 20:28:42,679 INFO  [org.apache.activemq.artemis.core.server] #*#*# Finished test: testRepeat()...
[main] 20:28:42,679 INFO  [org.apache.activemq.artemis.core.server] #*#*# Starting test: testCreateIteratorBeforeAddElements()...
#test testCreateIteratorBeforeAddElements
[main] 20:28:42,682 INFO  [org.apache.activemq.artemis.core.server] #*#*# Finished test: testCreateIteratorBeforeAddElements()...
[main] 20:28:42,682 INFO  [org.apache.activemq.artemis.core.server] #*#*# Starting test: testRemoveAll()...
#test testRemoveAll
[main] 20:28:42,685 INFO  [org.apache.activemq.artemis.core.server] #*#*# Finished test: testRemoveAll()...
[main] 20:28:42,685 INFO  [org.apache.activemq.artemis.core.server] #*#*# Starting test: testRemoveOdd()...
#test testRemoveOdd
[main] 20:28:42,688 INFO  [org.apache.activemq.artemis.core.server] #*#*# Finished test: testRemoveOdd()...
[main] 20:28:42,689 INFO  [org.apache.activemq.artemis.core.server] #*#*# Starting test: testIterateThenAddMoreAndIterateAgain()...
#test testIterateThenAddMoreAndIterateAgain
[main] 20:28:42,691 INFO  [org.apache.activemq.artemis.core.server] #*#*# Finished test: testIterateThenAddMoreAndIterateAgain()...
Tests run: 29, Failures: 0, Errors: 0, Skipped: 0, Time elapsed: 5.621 sec - in org.apache.activemq.artemis.tests.unit.util.LinkedListTest
Running org.apache.activemq.artemis.tests.unit.util.MemorySizeTest
[main] 20:28:51,324 WARN  [org.apache.activemq.artemis.core.client] AMQ212047: Warning: JVM
allocated more data what would make results invalid 1,974,992,896:1,507,852,288
[main] 20:28:51,324 INFO  [org.apache.activemq.artemis.tests.unit] Server message size is
1256
[main] 20:28:59,646 WARN  [org.apache.activemq.artemis.core.client] AMQ212047: Warning: JVM
allocated more data what would make results invalid 1,507,852,288:1,619,001,344
[main] 20:28:59,646 INFO  [org.apache.activemq.artemis.tests.unit] Message reference size
is 64
Tests run: 1, Failures: 0, Errors: 0, Skipped: 0, Time elapsed: 16.953 sec - in org.apache.activemq.artemis.tests.unit.util.MemorySizeTest
Running org.apache.activemq.artemis.tests.unit.util.ObjectInputStreamWithClassLoaderTest
[main] 20:28:59,647 INFO  [org.apache.activemq.artemis.core.server] #*#*# Starting test: testClassLoaderIsolationWithProxy()...
#test testClassLoaderIsolationWithProxy
Deserialized Object org.apache.activemq.artemis.tests.unit.util.ObjectInputStreamWithClassLoaderTest$AnObjectImpl@4b6166aa
[main] 20:28:59,696 INFO  [org.apache.activemq.artemis.core.server] #*#*# Finished test: testClassLoaderIsolationWithProxy()...
[main] 20:28:59,697 INFO  [org.apache.activemq.artemis.core.server] #*#*# Starting test: testWhiteBlackListAgainstListObject()...
#test testWhiteBlackListAgainstListObject
[main] 20:28:59,711 INFO  [org.apache.activemq.artemis.core.server] #*#*# Finished test: testWhiteBlackListAgainstListObject()...
[main] 20:28:59,711 INFO  [org.apache.activemq.artemis.core.server] #*#*# Starting test: testWhiteBlackListAgainstArrayObject()...
#test testWhiteBlackListAgainstArrayObject
[main] 20:28:59,723 INFO  [org.apache.activemq.artemis.core.server] #*#*# Finished test: testWhiteBlackListAgainstArrayObject()...
[main] 20:28:59,724 INFO  [org.apache.activemq.artemis.core.server] #*#*# Starting test: testWhiteBlackListAnonymousObject()...
#test testWhiteBlackListAnonymousObject
[main] 20:28:59,740 INFO  [org.apache.activemq.artemis.core.server] #*#*# Finished test: testWhiteBlackListAnonymousObject()...
[main] 20:28:59,740 INFO  [org.apache.activemq.artemis.core.server] #*#*# Starting test: testWhiteBlackListLocalObject()...
#test testWhiteBlackListLocalObject
[main] 20:28:59,764 INFO  [org.apache.activemq.artemis.core.server] #*#*# Finished test: testWhiteBlackListLocalObject()...
[main] 20:28:59,767 INFO  [org.apache.activemq.artemis.core.server] #*#*# Starting test: testWhiteBlackListSystemProperty()...
#test testWhiteBlackListSystemProperty
[main] 20:28:59,771 INFO  [org.apache.activemq.artemis.core.server] #*#*# Finished test: testWhiteBlackListSystemProperty()...
[main] 20:28:59,771 INFO  [org.apache.activemq.artemis.core.server] #*#*# Starting test: testClassLoaderIsolation()...
#test testClassLoaderIsolation
[main] 20:28:59,788 INFO  [org.apache.activemq.artemis.core.server] #*#*# Finished test: testClassLoaderIsolation()...
[main] 20:28:59,788 INFO  [org.apache.activemq.artemis.core.server] #*#*# Starting test: testWhiteBlackList()...
#test testWhiteBlackList
[main] 20:28:59,797 INFO  [org.apache.activemq.artemis.core.server] #*#*# Finished test: testWhiteBlackList()...
[main] 20:28:59,797 INFO  [org.apache.activemq.artemis.core.server] #*#*# Starting test: testWhiteBlackListAgainstListMapObject()...
#test testWhiteBlackListAgainstListMapObject
[main] 20:28:59,815 INFO  [org.apache.activemq.artemis.core.server] #*#*# Finished test: testWhiteBlackListAgainstListMapObject()...
Tests run: 9, Failures: 0, Errors: 0, Skipped: 0, Time elapsed: 0.168 sec - in org.apache.activemq.artemis.tests.unit.util.ObjectInputStreamWithClassLoaderTest
Running org.apache.activemq.artemis.tests.unit.util.ReusableLatchTest
[main] 20:28:59,817 INFO  [org.apache.activemq.artemis.core.server] #*#*# Starting test: testLatchWithParameterizedDown()...
#test testLatchWithParameterizedDown
[main] 20:28:59,821 INFO  [org.apache.activemq.artemis.core.server] #*#*# Finished test: testLatchWithParameterizedDown()...
[main] 20:28:59,821 INFO  [org.apache.activemq.artemis.core.server] #*#*# Starting test: testLatchOnSingleThread()...
#test testLatchOnSingleThread
[main] 20:28:59,825 INFO  [org.apache.activemq.artemis.core.server] #*#*# Finished test: testLatchOnSingleThread()...
[main] 20:28:59,827 INFO  [org.apache.activemq.artemis.core.server] #*#*# Starting test: testReuseLatch()...
#test testReuseLatch
[main] 20:28:59,832 INFO  [org.apache.activemq.artemis.core.server] #*#*# Finished test: testReuseLatch()...
[main] 20:28:59,833 INFO  [org.apache.activemq.artemis.core.server] #*#*# Starting test: testLatchOnMultiThread()...
#test testLatchOnMultiThread
[main] 20:29:00,049 INFO  [org.apache.activemq.artemis.core.server] #*#*# Finished test: testLatchOnMultiThread()...
Tests run: 4, Failures: 0, Errors: 0, Skipped: 0, Time elapsed: 0.233 sec - in org.apache.activemq.artemis.tests.unit.util.ReusableLatchTest
Running org.apache.activemq.artemis.tests.unit.util.SoftValueMapTest
[main] 20:29:00,050 INFO  [org.apache.activemq.artemis.core.server] #*#*# Starting test: testEvictionsLeastUsed()...
#test testEvictionsLeastUsed
[main] 20:29:00,052 INFO  [org.apache.activemq.artemis.utils.ThreadLeakCheckRule] #test forceGC
[main] 20:29:00,159 INFO  [org.apache.activemq.artemis.utils.ThreadLeakCheckRule] #test forceGC
Done 
SoftCache.size 200
Soft cache has 200 elements
[main] 20:29:00,166 INFO  [org.apache.activemq.artemis.core.server] #*#*# Finished test: testEvictionsLeastUsed()...
[main] 20:29:00,166 INFO  [org.apache.activemq.artemis.core.server] #*#*# Starting test: testEvictions()...
#test testEvictions
[main] 20:29:00,168 INFO  [org.apache.activemq.artemis.utils.ThreadLeakCheckRule] #test forceGC
[main] 20:29:00,212 INFO  [org.apache.activemq.artemis.utils.ThreadLeakCheckRule] #test forceGC
Done 
SUREFIRE-859: Java HotSpot(TM) 64-Bit Server VM warning: INFO: os::commit_memory(0x0000000729f00000,
740818944, 0) failed; error='Cannot allocate memory' (errno=12)
#
# There is insufficient memory for the Java Runtime Environment to continue.
# Native memory allocation (mmap) failed to map 740818944 bytes for committing reserved memory.
# An error report file with more information is saved as:
# <https://builds.apache.org/job/ActiveMQ-Artemis-Master/ws/tests/unit-tests/hs_err_pid16970.log>

Results :

Tests run: 601, Failures: 0, Errors: 0, Skipped: 0

[INFO] ------------------------------------------------------------------------
[INFO] Reactor Summary:
[INFO] 
[INFO] ActiveMQ Artemis Parent ............................ SUCCESS [ 12.767 s]
[INFO] ActiveMQ Artemis Commons ........................... SUCCESS [ 17.382 s]
[INFO] ActiveMQ Artemis Core Client ....................... SUCCESS [ 14.055 s]
[INFO] ActiveMQ Artemis Selector Implementation ........... SUCCESS [  5.970 s]
[INFO] ActiveMQ Artemis JMS Client ........................ SUCCESS [  7.051 s]
[INFO] ActiveMQ Artemis Native POM ........................ SUCCESS [  6.720 s]
[INFO] ActiveMQ Artemis Journal ........................... SUCCESS [  5.273 s]
[INFO] ActiveMQ Artemis JDBC Store ........................ SUCCESS [ 11.162 s]
[INFO] ActiveMQ Artemis Server ............................ SUCCESS [ 55.602 s]
[INFO] ActiveMQ Artemis Protocols ......................... SUCCESS [  1.074 s]
[INFO] ActiveMQ Artemis AMQP Protocol ..................... SUCCESS [  8.286 s]
[INFO] ActiveMQ Artemis STOMP Protocol .................... SUCCESS [  4.115 s]
[INFO] ActiveMQ Artemis OpenWire Protocol ................. SUCCESS [  4.845 s]
[INFO] ActiveMQ Artemis HQClient Protocol ................. SUCCESS [  3.254 s]
[INFO] ActiveMQ Artemis HornetQ Protocol .................. SUCCESS [  2.009 s]
[INFO] ActiveMQ Artemis MQTT Protocol ..................... SUCCESS [  3.643 s]
[INFO] ActiveMQ Artemis DTO ............................... SUCCESS [  6.889 s]
[INFO] ActiveMQ Artemis Service Extensions ................ SUCCESS [  4.608 s]
[INFO] ActiveMQ Artemis JMS Server ........................ SUCCESS [  4.501 s]
[INFO] ActiveMQ Artemis CDI Integration ................... SUCCESS [ 10.735 s]
[INFO] ActiveMQ Artemis Boot .............................. SUCCESS [  2.003 s]
[INFO] ActiveMQ Artemis CLI ............................... SUCCESS [ 44.768 s]
[INFO] ActiveMQ Artemis Web ............................... SUCCESS [ 10.125 s]
[INFO] ActiveMQ Artemis Web ............................... SUCCESS [  2.337 s]
[INFO] ActiveMQ Artemis JUnit Rules ....................... SUCCESS [ 17.496 s]
[INFO] ActiveMQ Artemis RAR POM ........................... SUCCESS [  7.706 s]
[INFO] ActiveMQ Artemis REST Interface Implementation ..... SUCCESS [01:34 min]
[INFO] ActiveMQ Artemis Maven Plugin ...................... SUCCESS [  9.429 s]
[INFO] ActiveMQ Artemis Server OSGi ....................... SUCCESS [  5.396 s]
[INFO] ActiveMQ Artemis Spring Integration ................ SUCCESS [  3.496 s]
[INFO] ActiveMQ Artemis Aerogear Integration .............. SUCCESS [  2.876 s]
[INFO] ActiveMQ Artemis Vert.x Integration ................ SUCCESS [  4.024 s]
[INFO] Apache ActiveMQ Artemis Distribution ............... SUCCESS [  4.528 s]
[INFO] ActiveMQ Artemis Tests POM ......................... SUCCESS [  4.933 s]
[INFO] ActiveMQ Artemis Unit Tests ........................ FAILURE [02:20 min]
[INFO] ActiveMQ Artemis Joram Tests ....................... SKIPPED
[INFO] ActiveMQ Artemis timing Tests ...................... SKIPPED
[INFO] ActiveMQ Artemis JMS Tests ......................... SKIPPED
[INFO] ActiveMQ Artemis Features .......................... SKIPPED
[INFO] ActiveMQ Artemis Test Support ...................... SKIPPED
[INFO] ActiveMQ Artemis Integration Tests ................. SKIPPED
[INFO] ActiveMQ Artemis soak Tests ........................ SKIPPED
[INFO] ActiveMQ Artemis stress Tests ...................... SKIPPED
[INFO] ActiveMQ Artemis performance Tests ................. SKIPPED
[INFO] ActiveMQ Artemis Extra Tests ....................... SKIPPED
[INFO] ------------------------------------------------------------------------
[INFO] BUILD FAILURE
[INFO] ------------------------------------------------------------------------
[INFO] Total time: 09:08 min
[INFO] Finished at: 2016-11-03T20:29:02+00:00
[INFO] Final Memory: 220M/1714M
[INFO] ------------------------------------------------------------------------
[ERROR] Failed to execute goal org.apache.maven.plugins:maven-surefire-plugin:2.18.1:test
(default-test) on project unit-tests: Execution default-test of goal org.apache.maven.plugins:maven-surefire-plugin:2.18.1:test
failed: The forked VM terminated without properly saying goodbye. VM crash or System.exit
called?
[ERROR] Command was /bin/sh -c cd <https://builds.apache.org/job/ActiveMQ-Artemis-Master/ws/tests/unit-tests>
&& /usr/local/asfpackages/java/jdk1.8.0_102/jre/bin/java -Djava.util.logging.manager=org.jboss.logmanager.LogManager
-Dlogging.configuration=<https://builds.apache.org/job/ActiveMQ-Artemis-Master/ws/tests/unit-tests/../../tests/config/logging.properties>
-Djava.library.path=<https://builds.apache.org/job/ActiveMQ-Artemis-Master/ws/tests/unit-tests/../../artemis-native/bin>
-Djgroups.bind_addr=localhost -Dorg.apache.activemq.artemis.api.core.UDPBroadcastEndpointFactory.localBindAddress=localhost
-Djava.net.preferIPv4Stack=true -jar <https://builds.apache.org/job/ActiveMQ-Artemis-Master/ws/tests/unit-tests/target/surefire/surefirebooter3291239639641678703.jar>
<https://builds.apache.org/job/ActiveMQ-Artemis-Master/ws/tests/unit-tests/target/surefire/surefire4689550975509604600tmp>
<https://builds.apache.org/job/ActiveMQ-Artemis-Master/ws/tests/unit-tests/target/surefire/surefire_166012219902860426905tmp>
[ERROR] -> [Help 1]
[ERROR] 
[ERROR] To see the full stack trace of the errors, re-run Maven with the -e switch.
[ERROR] Re-run Maven using the -X switch to enable full debug logging.
[ERROR] 
[ERROR] For more information about the errors and possible solutions, please read the following
articles:
[ERROR] [Help 1] http://cwiki.apache.org/confluence/display/MAVEN/PluginExecutionException
[ERROR] 
[ERROR] After correcting the problems, you can resume the build with the command
[ERROR]   mvn <goals> -rf :unit-tests
Build step 'Invoke top-level Maven targets' marked build as failure
Performing Post build task...
Could not match :Too many files with unapproved license  : False
Logical operation result is FALSE
Skipping script  : cat ratReport.txt
END OF POST BUILD TASK 	: 0
Recording test results

Mime
View raw message