activemq-commits mailing list archives

Site index · List index
Message view « Date » · « Thread »
Top « Date » · « Thread »
From Apache Jenkins Server <jenk...@builds.apache.org>
Subject Build failed in Jenkins: ActiveMQ-Java7-All-UnitTests #542
Date Sat, 08 Oct 2016 08:12:36 GMT
See <https://builds.apache.org/job/ActiveMQ-Java7-All-UnitTests/542/changes>

Changes:

[gtully] AMQ-6454 - ensure message.acknowledge throws if consumer has closed and

[gtully] AMQ-6459 - store based % usage needs to poll the store for the current

[gtully] NO-JIRA - ensure stack trace in incuded with exception that terminates

[tabish121] https://issues.apache.org/jira/browse/AMQ-6460

------------------------------------------
[...truncated 2167 lines...]
Tests run: 1, Failures: 0, Errors: 0, Skipped: 0, Time elapsed: 1.412 sec - in org.apache.activemq.broker.util.TraceBrokerPathPluginTest
Running org.apache.activemq.broker.virtual.CompositeQueueTest
Tests run: 1, Failures: 0, Errors: 0, Skipped: 0, Time elapsed: 2.324 sec - in org.apache.activemq.broker.virtual.CompositeQueueTest
Running org.apache.activemq.broker.virtual.CompositeTopicTest
Tests run: 1, Failures: 0, Errors: 0, Skipped: 0, Time elapsed: 3.164 sec - in org.apache.activemq.broker.virtual.CompositeTopicTest
Running org.apache.activemq.broker.virtual.CustomVirtualTopicInterceptorTest
Tests run: 1, Failures: 0, Errors: 0, Skipped: 0, Time elapsed: 4.344 sec - in org.apache.activemq.broker.virtual.CustomVirtualTopicInterceptorTest
Running org.apache.activemq.broker.virtual.CustomVirtualTopicInterceptorWithLeadingWildcardTest
Tests run: 1, Failures: 0, Errors: 0, Skipped: 0, Time elapsed: 1.378 sec - in org.apache.activemq.broker.virtual.CustomVirtualTopicInterceptorWithLeadingWildcardTest
Running org.apache.activemq.broker.virtual.DestinationInterceptorDurableSubTest
Tests run: 1, Failures: 0, Errors: 0, Skipped: 0, Time elapsed: 2.389 sec - in org.apache.activemq.broker.virtual.DestinationInterceptorDurableSubTest
Running org.apache.activemq.broker.virtual.FilteredQueueTest
Tests run: 1, Failures: 0, Errors: 0, Skipped: 0, Time elapsed: 2.618 sec - in org.apache.activemq.broker.virtual.FilteredQueueTest
Running org.apache.activemq.broker.virtual.MessageDestinationVirtualTopicTest
Tests run: 1, Failures: 0, Errors: 0, Skipped: 0, Time elapsed: 4.471 sec - in org.apache.activemq.broker.virtual.MessageDestinationVirtualTopicTest
Running org.apache.activemq.broker.virtual.MirroredQueueCorrectMemoryUsageTest
Tests run: 1, Failures: 0, Errors: 0, Skipped: 0, Time elapsed: 14.158 sec - in org.apache.activemq.broker.virtual.MirroredQueueCorrectMemoryUsageTest
Running org.apache.activemq.broker.virtual.MirroredQueueTest
Tests run: 2, Failures: 0, Errors: 0, Skipped: 0, Time elapsed: 1.401 sec - in org.apache.activemq.broker.virtual.MirroredQueueTest
Running org.apache.activemq.broker.virtual.MirroredQueueUsingVirtualTopicQueueTest
Tests run: 2, Failures: 0, Errors: 0, Skipped: 0, Time elapsed: 1.511 sec - in org.apache.activemq.broker.virtual.MirroredQueueUsingVirtualTopicQueueTest
Running org.apache.activemq.broker.virtual.MultipleCompositeToPhysicalQueueTest
Tests run: 1, Failures: 0, Errors: 0, Skipped: 0, Time elapsed: 1.48 sec - in org.apache.activemq.broker.virtual.MultipleCompositeToPhysicalQueueTest
Running org.apache.activemq.broker.virtual.VirtualDestPerfTest
Tests run: 2, Failures: 0, Errors: 0, Skipped: 2, Time elapsed: 0.131 sec - in org.apache.activemq.broker.virtual.VirtualDestPerfTest
Running org.apache.activemq.broker.virtual.VirtualTopicDLQTest
Tests run: 1, Failures: 0, Errors: 0, Skipped: 0, Time elapsed: 8.627 sec - in org.apache.activemq.broker.virtual.VirtualTopicDLQTest
Running org.apache.activemq.broker.virtual.VirtualTopicDisconnectSelectorTest
Tests run: 2, Failures: 0, Errors: 0, Skipped: 0, Time elapsed: 6.767 sec - in org.apache.activemq.broker.virtual.VirtualTopicDisconnectSelectorTest
Running org.apache.activemq.broker.virtual.VirtualTopicFanoutPerfTest
Tests run: 1, Failures: 0, Errors: 0, Skipped: 1, Time elapsed: 0.119 sec - in org.apache.activemq.broker.virtual.VirtualTopicFanoutPerfTest
Running org.apache.activemq.broker.virtual.VirtualTopicPubSubTest
Tests run: 2, Failures: 0, Errors: 0, Skipped: 0, Time elapsed: 1.607 sec - in org.apache.activemq.broker.virtual.VirtualTopicPubSubTest
Running org.apache.activemq.broker.virtual.VirtualTopicPubSubUsingXBeanTest
Tests run: 2, Failures: 0, Errors: 0, Skipped: 0, Time elapsed: 1.577 sec - in org.apache.activemq.broker.virtual.VirtualTopicPubSubUsingXBeanTest
Running org.apache.activemq.broker.virtual.VirtualTopicSelectorTest
Tests run: 1, Failures: 0, Errors: 0, Skipped: 0, Time elapsed: 1.385 sec - in org.apache.activemq.broker.virtual.VirtualTopicSelectorTest
Running org.apache.activemq.broker.virtual.VirtualTopicsAndDurableSubsTest
Tests run: 32, Failures: 0, Errors: 0, Skipped: 0, Time elapsed: 28.18 sec - in org.apache.activemq.broker.virtual.VirtualTopicsAndDurableSubsTest
Running org.apache.activemq.bugs.AMQ1687Test
Tests run: 1, Failures: 0, Errors: 0, Skipped: 0, Time elapsed: 1.672 sec - in org.apache.activemq.bugs.AMQ1687Test
Running org.apache.activemq.bugs.AMQ1853Test
Tests run: 1, Failures: 0, Errors: 0, Skipped: 0, Time elapsed: 7.92 sec - in org.apache.activemq.bugs.AMQ1853Test
Running org.apache.activemq.bugs.AMQ1893Test
Tests run: 1, Failures: 0, Errors: 0, Skipped: 0, Time elapsed: 31.659 sec - in org.apache.activemq.bugs.AMQ1893Test
Running org.apache.activemq.bugs.AMQ1917Test
Tests run: 1, Failures: 0, Errors: 0, Skipped: 0, Time elapsed: 8.073 sec - in org.apache.activemq.bugs.AMQ1917Test
Running org.apache.activemq.bugs.AMQ1936Test
Tests run: 1, Failures: 0, Errors: 0, Skipped: 0, Time elapsed: 41.467 sec - in org.apache.activemq.bugs.AMQ1936Test
Running org.apache.activemq.bugs.AMQ2021Test
Tests run: 1, Failures: 0, Errors: 0, Skipped: 0, Time elapsed: 4.825 sec - in org.apache.activemq.bugs.AMQ2021Test
Running org.apache.activemq.bugs.AMQ2084Test
Tests run: 2, Failures: 0, Errors: 0, Skipped: 0, Time elapsed: 6.853 sec - in org.apache.activemq.bugs.AMQ2084Test
Running org.apache.activemq.bugs.AMQ2103Test
Tests run: 2, Failures: 0, Errors: 0, Skipped: 0, Time elapsed: 1.414 sec - in org.apache.activemq.bugs.AMQ2103Test
Running org.apache.activemq.bugs.AMQ2149LevelDBTest
Tests run: 4, Failures: 0, Errors: 0, Skipped: 0, Time elapsed: 153.777 sec - in org.apache.activemq.bugs.AMQ2149LevelDBTest
Running org.apache.activemq.bugs.AMQ2149Test
Running org.apache.activemq.bugs.AMQ2171Test
Tests run: 2, Failures: 0, Errors: 0, Skipped: 0, Time elapsed: 2.719 sec - in org.apache.activemq.bugs.AMQ2171Test
Running org.apache.activemq.bugs.AMQ2174Test
Tests run: 1, Failures: 0, Errors: 0, Skipped: 0, Time elapsed: 2.331 sec - in org.apache.activemq.bugs.AMQ2174Test
Running org.apache.activemq.bugs.AMQ2200Test
Tests run: 1, Failures: 0, Errors: 0, Skipped: 0, Time elapsed: 2.787 sec - in org.apache.activemq.bugs.AMQ2200Test
Running org.apache.activemq.bugs.AMQ2213Test
Tests run: 3, Failures: 0, Errors: 0, Skipped: 0, Time elapsed: 2.546 sec - in org.apache.activemq.bugs.AMQ2213Test
Running org.apache.activemq.bugs.AMQ2314Test
Tests run: 2, Failures: 0, Errors: 0, Skipped: 0, Time elapsed: 102.118 sec - in org.apache.activemq.bugs.AMQ2314Test
Running org.apache.activemq.bugs.AMQ2356Test
Tests run: 1, Failures: 0, Errors: 0, Skipped: 0, Time elapsed: 14.412 sec - in org.apache.activemq.bugs.AMQ2356Test
Running org.apache.activemq.bugs.AMQ2364Test
Tests run: 1, Failures: 0, Errors: 0, Skipped: 0, Time elapsed: 4.749 sec - in org.apache.activemq.bugs.AMQ2364Test
Running org.apache.activemq.bugs.AMQ2383Test
Tests run: 1, Failures: 0, Errors: 0, Skipped: 0, Time elapsed: 1.1 sec - in org.apache.activemq.bugs.AMQ2383Test
Running org.apache.activemq.bugs.AMQ2401Test
Tests run: 1, Failures: 0, Errors: 0, Skipped: 0, Time elapsed: 2.992 sec - in org.apache.activemq.bugs.AMQ2401Test
Running org.apache.activemq.bugs.AMQ2413Test
Tests run: 8, Failures: 0, Errors: 0, Skipped: 0, Time elapsed: 15.279 sec - in org.apache.activemq.bugs.AMQ2413Test
Running org.apache.activemq.bugs.AMQ2439Test
Tests run: 1, Failures: 0, Errors: 0, Skipped: 0, Time elapsed: 7.113 sec - in org.apache.activemq.bugs.AMQ2439Test
Running org.apache.activemq.bugs.AMQ2489Test
Tests run: 2, Failures: 0, Errors: 0, Skipped: 0, Time elapsed: 5.381 sec - in org.apache.activemq.bugs.AMQ2489Test
Running org.apache.activemq.bugs.AMQ2512Test

Results :

Tests run: 1756, Failures: 0, Errors: 0, Skipped: 29

[JENKINS] Recording test results
[INFO] ------------------------------------------------------------------------
[INFO] Reactor Summary:
[INFO] 
[INFO] ActiveMQ ........................................... SUCCESS [  4.811 s]
[INFO] ActiveMQ :: Client ................................. SUCCESS [03:24 min]
[INFO] ActiveMQ :: Openwire Legacy Support ................ SUCCESS [  5.225 s]
[INFO] ActiveMQ :: JAAS ................................... SUCCESS [ 22.300 s]
[INFO] ActiveMQ :: Broker ................................. SUCCESS [01:32 min]
[INFO] ActiveMQ :: KahaDB Store ........................... SUCCESS [02:31 min]
[INFO] ActiveMQ :: STOMP Protocol ......................... SUCCESS [13:29 min]
[INFO] ActiveMQ :: MQTT Protocol .......................... SUCCESS [23:24 min]
[INFO] ActiveMQ :: JDBC Store ............................. SUCCESS [  3.805 s]
[INFO] ActiveMQ :: LevelDB Store .......................... SUCCESS [06:11 min]
[INFO] ActiveMQ :: Generic JMS Pool ....................... SUCCESS [ 43.570 s]
[INFO] ActiveMQ :: Pool ................................... SUCCESS [  5.220 s]
[INFO] ActiveMQ :: RA ..................................... SUCCESS [02:39 min]
[INFO] ActiveMQ :: Spring ................................. SUCCESS [01:09 min]
[INFO] ActiveMQ :: Console ................................ SUCCESS [  7.349 s]
[INFO] ActiveMQ :: Partition Management ................... SUCCESS [ 20.342 s]
[INFO] ActiveMQ :: Runtime Configuration .................. SUCCESS [09:02 min]
[INFO] ActiveMQ :: Tooling ................................ SUCCESS [  0.857 s]
[INFO] ActiveMQ :: JUnit Rule ............................. SUCCESS [  5.846 s]
[INFO] ActiveMQ :: Unit Tests ............................. FAILURE [  01:50 h]
[INFO] ------------------------------------------------------------------------
[INFO] BUILD FAILURE
[INFO] ------------------------------------------------------------------------
[INFO] Total time: 02:56 h
[INFO] Finished at: 2016-10-08T08:12:22+00:00
[INFO] Final Memory: 112M/999M
[INFO] ------------------------------------------------------------------------
Waiting for Jenkins to finish collecting data[ERROR] Failed to execute goal org.apache.maven.plugins:maven-surefire-plugin:2.16:test
(default-test) on project activemq-unit-tests: ExecutionException; nested exception is java.util.concurrent.ExecutionException:
java.lang.RuntimeException: org.apache.maven.surefire.util.NestedRuntimeException: null; nested
exception is java.io.IOException: No space left on device -> [Help 1]
org.apache.maven.lifecycle.LifecycleExecutionException: Failed to execute goal org.apache.maven.plugins:maven-surefire-plugin:2.16:test
(default-test) on project activemq-unit-tests: ExecutionException; nested exception is java.util.concurrent.ExecutionException:
java.lang.RuntimeException: org.apache.maven.surefire.util.NestedRuntimeException: null; nested
exception is java.io.IOException: No space left on device
	at org.apache.maven.lifecycle.internal.MojoExecutor.execute(MojoExecutor.java:212)
	at org.apache.maven.lifecycle.internal.MojoExecutor.execute(MojoExecutor.java:153)
	at org.apache.maven.lifecycle.internal.MojoExecutor.execute(MojoExecutor.java:145)
	at org.apache.maven.lifecycle.internal.LifecycleModuleBuilder.buildProject(LifecycleModuleBuilder.java:116)
	at org.apache.maven.lifecycle.internal.LifecycleModuleBuilder.buildProject(LifecycleModuleBuilder.java:80)
	at org.apache.maven.lifecycle.internal.builder.singlethreaded.SingleThreadedBuilder.build(SingleThreadedBuilder.java:51)
	at org.apache.maven.lifecycle.internal.LifecycleStarter.execute(LifecycleStarter.java:128)
	at org.apache.maven.DefaultMaven.doExecute(DefaultMaven.java:307)
	at org.apache.maven.DefaultMaven.doExecute(DefaultMaven.java:193)
	at org.apache.maven.DefaultMaven.execute(DefaultMaven.java:106)
	at org.jvnet.hudson.maven3.launcher.Maven32Launcher.main(Maven32Launcher.java:132)
	at sun.reflect.NativeMethodAccessorImpl.invoke0(Native Method)
	at sun.reflect.NativeMethodAccessorImpl.invoke(NativeMethodAccessorImpl.java:57)
	at sun.reflect.DelegatingMethodAccessorImpl.invoke(DelegatingMethodAccessorImpl.java:43)
	at java.lang.reflect.Method.invoke(Method.java:606)
	at org.codehaus.plexus.classworlds.launcher.Launcher.launchStandard(Launcher.java:330)
	at org.codehaus.plexus.classworlds.launcher.Launcher.launch(Launcher.java:238)
	at jenkins.maven3.agent.Maven32Main.launch(Maven32Main.java:186)
	at sun.reflect.NativeMethodAccessorImpl.invoke0(Native Method)
	at sun.reflect.NativeMethodAccessorImpl.invoke(NativeMethodAccessorImpl.java:57)
	at sun.reflect.DelegatingMethodAccessorImpl.invoke(DelegatingMethodAccessorImpl.java:43)
	at java.lang.reflect.Method.invoke(Method.java:606)
	at hudson.maven.Maven3Builder.call(Maven3Builder.java:136)
	at hudson.maven.Maven3Builder.call(Maven3Builder.java:71)
	at hudson.remoting.UserRequest.perform(UserRequest.java:153)
	at hudson.remoting.UserRequest.perform(UserRequest.java:50)
	at hudson.remoting.Request$2.run(Request.java:332)
	at hudson.remoting.InterceptingExecutorService$1.call(InterceptingExecutorService.java:68)
	at java.util.concurrent.FutureTask.run(FutureTask.java:262)
	at java.util.concurrent.ThreadPoolExecutor.runWorker(ThreadPoolExecutor.java:1145)
	at java.util.concurrent.ThreadPoolExecutor$Worker.run(ThreadPoolExecutor.java:615)
	at java.lang.Thread.run(Thread.java:745)
Caused by: org.apache.maven.plugin.MojoFailureException: ExecutionException; nested exception
is java.util.concurrent.ExecutionException: java.lang.RuntimeException: org.apache.maven.surefire.util.NestedRuntimeException:
null; nested exception is java.io.IOException: No space left on device
	at org.apache.maven.plugin.surefire.SurefirePlugin.assertNoException(SurefirePlugin.java:198)
	at org.apache.maven.plugin.surefire.SurefirePlugin.handleSummary(SurefirePlugin.java:188)
	at org.apache.maven.plugin.surefire.AbstractSurefireMojo.executeAfterPreconditionsChecked(AbstractSurefireMojo.java:852)
	at org.apache.maven.plugin.surefire.AbstractSurefireMojo.execute(AbstractSurefireMojo.java:720)
	at org.apache.maven.plugin.DefaultBuildPluginManager.executeMojo(DefaultBuildPluginManager.java:134)
	at org.apache.maven.lifecycle.internal.MojoExecutor.execute(MojoExecutor.java:207)
	... 31 more
Caused by: org.apache.maven.surefire.booter.SurefireBooterForkException: ExecutionException;
nested exception is java.util.concurrent.ExecutionException: java.lang.RuntimeException: org.apache.maven.surefire.util.NestedRuntimeException:
null; nested exception is java.io.IOException: No space left on device
	at org.apache.maven.plugin.surefire.booterclient.ForkStarter.runSuitesForkPerTestSet(ForkStarter.java:316)
	at org.apache.maven.plugin.surefire.booterclient.ForkStarter.run(ForkStarter.java:169)
	at org.apache.maven.plugin.surefire.AbstractSurefireMojo.executeProvider(AbstractSurefireMojo.java:958)
	at org.apache.maven.plugin.surefire.AbstractSurefireMojo.executeAfterPreconditionsChecked(AbstractSurefireMojo.java:822)
	... 34 more
Caused by: java.util.concurrent.ExecutionException: java.lang.RuntimeException: org.apache.maven.surefire.util.NestedRuntimeException:
null; nested exception is java.io.IOException: No space left on device
	at java.util.concurrent.FutureTask.report(FutureTask.java:122)
	at java.util.concurrent.FutureTask.get(FutureTask.java:188)
	at org.apache.maven.plugin.surefire.booterclient.ForkStarter.runSuitesForkPerTestSet(ForkStarter.java:300)
	... 37 more
Caused by: java.lang.RuntimeException: org.apache.maven.surefire.util.NestedRuntimeException:
null; nested exception is java.io.IOException: No space left on device
	at org.apache.maven.plugin.surefire.booterclient.output.ThreadedStreamConsumer.close(ThreadedStreamConsumer.java:123)
	at org.apache.maven.plugin.surefire.booterclient.ForkStarter.fork(ForkStarter.java:463)
	at org.apache.maven.plugin.surefire.booterclient.ForkStarter.fork(ForkStarter.java:352)
	at org.apache.maven.plugin.surefire.booterclient.ForkStarter.access$300(ForkStarter.java:85)
	at org.apache.maven.plugin.surefire.booterclient.ForkStarter$2.call(ForkStarter.java:288)
	at org.apache.maven.plugin.surefire.booterclient.ForkStarter$2.call(ForkStarter.java:283)
	... 4 more
Caused by: org.apache.maven.surefire.util.NestedRuntimeException: null; nested exception is
java.io.IOException: No space left on device
	at org.apache.maven.plugin.surefire.report.ConsoleOutputFileReporter.writeTestOutput(ConsoleOutputFileReporter.java:102)
	at org.apache.maven.plugin.surefire.report.TestSetRunListener.writeTestOutput(TestSetRunListener.java:110)
	at org.apache.maven.plugin.surefire.booterclient.output.ForkClient.consumeLine(ForkClient.java:140)
	at org.apache.maven.plugin.surefire.booterclient.output.ThreadedStreamConsumer$Pumper.run(ThreadedStreamConsumer.java:67)
	... 1 more
Caused by: java.io.IOException: No space left on device
	at java.io.FileOutputStream.writeBytes(Native Method)
	at java.io.FileOutputStream.write(FileOutputStream.java:345)
	at org.apache.maven.plugin.surefire.report.ConsoleOutputFileReporter.writeTestOutput(ConsoleOutputFileReporter.java:98)
	... 4 more
[ERROR] 
[ERROR] Re-run Maven using the -X switch to enable full debug logging.
[ERROR] 
[ERROR] For more information about the errors and possible solutions, please read the following
articles:
[ERROR] [Help 1] http://cwiki.apache.org/confluence/display/MAVEN/MojoFailureException
[ERROR] 
[ERROR] After correcting the problems, you can resume the build with the command
[ERROR]   mvn <goals> -rf :activemq-unit-tests

[JENKINS] Archiving <https://builds.apache.org/job/ActiveMQ-Java7-All-UnitTests/ws/activemq-kahadb-store/pom.xml>
to org.apache.activemq/activemq-kahadb-store/5.15.0-SNAPSHOT/activemq-kahadb-store-5.15.0-SNAPSHOT.pom
[JENKINS] Archiving <https://builds.apache.org/job/ActiveMQ-Java7-All-UnitTests/ws/activemq-kahadb-store/target/activemq-kahadb-store-5.15.0-SNAPSHOT.jar>
to org.apache.activemq/activemq-kahadb-store/5.15.0-SNAPSHOT/activemq-kahadb-store-5.15.0-SNAPSHOT.jar
[JENKINS] Archiving <https://builds.apache.org/job/ActiveMQ-Java7-All-UnitTests/ws/activemq-unit-tests/pom.xml>
to org.apache.activemq/activemq-unit-tests/5.15.0-SNAPSHOT/activemq-unit-tests-5.15.0-SNAPSHOT.pom
Compressed 71.40 KB of artifacts by 89.6% relative to #541
[JENKINS] Archiving <https://builds.apache.org/job/ActiveMQ-Java7-All-UnitTests/ws/activemq-openwire-legacy/pom.xml>
to org.apache.activemq/activemq-openwire-legacy/5.15.0-SNAPSHOT/activemq-openwire-legacy-5.15.0-SNAPSHOT.pom
[JENKINS] Archiving <https://builds.apache.org/job/ActiveMQ-Java7-All-UnitTests/ws/activemq-openwire-legacy/target/activemq-openwire-legacy-5.15.0-SNAPSHOT.jar>
to org.apache.activemq/activemq-openwire-legacy/5.15.0-SNAPSHOT/activemq-openwire-legacy-5.15.0-SNAPSHOT.jar
[JENKINS] Archiving <https://builds.apache.org/job/ActiveMQ-Java7-All-UnitTests/ws/activemq-client/pom.xml>
to org.apache.activemq/activemq-client/5.15.0-SNAPSHOT/activemq-client-5.15.0-SNAPSHOT.pom
[JENKINS] Archiving <https://builds.apache.org/job/ActiveMQ-Java7-All-UnitTests/ws/activemq-client/target/activemq-client-5.15.0-SNAPSHOT.jar>
to org.apache.activemq/activemq-client/5.15.0-SNAPSHOT/activemq-client-5.15.0-SNAPSHOT.jar
[JENKINS] Archiving <https://builds.apache.org/job/ActiveMQ-Java7-All-UnitTests/ws/activemq-tooling/activemq-junit/pom.xml>
to org.apache.activemq.tooling/activemq-junit/5.15.0-SNAPSHOT/activemq-junit-5.15.0-SNAPSHOT.pom
[JENKINS] Archiving <https://builds.apache.org/job/ActiveMQ-Java7-All-UnitTests/ws/activemq-tooling/activemq-junit/target/activemq-junit-5.15.0-SNAPSHOT.jar>
to org.apache.activemq.tooling/activemq-junit/5.15.0-SNAPSHOT/activemq-junit-5.15.0-SNAPSHOT.jar
[JENKINS] Archiving <https://builds.apache.org/job/ActiveMQ-Java7-All-UnitTests/ws/activemq-tooling/pom.xml>
to org.apache.activemq.tooling/activemq-tooling/5.15.0-SNAPSHOT/activemq-tooling-5.15.0-SNAPSHOT.pom
[JENKINS] Archiving <https://builds.apache.org/job/ActiveMQ-Java7-All-UnitTests/ws/activemq-jms-pool/pom.xml>
to org.apache.activemq/activemq-jms-pool/5.15.0-SNAPSHOT/activemq-jms-pool-5.15.0-SNAPSHOT.pom
[JENKINS] Archiving <https://builds.apache.org/job/ActiveMQ-Java7-All-UnitTests/ws/activemq-jms-pool/target/activemq-jms-pool-5.15.0-SNAPSHOT.jar>
to org.apache.activemq/activemq-jms-pool/5.15.0-SNAPSHOT/activemq-jms-pool-5.15.0-SNAPSHOT.jar
[JENKINS] Archiving <https://builds.apache.org/job/ActiveMQ-Java7-All-UnitTests/ws/activemq-pool/pom.xml>
to org.apache.activemq/activemq-pool/5.15.0-SNAPSHOT/activemq-pool-5.15.0-SNAPSHOT.pom
[JENKINS] Archiving <https://builds.apache.org/job/ActiveMQ-Java7-All-UnitTests/ws/activemq-pool/target/activemq-pool-5.15.0-SNAPSHOT.jar>
to org.apache.activemq/activemq-pool/5.15.0-SNAPSHOT/activemq-pool-5.15.0-SNAPSHOT.jar
[JENKINS] Archiving <https://builds.apache.org/job/ActiveMQ-Java7-All-UnitTests/ws/activemq-jdbc-store/pom.xml>
to org.apache.activemq/activemq-jdbc-store/5.15.0-SNAPSHOT/activemq-jdbc-store-5.15.0-SNAPSHOT.pom
[JENKINS] Archiving <https://builds.apache.org/job/ActiveMQ-Java7-All-UnitTests/ws/activemq-jdbc-store/target/activemq-jdbc-store-5.15.0-SNAPSHOT.jar>
to org.apache.activemq/activemq-jdbc-store/5.15.0-SNAPSHOT/activemq-jdbc-store-5.15.0-SNAPSHOT.jar
[JENKINS] Archiving <https://builds.apache.org/job/ActiveMQ-Java7-All-UnitTests/ws/activemq-runtime-config/pom.xml>
to org.apache.activemq/activemq-runtime-config/5.15.0-SNAPSHOT/activemq-runtime-config-5.15.0-SNAPSHOT.pom
[JENKINS] Archiving <https://builds.apache.org/job/ActiveMQ-Java7-All-UnitTests/ws/activemq-runtime-config/target/activemq-runtime-config-5.15.0-SNAPSHOT.jar>
to org.apache.activemq/activemq-runtime-config/5.15.0-SNAPSHOT/activemq-runtime-config-5.15.0-SNAPSHOT.jar
[JENKINS] Archiving <https://builds.apache.org/job/ActiveMQ-Java7-All-UnitTests/ws/pom.xml>
to org.apache.activemq/activemq-parent/5.15.0-SNAPSHOT/activemq-parent-5.15.0-SNAPSHOT.pom
Compressed 59.83 KB of artifacts by 53.5% relative to #541
[JENKINS] Archiving <https://builds.apache.org/job/ActiveMQ-Java7-All-UnitTests/ws/activemq-stomp/pom.xml>
to org.apache.activemq/activemq-stomp/5.15.0-SNAPSHOT/activemq-stomp-5.15.0-SNAPSHOT.pom
[JENKINS] Archiving <https://builds.apache.org/job/ActiveMQ-Java7-All-UnitTests/ws/activemq-stomp/target/activemq-stomp-5.15.0-SNAPSHOT.jar>
to org.apache.activemq/activemq-stomp/5.15.0-SNAPSHOT/activemq-stomp-5.15.0-SNAPSHOT.jar
[JENKINS] Archiving <https://builds.apache.org/job/ActiveMQ-Java7-All-UnitTests/ws/activemq-broker/pom.xml>
to org.apache.activemq/activemq-broker/5.15.0-SNAPSHOT/activemq-broker-5.15.0-SNAPSHOT.pom
[JENKINS] Archiving <https://builds.apache.org/job/ActiveMQ-Java7-All-UnitTests/ws/activemq-broker/target/activemq-broker-5.15.0-SNAPSHOT.jar>
to org.apache.activemq/activemq-broker/5.15.0-SNAPSHOT/activemq-broker-5.15.0-SNAPSHOT.jar
[JENKINS] Archiving <https://builds.apache.org/job/ActiveMQ-Java7-All-UnitTests/ws/activemq-broker/target/activemq-broker-5.15.0-SNAPSHOT-tests.jar>
to org.apache.activemq/activemq-broker/5.15.0-SNAPSHOT/activemq-broker-5.15.0-SNAPSHOT-tests.jar
[JENKINS] Archiving <https://builds.apache.org/job/ActiveMQ-Java7-All-UnitTests/ws/activemq-mqtt/pom.xml>
to org.apache.activemq/activemq-mqtt/5.15.0-SNAPSHOT/activemq-mqtt-5.15.0-SNAPSHOT.pom
[JENKINS] Archiving <https://builds.apache.org/job/ActiveMQ-Java7-All-UnitTests/ws/activemq-mqtt/target/activemq-mqtt-5.15.0-SNAPSHOT.jar>
to org.apache.activemq/activemq-mqtt/5.15.0-SNAPSHOT/activemq-mqtt-5.15.0-SNAPSHOT.jar
[JENKINS] Archiving <https://builds.apache.org/job/ActiveMQ-Java7-All-UnitTests/ws/activemq-jaas/pom.xml>
to org.apache.activemq/activemq-jaas/5.15.0-SNAPSHOT/activemq-jaas-5.15.0-SNAPSHOT.pom
[JENKINS] Archiving <https://builds.apache.org/job/ActiveMQ-Java7-All-UnitTests/ws/activemq-jaas/target/activemq-jaas-5.15.0-SNAPSHOT.jar>
to org.apache.activemq/activemq-jaas/5.15.0-SNAPSHOT/activemq-jaas-5.15.0-SNAPSHOT.jar
[JENKINS] Archiving <https://builds.apache.org/job/ActiveMQ-Java7-All-UnitTests/ws/activemq-ra/pom.xml>
to org.apache.activemq/activemq-ra/5.15.0-SNAPSHOT/activemq-ra-5.15.0-SNAPSHOT.pom
[JENKINS] Archiving <https://builds.apache.org/job/ActiveMQ-Java7-All-UnitTests/ws/activemq-ra/target/activemq-ra-5.15.0-SNAPSHOT.jar>
to org.apache.activemq/activemq-ra/5.15.0-SNAPSHOT/activemq-ra-5.15.0-SNAPSHOT.jar
[JENKINS] Archiving <https://builds.apache.org/job/ActiveMQ-Java7-All-UnitTests/ws/activemq-ra/target/xbean/activemq-ra.xsd>
to org.apache.activemq/activemq-ra/5.15.0-SNAPSHOT/activemq-ra-5.15.0-SNAPSHOT.xsd
[JENKINS] Archiving <https://builds.apache.org/job/ActiveMQ-Java7-All-UnitTests/ws/activemq-ra/target/xbean/activemq-ra.xsd.html>
to org.apache.activemq/activemq-ra/5.15.0-SNAPSHOT/activemq-ra-5.15.0-SNAPSHOT-schema.html
[JENKINS] Archiving <https://builds.apache.org/job/ActiveMQ-Java7-All-UnitTests/ws/activemq-ra/target/xbean/activemq-ra.xsd.html>
to org.apache.activemq/activemq-ra/5.15.0-SNAPSHOT/activemq-ra-5.15.0-SNAPSHOT.xsd.html
[JENKINS] Archiving <https://builds.apache.org/job/ActiveMQ-Java7-All-UnitTests/ws/activemq-partition/pom.xml>
to org.apache.activemq/activemq-partition/5.15.0-SNAPSHOT/activemq-partition-5.15.0-SNAPSHOT.pom
[JENKINS] Archiving <https://builds.apache.org/job/ActiveMQ-Java7-All-UnitTests/ws/activemq-partition/target/activemq-partition-5.15.0-SNAPSHOT.jar>
to org.apache.activemq/activemq-partition/5.15.0-SNAPSHOT/activemq-partition-5.15.0-SNAPSHOT.jar
[JENKINS] Archiving <https://builds.apache.org/job/ActiveMQ-Java7-All-UnitTests/ws/activemq-console/pom.xml>
to org.apache.activemq/activemq-console/5.15.0-SNAPSHOT/activemq-console-5.15.0-SNAPSHOT.pom
[JENKINS] Archiving <https://builds.apache.org/job/ActiveMQ-Java7-All-UnitTests/ws/activemq-console/target/activemq-console-5.15.0-SNAPSHOT.jar>
to org.apache.activemq/activemq-console/5.15.0-SNAPSHOT/activemq-console-5.15.0-SNAPSHOT.jar
[JENKINS] Archiving <https://builds.apache.org/job/ActiveMQ-Java7-All-UnitTests/ws/activemq-spring/pom.xml>
to org.apache.activemq/activemq-spring/5.15.0-SNAPSHOT/activemq-spring-5.15.0-SNAPSHOT.pom
[JENKINS] Archiving <https://builds.apache.org/job/ActiveMQ-Java7-All-UnitTests/ws/activemq-spring/target/activemq-spring-5.15.0-SNAPSHOT.jar>
to org.apache.activemq/activemq-spring/5.15.0-SNAPSHOT/activemq-spring-5.15.0-SNAPSHOT.jar
[JENKINS] Archiving <https://builds.apache.org/job/ActiveMQ-Java7-All-UnitTests/ws/activemq-spring/target/classes/activemq.xsd>
to org.apache.activemq/activemq-spring/5.15.0-SNAPSHOT/activemq-spring-5.15.0-SNAPSHOT.xsd
[JENKINS] Archiving <https://builds.apache.org/job/ActiveMQ-Java7-All-UnitTests/ws/activemq-spring/target/classes/activemq.xsd.html>
to org.apache.activemq/activemq-spring/5.15.0-SNAPSHOT/activemq-spring-5.15.0-SNAPSHOT-schema.html
Compressed 895.61 KB of artifacts by 75.0% relative to #541
[JENKINS] Archiving <https://builds.apache.org/job/ActiveMQ-Java7-All-UnitTests/ws/activemq-leveldb-store/pom.xml>
to org.apache.activemq/activemq-leveldb-store/5.15.0-SNAPSHOT/activemq-leveldb-store-5.15.0-SNAPSHOT.pom
[JENKINS] Archiving <https://builds.apache.org/job/ActiveMQ-Java7-All-UnitTests/ws/activemq-leveldb-store/target/activemq-leveldb-store-5.15.0-SNAPSHOT.jar>
to org.apache.activemq/activemq-leveldb-store/5.15.0-SNAPSHOT/activemq-leveldb-store-5.15.0-SNAPSHOT.jar
[locks-and-latches] Releasing all the locks
[locks-and-latches] All the locks released
channel stopped

Mime
View raw message