activemq-commits mailing list archives

Site index · List index
Message view « Date » · « Thread »
Top « Date » · « Thread »
From Apache Jenkins Server <jenk...@builds.apache.org>
Subject Build failed in Jenkins: ActiveMQ-Java7-All-UnitTests #557
Date Sat, 22 Oct 2016 16:11:53 GMT
See <https://builds.apache.org/job/ActiveMQ-Java7-All-UnitTests/557/changes>

Changes:

[tabish121] NO-JIRA  Add new test for session close

[tabish121] NO-JIRA Add new test to receiver tests

------------------------------------------
[...truncated 3734 lines...]
Running org.apache.activemq.security.XBeanSecurityTest
Tests run: 29, Failures: 0, Errors: 0, Skipped: 0, Time elapsed: 12.192 sec - in org.apache.activemq.security.XBeanSecurityTest
Running org.apache.activemq.security.XBeanSecurityWithGuestNoCredentialsOnlyTest
Tests run: 5, Failures: 0, Errors: 0, Skipped: 0, Time elapsed: 2.185 sec - in org.apache.activemq.security.XBeanSecurityWithGuestNoCredentialsOnlyTest
Running org.apache.activemq.security.XBeanSecurityWithGuestTest
Tests run: 7, Failures: 0, Errors: 0, Skipped: 0, Time elapsed: 2.453 sec - in org.apache.activemq.security.XBeanSecurityWithGuestTest
Running org.apache.activemq.security.XBeanSslContextTest
Tests run: 1, Failures: 0, Errors: 0, Skipped: 0, Time elapsed: 1.986 sec - in org.apache.activemq.security.XBeanSslContextTest
Running org.apache.activemq.selector.SelectorParserTest
Tests run: 3, Failures: 0, Errors: 0, Skipped: 0, Time elapsed: 0.203 sec - in org.apache.activemq.selector.SelectorParserTest
Running org.apache.activemq.selector.SelectorTest
Tests run: 22, Failures: 0, Errors: 0, Skipped: 0, Time elapsed: 0.414 sec - in org.apache.activemq.selector.SelectorTest
Running org.apache.activemq.selector.UnknownHandlingSelectorTest
Tests run: 7, Failures: 0, Errors: 0, Skipped: 0, Time elapsed: 0.157 sec - in org.apache.activemq.selector.UnknownHandlingSelectorTest
Running org.apache.activemq.spring.ActiveMQConnectionFactoryFactoryBeanTest
Tests run: 6, Failures: 0, Errors: 0, Skipped: 0, Time elapsed: 0.177 sec - in org.apache.activemq.spring.ActiveMQConnectionFactoryFactoryBeanTest
Running org.apache.activemq.spring.Spring2XmlNamespacesTest
Tests run: 1, Failures: 0, Errors: 0, Skipped: 0, Time elapsed: 2.62 sec - in org.apache.activemq.spring.Spring2XmlNamespacesTest
Running org.apache.activemq.spring.Spring2XmlNamespacesWithoutRemoteSchemaTest
Tests run: 1, Failures: 0, Errors: 0, Skipped: 0, Time elapsed: 3.623 sec - in org.apache.activemq.spring.Spring2XmlNamespacesWithoutRemoteSchemaTest
Running org.apache.activemq.spring.SpringTest
Tests run: 7, Failures: 0, Errors: 0, Skipped: 0, Time elapsed: 10.74 sec - in org.apache.activemq.spring.SpringTest
Running org.apache.activemq.statistics.DurableSubscriptionInflightMessageSizeTest
Tests run: 32, Failures: 0, Errors: 0, Skipped: 6, Time elapsed: 37.831 sec - in org.apache.activemq.statistics.DurableSubscriptionInflightMessageSizeTest
Running org.apache.activemq.statistics.QueueSubscriptionInflightMessageSizeTest
Tests run: 32, Failures: 0, Errors: 0, Skipped: 6, Time elapsed: 40.668 sec - in org.apache.activemq.statistics.QueueSubscriptionInflightMessageSizeTest
Running org.apache.activemq.statistics.TopicSubscriptionInflightMessageSizeTest
Tests run: 32, Failures: 0, Errors: 0, Skipped: 6, Time elapsed: 20.739 sec - in org.apache.activemq.statistics.TopicSubscriptionInflightMessageSizeTest
Running org.apache.activemq.store.AutoStorePerDestinationTest
Tests run: 6, Failures: 0, Errors: 0, Skipped: 0, Time elapsed: 31.823 sec - in org.apache.activemq.store.AutoStorePerDestinationTest
Running org.apache.activemq.store.LevelDBStorePerDestinationTest
Tests run: 6, Failures: 0, Errors: 0, Skipped: 0, Time elapsed: 27.534 sec - in org.apache.activemq.store.LevelDBStorePerDestinationTest
Running org.apache.activemq.store.MKahaDbSharedLockerTest
Tests run: 1, Failures: 0, Errors: 0, Skipped: 0, Time elapsed: 1.935 sec - in org.apache.activemq.store.MKahaDbSharedLockerTest
Running org.apache.activemq.store.SharedFileLockerTest
Tests run: 4, Failures: 0, Errors: 0, Skipped: 0, Time elapsed: 2.277 sec - in org.apache.activemq.store.SharedFileLockerTest
Running org.apache.activemq.store.StorePerDestinationTest
Tests run: 6, Failures: 0, Errors: 0, Skipped: 0, Time elapsed: 31.593 sec - in org.apache.activemq.store.StorePerDestinationTest
Running org.apache.activemq.store.jdbc.DatabaseLockerConfigTest
Tests run: 4, Failures: 0, Errors: 0, Skipped: 0, Time elapsed: 0.173 sec - in org.apache.activemq.store.jdbc.DatabaseLockerConfigTest
Running org.apache.activemq.store.jdbc.JDBCCleanupLimitedPoolTest
Tests run: 1, Failures: 0, Errors: 0, Skipped: 0, Time elapsed: 7.446 sec - in org.apache.activemq.store.jdbc.JDBCCleanupLimitedPoolTest
Running org.apache.activemq.store.jdbc.JDBCCommitExceptionTest
Tests run: 1, Failures: 0, Errors: 0, Skipped: 0, Time elapsed: 3.235 sec - in org.apache.activemq.store.jdbc.JDBCCommitExceptionTest
Running org.apache.activemq.store.jdbc.JDBCIOExceptionHandlerMockeryTest
Tests run: 1, Failures: 0, Errors: 0, Skipped: 0, Time elapsed: 1.748 sec - in org.apache.activemq.store.jdbc.JDBCIOExceptionHandlerMockeryTest
Running org.apache.activemq.store.jdbc.JDBCIOExceptionHandlerTest
Tests run: 4, Failures: 0, Errors: 0, Skipped: 0, Time elapsed: 24.4 sec - in org.apache.activemq.store.jdbc.JDBCIOExceptionHandlerTest
Running org.apache.activemq.store.jdbc.JDBCLockTablePrefixTest
Tests run: 1, Failures: 0, Errors: 0, Skipped: 0, Time elapsed: 4.094 sec - in org.apache.activemq.store.jdbc.JDBCLockTablePrefixTest
Running org.apache.activemq.store.jdbc.JDBCMessagePriorityTest
Tests run: 29, Failures: 0, Errors: 0, Skipped: 0, Time elapsed: 328.536 sec - in org.apache.activemq.store.jdbc.JDBCMessagePriorityTest
Running org.apache.activemq.store.jdbc.JDBCNegativeQueueTest
Tests run: 4, Failures: 0, Errors: 0, Skipped: 0, Time elapsed: 236.282 sec - in org.apache.activemq.store.jdbc.JDBCNegativeQueueTest
Running org.apache.activemq.store.jdbc.JDBCNetworkBrokerDetachTest
Tests run: 2, Failures: 0, Errors: 0, Skipped: 0, Time elapsed: 18.006 sec - in org.apache.activemq.store.jdbc.JDBCNetworkBrokerDetachTest
Running org.apache.activemq.store.jdbc.JDBCPersistenceAdapterExpiredMessageTest
Tests run: 1, Failures: 0, Errors: 0, Skipped: 0, Time elapsed: 9.172 sec - in org.apache.activemq.store.jdbc.JDBCPersistenceAdapterExpiredMessageTest
Running org.apache.activemq.store.jdbc.JDBCPersistenceAdapterTest
Tests run: 3, Failures: 0, Errors: 0, Skipped: 0, Time elapsed: 5.815 sec - in org.apache.activemq.store.jdbc.JDBCPersistenceAdapterTest
Running org.apache.activemq.store.jdbc.JDBCStoreAutoCommitTest
Tests run: 3, Failures: 0, Errors: 0, Skipped: 0, Time elapsed: 3.417 sec - in org.apache.activemq.store.jdbc.JDBCStoreAutoCommitTest
Running org.apache.activemq.store.jdbc.JDBCStoreBrokerTest

Results :

Failed tests: 
  AMQ6463Test>CombinationTestSupport.runBare:113->CombinationTestSupport.runBare:107->testBlockedSechedulerSendNoError:91
got blocked message
  NetworkRestartPlainTest>CombinationTestSupport.runBare:113->CombinationTestSupport.runBare:107->NetworkRestartTest.testConnectorRestart:52
expected:<[before]> but was:<[test-0]>
  NetworkRestartPlainTest>CombinationTestSupport.runBare:113->CombinationTestSupport.runBare:107->NetworkRestartTest.testConnectorReAdd:85
expected:<[before]> but was:<[test-1]>
  NetworkRestartTest>CombinationTestSupport.runBare:113->CombinationTestSupport.runBare:107->testConnectorRestart:52
expected:<[before]> but was:<[test-2]>
  NetworkRestartTest>CombinationTestSupport.runBare:113->CombinationTestSupport.runBare:107->testConnectorReAdd:85
expected:<[before]> but was:<[test-3]>
  TopicOutboundBridgeReconnectTest.testWithConsumerBrokerRestart:186 expected null, but was:<ActiveMQTextMessage
{commandId = 8, responseRequired = true, messageId = ID:jenkins-ubuntu2.apache.org-55347-1477150890226-121:5:2:1:2,
originalDestination = null, originalTransactionId = null, producerId = ID:jenkins-ubuntu2.apache.org-55347-1477150890226-121:5:2:1,
destination = topic://RECONNECT.TEST.TOPIC, transactionId = null, expiration = 0, timestamp
= 1477151163436, arrival = 0, brokerInTime = 1477151163438, brokerOutTime = 1477151163438,
correlationId = null, replyTo = null, persistent = true, type = null, priority = 4, groupID
= null, groupSequence = 0, targetConsumerId = null, compressed = false, userID = null, content
= org.apache.activemq.util.ByteSequence@6d6daf76, marshalledProperties = null, dataStructure
= null, redeliveryCounter = 0, size = 1035, properties = null, readOnlyProperties = true,
readOnlyBody = true, droppable = false, jmsXGroupFirstForConsumer = false, text = test123}>

Tests run: 3843, Failures: 6, Errors: 0, Skipped: 86

[JENKINS] Recording test results
Tests run: 127, Failures: 0, Errors: 0, Skipped: 0, Time elapsed: 107.09 sec - in org.apache.activemq.store.jdbc.JDBCStoreBrokerTest
[INFO] ------------------------------------------------------------------------
[INFO] Reactor Summary:
[INFO] 
[INFO] ActiveMQ ........................................... SUCCESS [  6.650 s]
[INFO] ActiveMQ :: Client ................................. SUCCESS [02:03 min]
[INFO] ActiveMQ :: Openwire Legacy Support ................ SUCCESS [  5.138 s]
[INFO] ActiveMQ :: JAAS ................................... SUCCESS [ 18.121 s]
[INFO] ActiveMQ :: Broker ................................. SUCCESS [01:25 min]
[INFO] ActiveMQ :: KahaDB Store ........................... SUCCESS [02:43 min]
[INFO] ActiveMQ :: STOMP Protocol ......................... SUCCESS [11:07 min]
[INFO] ActiveMQ :: MQTT Protocol .......................... SUCCESS [21:47 min]
[INFO] ActiveMQ :: JDBC Store ............................. SUCCESS [  4.922 s]
[INFO] ActiveMQ :: LevelDB Store .......................... SUCCESS [05:23 min]
[INFO] ActiveMQ :: Generic JMS Pool ....................... SUCCESS [ 45.285 s]
[INFO] ActiveMQ :: Pool ................................... SUCCESS [  5.941 s]
[INFO] ActiveMQ :: RA ..................................... SUCCESS [02:35 min]
[INFO] ActiveMQ :: Spring ................................. SUCCESS [ 58.776 s]
[INFO] ActiveMQ :: Console ................................ SUCCESS [  7.404 s]
[INFO] ActiveMQ :: Partition Management ................... SUCCESS [ 20.788 s]
[INFO] ActiveMQ :: Runtime Configuration .................. SUCCESS [08:36 min]
[INFO] ActiveMQ :: Tooling ................................ SUCCESS [  1.477 s]
[INFO] ActiveMQ :: JUnit Rule ............................. SUCCESS [  6.373 s]
[INFO] ActiveMQ :: Unit Tests ............................. FAILURE [  03:44 h]
[INFO] ------------------------------------------------------------------------
[INFO] BUILD FAILURE
[INFO] ------------------------------------------------------------------------
[INFO] Total time: 04:44 h
[INFO] Finished at: 2016-10-22T16:11:38+00:00
[INFO] Final Memory: 119M/1016M
[INFO] ------------------------------------------------------------------------
[ERROR] Failed to execute goal org.apache.maven.plugins:maven-surefire-plugin:2.16:test (default-test)
on project activemq-unit-tests: ExecutionException; nested exception is java.util.concurrent.ExecutionException:
java.lang.RuntimeException: The forked VM terminated without saying properly goodbye. VM crash
or System.exit called ?
[ERROR] Command was/bin/sh -c cd <https://builds.apache.org/job/ActiveMQ-Java7-All-UnitTests/ws/activemq-unit-tests>
&& /usr/local/asfpackages/java/jdk1.7.0_80/jre/bin/java -Xmx512m -jar <https://builds.apache.org/job/ActiveMQ-Java7-All-UnitTests/ws/activemq-unit-tests/target/surefire/surefirebooter2941429380649956969.jar>
<https://builds.apache.org/job/ActiveMQ-Java7-All-UnitTests/ws/activemq-unit-tests/target/surefire/surefire1930213610848053296tmp>
<https://builds.apache.org/job/ActiveMQ-Java7-All-UnitTests/ws/activemq-unit-tests/target/surefire/surefire_5742407258973987642729tmp>
[ERROR] -> [Help 1]
org.apache.maven.lifecycle.LifecycleExecutionException: Failed to execute goal org.apache.maven.plugins:maven-surefire-plugin:2.16:test
(default-test) on project activemq-unit-tests: ExecutionException; nested exception is java.util.concurrent.ExecutionException:
java.lang.RuntimeException: The forked VM terminated without saying properly goodbye. VM crash
or System.exit called ?
Command was/bin/sh -c cd <https://builds.apache.org/job/ActiveMQ-Java7-All-UnitTests/ws/activemq-unit-tests>
&& /usr/local/asfpackages/java/jdk1.7.0_80/jre/bin/java -Xmx512m -jar <https://builds.apache.org/job/ActiveMQ-Java7-All-UnitTests/ws/activemq-unit-tests/target/surefire/surefirebooter2941429380649956969.jar>
<https://builds.apache.org/job/ActiveMQ-Java7-All-UnitTests/ws/activemq-unit-tests/target/surefire/surefire1930213610848053296tmp>
<https://builds.apache.org/job/ActiveMQ-Java7-All-UnitTests/ws/activemq-unit-tests/target/surefire/surefire_5742407258973987642729tmp>
	at org.apache.maven.lifecycle.internal.MojoExecutor.execute(MojoExecutor.java:212)
	at org.apache.maven.lifecycle.internal.MojoExecutor.execute(MojoExecutor.java:153)
	at org.apache.maven.lifecycle.internal.MojoExecutor.execute(MojoExecutor.java:145)
	at org.apache.maven.lifecycle.internal.LifecycleModuleBuilder.buildProject(LifecycleModuleBuilder.java:116)
	at org.apache.maven.lifecycle.internal.LifecycleModuleBuilder.buildProject(LifecycleModuleBuilder.java:80)
	at org.apache.maven.lifecycle.internal.builder.singlethreaded.SingleThreadedBuilder.build(SingleThreadedBuilder.java:51)
	at org.apache.maven.lifecycle.internal.LifecycleStarter.execute(LifecycleStarter.java:128)
	at org.apache.maven.DefaultMaven.doExecute(DefaultMaven.java:307)
	at org.apache.maven.DefaultMaven.doExecute(DefaultMaven.java:193)
	at org.apache.maven.DefaultMaven.execute(DefaultMaven.java:106)
	at org.jvnet.hudson.maven3.launcher.Maven32Launcher.main(Maven32Launcher.java:132)
	at sun.reflect.NativeMethodAccessorImpl.invoke0(Native Method)
	at sun.reflect.NativeMethodAccessorImpl.invoke(NativeMethodAccessorImpl.java:57)
	at sun.reflect.DelegatingMethodAccessorImpl.invoke(DelegatingMethodAccessorImpl.java:43)
	at java.lang.reflect.Method.invoke(Method.java:606)
	at org.codehaus.plexus.classworlds.launcher.Launcher.launchStandard(Launcher.java:330)
	at org.codehaus.plexus.classworlds.launcher.Launcher.launch(Launcher.java:238)
	at jenkins.maven3.agent.Maven32Main.launch(Maven32Main.java:186)
	at sun.reflect.NativeMethodAccessorImpl.invoke0(Native Method)
	at sun.reflect.NativeMethodAccessorImpl.invoke(NativeMethodAccessorImpl.java:57)
	at sun.reflect.DelegatingMethodAccessorImpl.invoke(DelegatingMethodAccessorImpl.java:43)
	at java.lang.reflect.Method.invoke(Method.java:606)
	at hudson.maven.Maven3Builder.call(Maven3Builder.java:136)
	at hudson.maven.Maven3Builder.call(Maven3Builder.java:71)
	at hudson.remoting.UserRequest.perform(UserRequest.java:153)
	at hudson.remoting.UserRequest.perform(UserRequest.java:50)
	at hudson.remoting.Request$2.run(Request.java:332)
	at hudson.remoting.InterceptingExecutorService$1.call(InterceptingExecutorService.java:68)
	at java.util.concurrent.FutureTask.run(FutureTask.java:262)
	at java.util.concurrent.ThreadPoolExecutor.runWorker(ThreadPoolExecutor.java:1145)
	at java.util.concurrent.ThreadPoolExecutor$Worker.run(ThreadPoolExecutor.java:615)
	at java.lang.Thread.run(Thread.java:745)
Caused by: org.apache.maven.plugin.MojoFailureException: ExecutionException; nested exception
is java.util.concurrent.ExecutionException: java.lang.RuntimeException: The forked VM terminated
without saying properly goodbye. VM crash or System.exit called ?
Command was/bin/sh -c cd <https://builds.apache.org/job/ActiveMQ-Java7-All-UnitTests/ws/activemq-unit-tests>
&& /usr/local/asfpackages/java/jdk1.7.0_80/jre/bin/java -Xmx512m -jar <https://builds.apache.org/job/ActiveMQ-Java7-All-UnitTests/ws/activemq-unit-tests/target/surefire/surefirebooter2941429380649956969.jar>
<https://builds.apache.org/job/ActiveMQ-Java7-All-UnitTests/ws/activemq-unit-tests/target/surefire/surefire1930213610848053296tmp>
<https://builds.apache.org/job/ActiveMQ-Java7-All-UnitTests/ws/activemq-unit-tests/target/surefire/surefire_5742407258973987642729tmp>
	at org.apache.maven.plugin.surefire.SurefirePlugin.assertNoException(SurefirePlugin.java:198)
	at org.apache.maven.plugin.surefire.SurefirePlugin.handleSummary(SurefirePlugin.java:188)
	at org.apache.maven.plugin.surefire.AbstractSurefireMojo.executeAfterPreconditionsChecked(AbstractSurefireMojo.java:852)
	at org.apache.maven.plugin.surefire.AbstractSurefireMojo.execute(AbstractSurefireMojo.java:720)
	at org.apache.maven.plugin.DefaultBuildPluginManager.executeMojo(DefaultBuildPluginManager.java:134)
	at org.apache.maven.lifecycle.internal.MojoExecutor.execute(MojoExecutor.java:207)
	... 31 more
Caused by: org.apache.maven.surefire.booter.SurefireBooterForkException: ExecutionException;
nested exception is java.util.concurrent.ExecutionException: java.lang.RuntimeException: The
forked VM terminated without saying properly goodbye. VM crash or System.exit called ?
Command was/bin/sh -c cd <https://builds.apache.org/job/ActiveMQ-Java7-All-UnitTests/ws/activemq-unit-tests>
&& /usr/local/asfpackages/java/jdk1.7.0_80/jre/bin/java -Xmx512m -jar <https://builds.apache.org/job/ActiveMQ-Java7-All-UnitTests/ws/activemq-unit-tests/target/surefire/surefirebooter2941429380649956969.jar>
<https://builds.apache.org/job/ActiveMQ-Java7-All-UnitTests/ws/activemq-unit-tests/target/surefire/surefire1930213610848053296tmp>
<https://builds.apache.org/job/ActiveMQ-Java7-All-UnitTests/ws/activemq-unit-tests/target/surefire/surefire_5742407258973987642729tmp>
	at org.apache.maven.plugin.surefire.booterclient.ForkStarter.runSuitesForkPerTestSet(ForkStarter.java:316)
	at org.apache.maven.plugin.surefire.booterclient.ForkStarter.run(ForkStarter.java:169)
	at org.apache.maven.plugin.surefire.AbstractSurefireMojo.executeProvider(AbstractSurefireMojo.java:958)
	at org.apache.maven.plugin.surefire.AbstractSurefireMojo.executeAfterPreconditionsChecked(AbstractSurefireMojo.java:822)
	... 34 more
Caused by: java.util.concurrent.ExecutionException: java.lang.RuntimeException: The forked
VM terminated without saying properly goodbye. VM crash or System.exit called ?
Command was/bin/sh -c cd <https://builds.apache.org/job/ActiveMQ-Java7-All-UnitTests/ws/activemq-unit-tests>
&& /usr/local/asfpackages/java/jdk1.7.0_80/jre/bin/java -Xmx512m -jar <https://builds.apache.org/job/ActiveMQ-Java7-All-UnitTests/ws/activemq-unit-tests/target/surefire/surefirebooter2941429380649956969.jar>
<https://builds.apache.org/job/ActiveMQ-Java7-All-UnitTests/ws/activemq-unit-tests/target/surefire/surefire1930213610848053296tmp>
<https://builds.apache.org/job/ActiveMQ-Java7-All-UnitTests/ws/activemq-unit-tests/target/surefire/surefire_5742407258973987642729tmp>
	at java.util.concurrent.FutureTask.report(FutureTask.java:122)
	at java.util.concurrent.FutureTask.get(FutureTask.java:188)
	at org.apache.maven.plugin.surefire.booterclient.ForkStarter.runSuitesForkPerTestSet(ForkStarter.java:300)
	... 37 more
Caused by: java.lang.RuntimeException: The forked VM terminated without saying properly goodbye.
VM crash or System.exit called ?
Command was/bin/sh -c cd <https://builds.apache.org/job/ActiveMQ-Java7-All-UnitTests/ws/activemq-unit-tests>
&& /usr/local/asfpackages/java/jdk1.7.0_80/jre/bin/java -Xmx512m -jar <https://builds.apache.org/job/ActiveMQ-Java7-All-UnitTests/ws/activemq-unit-tests/target/surefire/surefirebooter2941429380649956969.jar>
<https://builds.apache.org/job/ActiveMQ-Java7-All-UnitTests/ws/activemq-unit-tests/target/surefire/surefire1930213610848053296tmp>
<https://builds.apache.org/job/ActiveMQ-Java7-All-UnitTests/ws/activemq-unit-tests/target/surefire/surefire_5742407258973987642729tmp>
	at org.apache.maven.plugin.surefire.booterclient.ForkStarter.fork(ForkStarter.java:485)
	at org.apache.maven.plugin.surefire.booterclient.ForkStarter.fork(ForkStarter.java:352)
	at org.apache.maven.plugin.surefire.booterclient.ForkStarter.access$300(ForkStarter.java:85)
	at org.apache.maven.plugin.surefire.booterclient.ForkStarter$2.call(ForkStarter.java:288)
	at org.apache.maven.plugin.surefire.booterclient.ForkStarter$2.call(ForkStarter.java:283)
	... 4 more
[ERROR] 
[ERROR] Re-run Maven using the -X switch to enable full debug logging.
[ERROR] 
[ERROR] For more information about the errors and possible solutions, please read the following
articles:
[ERROR] [Help 1] http://cwiki.apache.org/confluence/display/MAVEN/MojoFailureException
[ERROR] 
[ERROR] After correcting the problems, you can resume the build with the command
[ERROR]   mvn <goals> -rf :activemq-unit-tests
[JENKINS] Archiving <https://builds.apache.org/job/ActiveMQ-Java7-All-UnitTests/ws/activemq-kahadb-store/pom.xml>
to org.apache.activemq/activemq-kahadb-store/5.15.0-SNAPSHOT/activemq-kahadb-store-5.15.0-SNAPSHOT.pom
[JENKINS] Archiving <https://builds.apache.org/job/ActiveMQ-Java7-All-UnitTests/ws/activemq-kahadb-store/target/activemq-kahadb-store-5.15.0-SNAPSHOT.jar>
to org.apache.activemq/activemq-kahadb-store/5.15.0-SNAPSHOT/activemq-kahadb-store-5.15.0-SNAPSHOT.jar
No artifacts from ActiveMQ-Java7-All-UnitTests » ActiveMQ :: KahaDB Store #556 to compare,
so performing full copy of artifacts
[JENKINS] Archiving <https://builds.apache.org/job/ActiveMQ-Java7-All-UnitTests/ws/activemq-unit-tests/pom.xml>
to org.apache.activemq/activemq-unit-tests/5.15.0-SNAPSHOT/activemq-unit-tests-5.15.0-SNAPSHOT.pom
Compressed 71.40 KB of artifacts by 44.8% relative to #552
[JENKINS] Archiving <https://builds.apache.org/job/ActiveMQ-Java7-All-UnitTests/ws/activemq-openwire-legacy/pom.xml>
to org.apache.activemq/activemq-openwire-legacy/5.15.0-SNAPSHOT/activemq-openwire-legacy-5.15.0-SNAPSHOT.pom
[JENKINS] Archiving <https://builds.apache.org/job/ActiveMQ-Java7-All-UnitTests/ws/activemq-openwire-legacy/target/activemq-openwire-legacy-5.15.0-SNAPSHOT.jar>
to org.apache.activemq/activemq-openwire-legacy/5.15.0-SNAPSHOT/activemq-openwire-legacy-5.15.0-SNAPSHOT.jar
No artifacts from ActiveMQ-Java7-All-UnitTests » ActiveMQ :: Openwire Legacy Support #556
to compare, so performing full copy of artifacts
[JENKINS] Archiving <https://builds.apache.org/job/ActiveMQ-Java7-All-UnitTests/ws/activemq-client/pom.xml>
to org.apache.activemq/activemq-client/5.15.0-SNAPSHOT/activemq-client-5.15.0-SNAPSHOT.pom
[JENKINS] Archiving <https://builds.apache.org/job/ActiveMQ-Java7-All-UnitTests/ws/activemq-client/target/activemq-client-5.15.0-SNAPSHOT.jar>
to org.apache.activemq/activemq-client/5.15.0-SNAPSHOT/activemq-client-5.15.0-SNAPSHOT.jar
No artifacts from ActiveMQ-Java7-All-UnitTests » ActiveMQ :: Client #556 to compare, so performing
full copy of artifacts
[JENKINS] Archiving <https://builds.apache.org/job/ActiveMQ-Java7-All-UnitTests/ws/activemq-tooling/activemq-junit/pom.xml>
to org.apache.activemq.tooling/activemq-junit/5.15.0-SNAPSHOT/activemq-junit-5.15.0-SNAPSHOT.pom
[JENKINS] Archiving <https://builds.apache.org/job/ActiveMQ-Java7-All-UnitTests/ws/activemq-tooling/activemq-junit/target/activemq-junit-5.15.0-SNAPSHOT.jar>
to org.apache.activemq.tooling/activemq-junit/5.15.0-SNAPSHOT/activemq-junit-5.15.0-SNAPSHOT.jar
No artifacts from ActiveMQ-Java7-All-UnitTests » ActiveMQ :: JUnit Rule #556 to compare,
so performing full copy of artifacts
[JENKINS] Archiving <https://builds.apache.org/job/ActiveMQ-Java7-All-UnitTests/ws/activemq-tooling/pom.xml>
to org.apache.activemq.tooling/activemq-tooling/5.15.0-SNAPSHOT/activemq-tooling-5.15.0-SNAPSHOT.pom
No artifacts from ActiveMQ-Java7-All-UnitTests » ActiveMQ :: Tooling #556 to compare, so
performing full copy of artifacts
[JENKINS] Archiving <https://builds.apache.org/job/ActiveMQ-Java7-All-UnitTests/ws/activemq-jms-pool/pom.xml>
to org.apache.activemq/activemq-jms-pool/5.15.0-SNAPSHOT/activemq-jms-pool-5.15.0-SNAPSHOT.pom
[JENKINS] Archiving <https://builds.apache.org/job/ActiveMQ-Java7-All-UnitTests/ws/activemq-jms-pool/target/activemq-jms-pool-5.15.0-SNAPSHOT.jar>
to org.apache.activemq/activemq-jms-pool/5.15.0-SNAPSHOT/activemq-jms-pool-5.15.0-SNAPSHOT.jar
No artifacts from ActiveMQ-Java7-All-UnitTests » ActiveMQ :: Generic JMS Pool #556 to compare,
so performing full copy of artifacts
[JENKINS] Archiving <https://builds.apache.org/job/ActiveMQ-Java7-All-UnitTests/ws/activemq-pool/pom.xml>
to org.apache.activemq/activemq-pool/5.15.0-SNAPSHOT/activemq-pool-5.15.0-SNAPSHOT.pom
[JENKINS] Archiving <https://builds.apache.org/job/ActiveMQ-Java7-All-UnitTests/ws/activemq-pool/target/activemq-pool-5.15.0-SNAPSHOT.jar>
to org.apache.activemq/activemq-pool/5.15.0-SNAPSHOT/activemq-pool-5.15.0-SNAPSHOT.jar
No artifacts from ActiveMQ-Java7-All-UnitTests » ActiveMQ :: Pool #556 to compare, so performing
full copy of artifacts
[JENKINS] Archiving <https://builds.apache.org/job/ActiveMQ-Java7-All-UnitTests/ws/activemq-jdbc-store/pom.xml>
to org.apache.activemq/activemq-jdbc-store/5.15.0-SNAPSHOT/activemq-jdbc-store-5.15.0-SNAPSHOT.pom
[JENKINS] Archiving <https://builds.apache.org/job/ActiveMQ-Java7-All-UnitTests/ws/activemq-jdbc-store/target/activemq-jdbc-store-5.15.0-SNAPSHOT.jar>
to org.apache.activemq/activemq-jdbc-store/5.15.0-SNAPSHOT/activemq-jdbc-store-5.15.0-SNAPSHOT.jar
No artifacts from ActiveMQ-Java7-All-UnitTests » ActiveMQ :: JDBC Store #556 to compare,
so performing full copy of artifacts
[JENKINS] Archiving <https://builds.apache.org/job/ActiveMQ-Java7-All-UnitTests/ws/activemq-runtime-config/pom.xml>
to org.apache.activemq/activemq-runtime-config/5.15.0-SNAPSHOT/activemq-runtime-config-5.15.0-SNAPSHOT.pom
[JENKINS] Archiving <https://builds.apache.org/job/ActiveMQ-Java7-All-UnitTests/ws/activemq-runtime-config/target/activemq-runtime-config-5.15.0-SNAPSHOT.jar>
to org.apache.activemq/activemq-runtime-config/5.15.0-SNAPSHOT/activemq-runtime-config-5.15.0-SNAPSHOT.jar
No artifacts from ActiveMQ-Java7-All-UnitTests » ActiveMQ :: Runtime Configuration #556 to
compare, so performing full copy of artifacts
[JENKINS] Archiving <https://builds.apache.org/job/ActiveMQ-Java7-All-UnitTests/ws/pom.xml>
to org.apache.activemq/activemq-parent/5.15.0-SNAPSHOT/activemq-parent-5.15.0-SNAPSHOT.pom
No artifacts from ActiveMQ-Java7-All-UnitTests » ActiveMQ #556 to compare, so performing
full copy of artifacts
[JENKINS] Archiving <https://builds.apache.org/job/ActiveMQ-Java7-All-UnitTests/ws/activemq-stomp/pom.xml>
to org.apache.activemq/activemq-stomp/5.15.0-SNAPSHOT/activemq-stomp-5.15.0-SNAPSHOT.pom
[JENKINS] Archiving <https://builds.apache.org/job/ActiveMQ-Java7-All-UnitTests/ws/activemq-stomp/target/activemq-stomp-5.15.0-SNAPSHOT.jar>
to org.apache.activemq/activemq-stomp/5.15.0-SNAPSHOT/activemq-stomp-5.15.0-SNAPSHOT.jar
No artifacts from ActiveMQ-Java7-All-UnitTests » ActiveMQ :: STOMP Protocol #556 to compare,
so performing full copy of artifacts
[JENKINS] Archiving <https://builds.apache.org/job/ActiveMQ-Java7-All-UnitTests/ws/activemq-broker/pom.xml>
to org.apache.activemq/activemq-broker/5.15.0-SNAPSHOT/activemq-broker-5.15.0-SNAPSHOT.pom
[JENKINS] Archiving <https://builds.apache.org/job/ActiveMQ-Java7-All-UnitTests/ws/activemq-broker/target/activemq-broker-5.15.0-SNAPSHOT.jar>
to org.apache.activemq/activemq-broker/5.15.0-SNAPSHOT/activemq-broker-5.15.0-SNAPSHOT.jar
[JENKINS] Archiving <https://builds.apache.org/job/ActiveMQ-Java7-All-UnitTests/ws/activemq-broker/target/activemq-broker-5.15.0-SNAPSHOT-tests.jar>
to org.apache.activemq/activemq-broker/5.15.0-SNAPSHOT/activemq-broker-5.15.0-SNAPSHOT-tests.jar
No artifacts from ActiveMQ-Java7-All-UnitTests » ActiveMQ :: Broker #556 to compare, so performing
full copy of artifacts
[JENKINS] Archiving <https://builds.apache.org/job/ActiveMQ-Java7-All-UnitTests/ws/activemq-mqtt/pom.xml>
to org.apache.activemq/activemq-mqtt/5.15.0-SNAPSHOT/activemq-mqtt-5.15.0-SNAPSHOT.pom
[JENKINS] Archiving <https://builds.apache.org/job/ActiveMQ-Java7-All-UnitTests/ws/activemq-mqtt/target/activemq-mqtt-5.15.0-SNAPSHOT.jar>
to org.apache.activemq/activemq-mqtt/5.15.0-SNAPSHOT/activemq-mqtt-5.15.0-SNAPSHOT.jar
No artifacts from ActiveMQ-Java7-All-UnitTests » ActiveMQ :: MQTT Protocol #556 to compare,
so performing full copy of artifacts
[JENKINS] Archiving <https://builds.apache.org/job/ActiveMQ-Java7-All-UnitTests/ws/activemq-jaas/pom.xml>
to org.apache.activemq/activemq-jaas/5.15.0-SNAPSHOT/activemq-jaas-5.15.0-SNAPSHOT.pom
[JENKINS] Archiving <https://builds.apache.org/job/ActiveMQ-Java7-All-UnitTests/ws/activemq-jaas/target/activemq-jaas-5.15.0-SNAPSHOT.jar>
to org.apache.activemq/activemq-jaas/5.15.0-SNAPSHOT/activemq-jaas-5.15.0-SNAPSHOT.jar
No artifacts from ActiveMQ-Java7-All-UnitTests » ActiveMQ :: JAAS #556 to compare, so performing
full copy of artifacts
[JENKINS] Archiving <https://builds.apache.org/job/ActiveMQ-Java7-All-UnitTests/ws/activemq-ra/pom.xml>
to org.apache.activemq/activemq-ra/5.15.0-SNAPSHOT/activemq-ra-5.15.0-SNAPSHOT.pom
[JENKINS] Archiving <https://builds.apache.org/job/ActiveMQ-Java7-All-UnitTests/ws/activemq-ra/target/activemq-ra-5.15.0-SNAPSHOT.jar>
to org.apache.activemq/activemq-ra/5.15.0-SNAPSHOT/activemq-ra-5.15.0-SNAPSHOT.jar
[JENKINS] Archiving <https://builds.apache.org/job/ActiveMQ-Java7-All-UnitTests/ws/activemq-ra/target/xbean/activemq-ra.xsd>
to org.apache.activemq/activemq-ra/5.15.0-SNAPSHOT/activemq-ra-5.15.0-SNAPSHOT.xsd
[JENKINS] Archiving <https://builds.apache.org/job/ActiveMQ-Java7-All-UnitTests/ws/activemq-ra/target/xbean/activemq-ra.xsd.html>
to org.apache.activemq/activemq-ra/5.15.0-SNAPSHOT/activemq-ra-5.15.0-SNAPSHOT-schema.html
[JENKINS] Archiving <https://builds.apache.org/job/ActiveMQ-Java7-All-UnitTests/ws/activemq-ra/target/xbean/activemq-ra.xsd.html>
to org.apache.activemq/activemq-ra/5.15.0-SNAPSHOT/activemq-ra-5.15.0-SNAPSHOT.xsd.html
No artifacts from ActiveMQ-Java7-All-UnitTests » ActiveMQ :: RA #556 to compare, so performing
full copy of artifacts
[JENKINS] Archiving <https://builds.apache.org/job/ActiveMQ-Java7-All-UnitTests/ws/activemq-partition/pom.xml>
to org.apache.activemq/activemq-partition/5.15.0-SNAPSHOT/activemq-partition-5.15.0-SNAPSHOT.pom
[JENKINS] Archiving <https://builds.apache.org/job/ActiveMQ-Java7-All-UnitTests/ws/activemq-partition/target/activemq-partition-5.15.0-SNAPSHOT.jar>
to org.apache.activemq/activemq-partition/5.15.0-SNAPSHOT/activemq-partition-5.15.0-SNAPSHOT.jar
No artifacts from ActiveMQ-Java7-All-UnitTests » ActiveMQ :: Partition Management #556 to
compare, so performing full copy of artifacts
[JENKINS] Archiving <https://builds.apache.org/job/ActiveMQ-Java7-All-UnitTests/ws/activemq-console/pom.xml>
to org.apache.activemq/activemq-console/5.15.0-SNAPSHOT/activemq-console-5.15.0-SNAPSHOT.pom
[JENKINS] Archiving <https://builds.apache.org/job/ActiveMQ-Java7-All-UnitTests/ws/activemq-console/target/activemq-console-5.15.0-SNAPSHOT.jar>
to org.apache.activemq/activemq-console/5.15.0-SNAPSHOT/activemq-console-5.15.0-SNAPSHOT.jar
No artifacts from ActiveMQ-Java7-All-UnitTests » ActiveMQ :: Console #556 to compare, so
performing full copy of artifacts
[JENKINS] Archiving <https://builds.apache.org/job/ActiveMQ-Java7-All-UnitTests/ws/activemq-spring/pom.xml>
to org.apache.activemq/activemq-spring/5.15.0-SNAPSHOT/activemq-spring-5.15.0-SNAPSHOT.pom
[JENKINS] Archiving <https://builds.apache.org/job/ActiveMQ-Java7-All-UnitTests/ws/activemq-spring/target/activemq-spring-5.15.0-SNAPSHOT.jar>
to org.apache.activemq/activemq-spring/5.15.0-SNAPSHOT/activemq-spring-5.15.0-SNAPSHOT.jar
[JENKINS] Archiving <https://builds.apache.org/job/ActiveMQ-Java7-All-UnitTests/ws/activemq-spring/target/classes/activemq.xsd>
to org.apache.activemq/activemq-spring/5.15.0-SNAPSHOT/activemq-spring-5.15.0-SNAPSHOT.xsd
[JENKINS] Archiving <https://builds.apache.org/job/ActiveMQ-Java7-All-UnitTests/ws/activemq-spring/target/classes/activemq.xsd.html>
to org.apache.activemq/activemq-spring/5.15.0-SNAPSHOT/activemq-spring-5.15.0-SNAPSHOT-schema.html
No artifacts from ActiveMQ-Java7-All-UnitTests » ActiveMQ :: Spring #556 to compare, so performing
full copy of artifacts
[JENKINS] Archiving <https://builds.apache.org/job/ActiveMQ-Java7-All-UnitTests/ws/activemq-leveldb-store/pom.xml>
to org.apache.activemq/activemq-leveldb-store/5.15.0-SNAPSHOT/activemq-leveldb-store-5.15.0-SNAPSHOT.pom
[JENKINS] Archiving <https://builds.apache.org/job/ActiveMQ-Java7-All-UnitTests/ws/activemq-leveldb-store/target/activemq-leveldb-store-5.15.0-SNAPSHOT.jar>
to org.apache.activemq/activemq-leveldb-store/5.15.0-SNAPSHOT/activemq-leveldb-store-5.15.0-SNAPSHOT.jar
No artifacts from ActiveMQ-Java7-All-UnitTests » ActiveMQ :: LevelDB Store #556 to compare,
so performing full copy of artifacts
[locks-and-latches] Releasing all the locks
[locks-and-latches] All the locks released
channel stopped

Mime
View raw message