activemq-commits mailing list archives

Site index · List index
Message view « Date » · « Thread »
Top « Date » · « Thread »
From Apache Jenkins Server <jenk...@builds.apache.org>
Subject Build failed in Jenkins: ActiveMQ-Trunk-Deploy #1715
Date Thu, 27 Oct 2016 03:31:34 GMT
See <https://builds.apache.org/job/ActiveMQ-Trunk-Deploy/1715/changes>

Changes:

[tabish121] https://issues.apache.org/jira/browse/AMQ-6483

[tabish121] https://issues.apache.org/jira/browse/AMQ-6484

[tabish121] https://issues.apache.org/jira/browse/AMQ-6485

[tabish121] https://issues.apache.org/jira/browse/AMQ-6486

------------------------------------------
[...truncated 1402 lines...]
org.apache.maven.lifecycle.LifecycleExecutionException: Failed to execute goal org.apache.maven.plugins:maven-compiler-plugin:3.3:compile
(default-compile) on project activemq-openwire-generator: Fatal error compiling
	at org.apache.maven.lifecycle.internal.MojoExecutor.execute(MojoExecutor.java:216)
	at org.apache.maven.lifecycle.internal.MojoExecutor.execute(MojoExecutor.java:153)
	at org.apache.maven.lifecycle.internal.MojoExecutor.execute(MojoExecutor.java:145)
	at org.apache.maven.lifecycle.internal.LifecycleModuleBuilder.buildProject(LifecycleModuleBuilder.java:116)
	at org.apache.maven.lifecycle.internal.LifecycleModuleBuilder.buildProject(LifecycleModuleBuilder.java:80)
	at org.apache.maven.lifecycle.internal.builder.singlethreaded.SingleThreadedBuilder.build(SingleThreadedBuilder.java:51)
	at org.apache.maven.lifecycle.internal.LifecycleStarter.execute(LifecycleStarter.java:128)
	at org.apache.maven.DefaultMaven.doExecute(DefaultMaven.java:307)
	at org.apache.maven.DefaultMaven.doExecute(DefaultMaven.java:193)
	at org.apache.maven.DefaultMaven.execute(DefaultMaven.java:106)
	at org.jvnet.hudson.maven3.launcher.Maven32Launcher.main(Maven32Launcher.java:132)
	at sun.reflect.NativeMethodAccessorImpl.invoke0(Native Method)
	at sun.reflect.NativeMethodAccessorImpl.invoke(NativeMethodAccessorImpl.java:57)
	at sun.reflect.DelegatingMethodAccessorImpl.invoke(DelegatingMethodAccessorImpl.java:43)
	at java.lang.reflect.Method.invoke(Method.java:606)
	at org.codehaus.plexus.classworlds.launcher.Launcher.launchStandard(Launcher.java:330)
	at org.codehaus.plexus.classworlds.launcher.Launcher.launch(Launcher.java:238)
	at jenkins.maven3.agent.Maven32Main.launch(Maven32Main.java:186)
	at sun.reflect.NativeMethodAccessorImpl.invoke0(Native Method)
	at sun.reflect.NativeMethodAccessorImpl.invoke(NativeMethodAccessorImpl.java:57)
	at sun.reflect.DelegatingMethodAccessorImpl.invoke(DelegatingMethodAccessorImpl.java:43)
	at java.lang.reflect.Method.invoke(Method.java:606)
	at hudson.maven.Maven3Builder.call(Maven3Builder.java:136)
	at hudson.maven.Maven3Builder.call(Maven3Builder.java:71)
	at hudson.remoting.UserRequest.perform(UserRequest.java:153)
	at hudson.remoting.UserRequest.perform(UserRequest.java:50)
	at hudson.remoting.Request$2.run(Request.java:332)
	at hudson.remoting.InterceptingExecutorService$1.call(InterceptingExecutorService.java:68)
	at java.util.concurrent.FutureTask.run(FutureTask.java:262)
	at java.util.concurrent.ThreadPoolExecutor.runWorker(ThreadPoolExecutor.java:1145)
	at java.util.concurrent.ThreadPoolExecutor$Worker.run(ThreadPoolExecutor.java:615)
	at java.lang.Thread.run(Thread.java:745)
Caused by: org.apache.maven.plugin.MojoExecutionException: Fatal error compiling
	at org.apache.maven.plugin.compiler.AbstractCompilerMojo.execute(AbstractCompilerMojo.java:836)
	at org.apache.maven.plugin.compiler.CompilerMojo.execute(CompilerMojo.java:129)
	at org.apache.maven.plugin.DefaultBuildPluginManager.executeMojo(DefaultBuildPluginManager.java:134)
	at org.apache.maven.lifecycle.internal.MojoExecutor.execute(MojoExecutor.java:208)
	... 31 more
Caused by: org.codehaus.plexus.compiler.CompilerException: invalid target release: 1.8
	at org.codehaus.plexus.compiler.javac.JavaxToolsCompiler.compileInProcess(JavaxToolsCompiler.java:172)
	at org.codehaus.plexus.compiler.javac.JavacCompiler.performCompile(JavacCompiler.java:169)
	at org.apache.maven.plugin.compiler.AbstractCompilerMojo.execute(AbstractCompilerMojo.java:825)
	... 34 more
Caused by: java.lang.IllegalArgumentException: invalid target release: 1.8
	at com.sun.tools.javac.main.RecognizedOptions$GrumpyHelper.error(RecognizedOptions.java:88)
	at com.sun.tools.javac.main.RecognizedOptions$10.process(RecognizedOptions.java:359)
	at com.sun.tools.javac.api.JavacTool.processOptions(JavacTool.java:242)
	at com.sun.tools.javac.api.JavacTool.getTask(JavacTool.java:199)
	at com.sun.tools.javac.api.JavacTool.getTask(JavacTool.java:68)
	at org.codehaus.plexus.compiler.javac.JavaxToolsCompiler.compileInProcess(JavaxToolsCompiler.java:123)
	... 36 more
[ERROR] Failed to execute goal org.apache.maven.plugins:maven-compiler-plugin:3.3:compile
(default-compile) on project activemq-client: Fatal error compiling: invalid target release:
1.8 -> [Help 1]
org.apache.maven.lifecycle.LifecycleExecutionException: Failed to execute goal org.apache.maven.plugins:maven-compiler-plugin:3.3:compile
(default-compile) on project activemq-client: Fatal error compiling
	at org.apache.maven.lifecycle.internal.MojoExecutor.execute(MojoExecutor.java:216)
	at org.apache.maven.lifecycle.internal.MojoExecutor.execute(MojoExecutor.java:153)
	at org.apache.maven.lifecycle.internal.MojoExecutor.execute(MojoExecutor.java:145)
	at org.apache.maven.lifecycle.internal.LifecycleModuleBuilder.buildProject(LifecycleModuleBuilder.java:116)
	at org.apache.maven.lifecycle.internal.LifecycleModuleBuilder.buildProject(LifecycleModuleBuilder.java:80)
	at org.apache.maven.lifecycle.internal.builder.singlethreaded.SingleThreadedBuilder.build(SingleThreadedBuilder.java:51)
	at org.apache.maven.lifecycle.internal.LifecycleStarter.execute(LifecycleStarter.java:128)
	at org.apache.maven.DefaultMaven.doExecute(DefaultMaven.java:307)
	at org.apache.maven.DefaultMaven.doExecute(DefaultMaven.java:193)
	at org.apache.maven.DefaultMaven.execute(DefaultMaven.java:106)
	at org.jvnet.hudson.maven3.launcher.Maven32Launcher.main(Maven32Launcher.java:132)
	at sun.reflect.NativeMethodAccessorImpl.invoke0(Native Method)
	at sun.reflect.NativeMethodAccessorImpl.invoke(NativeMethodAccessorImpl.java:57)
	at sun.reflect.DelegatingMethodAccessorImpl.invoke(DelegatingMethodAccessorImpl.java:43)
	at java.lang.reflect.Method.invoke(Method.java:606)
	at org.codehaus.plexus.classworlds.launcher.Launcher.launchStandard(Launcher.java:330)
	at org.codehaus.plexus.classworlds.launcher.Launcher.launch(Launcher.java:238)
	at jenkins.maven3.agent.Maven32Main.launch(Maven32Main.java:186)
	at sun.reflect.NativeMethodAccessorImpl.invoke0(Native Method)
	at sun.reflect.NativeMethodAccessorImpl.invoke(NativeMethodAccessorImpl.java:57)
	at sun.reflect.DelegatingMethodAccessorImpl.invoke(DelegatingMethodAccessorImpl.java:43)
	at java.lang.reflect.Method.invoke(Method.java:606)
	at hudson.maven.Maven3Builder.call(Maven3Builder.java:136)
	at hudson.maven.Maven3Builder.call(Maven3Builder.java:71)
	at hudson.remoting.UserRequest.perform(UserRequest.java:153)
	at hudson.remoting.UserRequest.perform(UserRequest.java:50)
	at hudson.remoting.Request$2.run(Request.java:332)
	at hudson.remoting.InterceptingExecutorService$1.call(InterceptingExecutorService.java:68)
	at java.util.concurrent.FutureTask.run(FutureTask.java:262)
	at java.util.concurrent.ThreadPoolExecutor.runWorker(ThreadPoolExecutor.java:1145)
	at java.util.concurrent.ThreadPoolExecutor$Worker.run(ThreadPoolExecutor.java:615)
	at java.lang.Thread.run(Thread.java:745)
Caused by: org.apache.maven.plugin.MojoExecutionException: Fatal error compiling
	at org.apache.maven.plugin.compiler.AbstractCompilerMojo.execute(AbstractCompilerMojo.java:836)
	at org.apache.maven.plugin.compiler.CompilerMojo.execute(CompilerMojo.java:129)
	at org.apache.maven.plugin.DefaultBuildPluginManager.executeMojo(DefaultBuildPluginManager.java:134)
	at org.apache.maven.lifecycle.internal.MojoExecutor.execute(MojoExecutor.java:208)
	... 31 more
Caused by: org.codehaus.plexus.compiler.CompilerException: invalid target release: 1.8
	at org.codehaus.plexus.compiler.javac.JavaxToolsCompiler.compileInProcess(JavaxToolsCompiler.java:172)
	at org.codehaus.plexus.compiler.javac.JavacCompiler.performCompile(JavacCompiler.java:169)
	at org.apache.maven.plugin.compiler.AbstractCompilerMojo.execute(AbstractCompilerMojo.java:825)
	... 34 more
Caused by: java.lang.IllegalArgumentException: invalid target release: 1.8
	at com.sun.tools.javac.main.RecognizedOptions$GrumpyHelper.error(RecognizedOptions.java:88)
	at com.sun.tools.javac.main.RecognizedOptions$10.process(RecognizedOptions.java:359)
	at com.sun.tools.javac.api.JavacTool.processOptions(JavacTool.java:242)
	at com.sun.tools.javac.api.JavacTool.getTask(JavacTool.java:199)
	at com.sun.tools.javac.api.JavacTool.getTask(JavacTool.java:68)
	at org.codehaus.plexus.compiler.javac.JavaxToolsCompiler.compileInProcess(JavaxToolsCompiler.java:123)
	... 36 more
[ERROR] Failed to execute goal org.apache.maven.plugins:maven-compiler-plugin:3.3:compile
(default-compile) on project activemq-jaas: Fatal error compiling: invalid target release:
1.8 -> [Help 1]
org.apache.maven.lifecycle.LifecycleExecutionException: Failed to execute goal org.apache.maven.plugins:maven-compiler-plugin:3.3:compile
(default-compile) on project activemq-jaas: Fatal error compiling
	at org.apache.maven.lifecycle.internal.MojoExecutor.execute(MojoExecutor.java:216)
	at org.apache.maven.lifecycle.internal.MojoExecutor.execute(MojoExecutor.java:153)
	at org.apache.maven.lifecycle.internal.MojoExecutor.execute(MojoExecutor.java:145)
	at org.apache.maven.lifecycle.internal.LifecycleModuleBuilder.buildProject(LifecycleModuleBuilder.java:116)
	at org.apache.maven.lifecycle.internal.LifecycleModuleBuilder.buildProject(LifecycleModuleBuilder.java:80)
	at org.apache.maven.lifecycle.internal.builder.singlethreaded.SingleThreadedBuilder.build(SingleThreadedBuilder.java:51)
	at org.apache.maven.lifecycle.internal.LifecycleStarter.execute(LifecycleStarter.java:128)
	at org.apache.maven.DefaultMaven.doExecute(DefaultMaven.java:307)
	at org.apache.maven.DefaultMaven.doExecute(DefaultMaven.java:193)
	at org.apache.maven.DefaultMaven.execute(DefaultMaven.java:106)
	at org.jvnet.hudson.maven3.launcher.Maven32Launcher.main(Maven32Launcher.java:132)
	at sun.reflect.NativeMethodAccessorImpl.invoke0(Native Method)
	at sun.reflect.NativeMethodAccessorImpl.invoke(NativeMethodAccessorImpl.java:57)
	at sun.reflect.DelegatingMethodAccessorImpl.invoke(DelegatingMethodAccessorImpl.java:43)
	at java.lang.reflect.Method.invoke(Method.java:606)
	at org.codehaus.plexus.classworlds.launcher.Launcher.launchStandard(Launcher.java:330)
	at org.codehaus.plexus.classworlds.launcher.Launcher.launch(Launcher.java:238)
	at jenkins.maven3.agent.Maven32Main.launch(Maven32Main.java:186)
	at sun.reflect.NativeMethodAccessorImpl.invoke0(Native Method)
	at sun.reflect.NativeMethodAccessorImpl.invoke(NativeMethodAccessorImpl.java:57)
	at sun.reflect.DelegatingMethodAccessorImpl.invoke(DelegatingMethodAccessorImpl.java:43)
	at java.lang.reflect.Method.invoke(Method.java:606)
	at hudson.maven.Maven3Builder.call(Maven3Builder.java:136)
	at hudson.maven.Maven3Builder.call(Maven3Builder.java:71)
	at hudson.remoting.UserRequest.perform(UserRequest.java:153)
	at hudson.remoting.UserRequest.perform(UserRequest.java:50)
	at hudson.remoting.Request$2.run(Request.java:332)
	at hudson.remoting.InterceptingExecutorService$1.call(InterceptingExecutorService.java:68)
	at java.util.concurrent.FutureTask.run(FutureTask.java:262)
	at java.util.concurrent.ThreadPoolExecutor.runWorker(ThreadPoolExecutor.java:1145)
	at java.util.concurrent.ThreadPoolExecutor$Worker.run(ThreadPoolExecutor.java:615)
	at java.lang.Thread.run(Thread.java:745)
Caused by: org.apache.maven.plugin.MojoExecutionException: Fatal error compiling
	at org.apache.maven.plugin.compiler.AbstractCompilerMojo.execute(AbstractCompilerMojo.java:836)
	at org.apache.maven.plugin.compiler.CompilerMojo.execute(CompilerMojo.java:129)
	at org.apache.maven.plugin.DefaultBuildPluginManager.executeMojo(DefaultBuildPluginManager.java:134)
	at org.apache.maven.lifecycle.internal.MojoExecutor.execute(MojoExecutor.java:208)
	... 31 more
Caused by: org.codehaus.plexus.compiler.CompilerException: invalid target release: 1.8
	at org.codehaus.plexus.compiler.javac.JavaxToolsCompiler.compileInProcess(JavaxToolsCompiler.java:172)
	at org.codehaus.plexus.compiler.javac.JavacCompiler.performCompile(JavacCompiler.java:169)
	at org.apache.maven.plugin.compiler.AbstractCompilerMojo.execute(AbstractCompilerMojo.java:825)
	... 34 more
Caused by: java.lang.IllegalArgumentException: invalid target release: 1.8
	at com.sun.tools.javac.main.RecognizedOptions$GrumpyHelper.error(RecognizedOptions.java:88)
	at com.sun.tools.javac.main.RecognizedOptions$10.process(RecognizedOptions.java:359)
	at com.sun.tools.javac.api.JavacTool.processOptions(JavacTool.java:242)
	at com.sun.tools.javac.api.JavacTool.getTask(JavacTool.java:199)
	at com.sun.tools.javac.api.JavacTool.getTask(JavacTool.java:68)
	at org.codehaus.plexus.compiler.javac.JavaxToolsCompiler.compileInProcess(JavaxToolsCompiler.java:123)
	... 36 more
[ERROR] 
[ERROR] Re-run Maven using the -X switch to enable full debug logging.
[ERROR] 
[ERROR] For more information about the errors and possible solutions, please read the following
articles:
[ERROR] [Help 1] http://cwiki.apache.org/confluence/display/MAVEN/MojoExecutionException
[ERROR] 
[ERROR] After correcting the problems, you can resume the build with the command
[ERROR]   mvn <goals> -rf :activemq-openwire-generator
[JENKINS] Archiving <https://builds.apache.org/job/ActiveMQ-Trunk-Deploy/ws/activemq-kahadb-store/pom.xml>
to org.apache.activemq/activemq-kahadb-store/5.15.0-SNAPSHOT/activemq-kahadb-store-5.15.0-SNAPSHOT.pom
No artifacts from ActiveMQ-Trunk-Deploy » ActiveMQ :: KahaDB Store #1712 to compare, so performing
full copy of artifacts
[JENKINS] Archiving <https://builds.apache.org/job/ActiveMQ-Trunk-Deploy/ws/activemq-osgi/pom.xml>
to org.apache.activemq/activemq-osgi/5.15.0-SNAPSHOT/activemq-osgi-5.15.0-SNAPSHOT.pom
No artifacts from ActiveMQ-Trunk-Deploy » ActiveMQ :: OSGi bundle #1712 to compare, so performing
full copy of artifacts
[JENKINS] Archiving <https://builds.apache.org/job/ActiveMQ-Trunk-Deploy/ws/activemq-unit-tests/pom.xml>
to org.apache.activemq/activemq-unit-tests/5.15.0-SNAPSHOT/activemq-unit-tests-5.15.0-SNAPSHOT.pom
No artifacts from ActiveMQ-Trunk-Deploy » ActiveMQ :: Unit Tests #1712 to compare, so performing
full copy of artifacts
[JENKINS] Archiving <https://builds.apache.org/job/ActiveMQ-Trunk-Deploy/ws/activemq-openwire-legacy/pom.xml>
to org.apache.activemq/activemq-openwire-legacy/5.15.0-SNAPSHOT/activemq-openwire-legacy-5.15.0-SNAPSHOT.pom
No artifacts from ActiveMQ-Trunk-Deploy » ActiveMQ :: Openwire Legacy Support #1712 to compare,
so performing full copy of artifacts
[JENKINS] Archiving <https://builds.apache.org/job/ActiveMQ-Trunk-Deploy/ws/activemq-karaf-itest/pom.xml>
to org.apache.activemq/activemq-karaf-itest/5.15.0-SNAPSHOT/activemq-karaf-itest-5.15.0-SNAPSHOT.pom
[JENKINS] Archiving <https://builds.apache.org/job/ActiveMQ-Trunk-Deploy/ws/activemq-rar/pom.xml>
to org.apache.activemq/activemq-rar/5.15.0-SNAPSHOT/activemq-rar-5.15.0-SNAPSHOT.pom
No artifacts from ActiveMQ-Trunk-Deploy » ActiveMQ :: RAR #1712 to compare, so performing
full copy of artifacts
[JENKINS] Archiving <https://builds.apache.org/job/ActiveMQ-Trunk-Deploy/ws/activemq-http/pom.xml>
to org.apache.activemq/activemq-http/5.15.0-SNAPSHOT/activemq-http-5.15.0-SNAPSHOT.pom
No artifacts from ActiveMQ-Trunk-Deploy » ActiveMQ :: HTTP Protocol Support #1712 to compare,
so performing full copy of artifacts
[JENKINS] Archiving <https://builds.apache.org/job/ActiveMQ-Trunk-Deploy/ws/activemq-amqp/pom.xml>
to org.apache.activemq/activemq-amqp/5.15.0-SNAPSHOT/activemq-amqp-5.15.0-SNAPSHOT.pom
No artifacts from ActiveMQ-Trunk-Deploy » ActiveMQ :: AMQP #1712 to compare, so performing
full copy of artifacts
[JENKINS] Archiving <https://builds.apache.org/job/ActiveMQ-Trunk-Deploy/ws/activemq-client/pom.xml>
to org.apache.activemq/activemq-client/5.15.0-SNAPSHOT/activemq-client-5.15.0-SNAPSHOT.pom
No artifacts from ActiveMQ-Trunk-Deploy » ActiveMQ :: Client #1712 to compare, so performing
full copy of artifacts
[JENKINS] Archiving <https://builds.apache.org/job/ActiveMQ-Trunk-Deploy/ws/activemq-blueprint/pom.xml>
to org.apache.activemq/activemq-blueprint/5.15.0-SNAPSHOT/activemq-blueprint-5.15.0-SNAPSHOT.pom
[JENKINS] Archiving <https://builds.apache.org/job/ActiveMQ-Trunk-Deploy/ws/activemq-blueprint/target/activemq-blueprint-5.15.0-SNAPSHOT.jar>
to org.apache.activemq/activemq-blueprint/5.15.0-20161027.032714-51/activemq-blueprint-5.15.0-20161027.032714-51.jar
[JENKINS] Archiving <https://builds.apache.org/job/ActiveMQ-Trunk-Deploy/ws/activemq-blueprint/target/activemq-blueprint-5.15.0-SNAPSHOT-sources.jar>
to org.apache.activemq/activemq-blueprint/5.15.0-20161027.032714-51/activemq-blueprint-5.15.0-20161027.032714-51-sources.jar
[JENKINS] Archiving <https://builds.apache.org/job/ActiveMQ-Trunk-Deploy/ws/activemq-tooling/activemq-junit/pom.xml>
to org.apache.activemq.tooling/activemq-junit/5.15.0-SNAPSHOT/activemq-junit-5.15.0-SNAPSHOT.pom
No artifacts from ActiveMQ-Trunk-Deploy » ActiveMQ :: JUnit Rule #1712 to compare, so performing
full copy of artifacts
[JENKINS] Archiving <https://builds.apache.org/job/ActiveMQ-Trunk-Deploy/ws/activemq-tooling/pom.xml>
to org.apache.activemq.tooling/activemq-tooling/5.15.0-SNAPSHOT/activemq-tooling-5.15.0-SNAPSHOT.pom
[JENKINS] Archiving <https://builds.apache.org/job/ActiveMQ-Trunk-Deploy/ws/activemq-jms-pool/pom.xml>
to org.apache.activemq/activemq-jms-pool/5.15.0-SNAPSHOT/activemq-jms-pool-5.15.0-SNAPSHOT.pom
No artifacts from ActiveMQ-Trunk-Deploy » ActiveMQ :: Generic JMS Pool #1712 to compare,
so performing full copy of artifacts
[JENKINS] Archiving <https://builds.apache.org/job/ActiveMQ-Trunk-Deploy/ws/activemq-pool/pom.xml>
to org.apache.activemq/activemq-pool/5.15.0-SNAPSHOT/activemq-pool-5.15.0-SNAPSHOT.pom
No artifacts from ActiveMQ-Trunk-Deploy » ActiveMQ :: Pool #1712 to compare, so performing
full copy of artifacts
[JENKINS] Archiving <https://builds.apache.org/job/ActiveMQ-Trunk-Deploy/ws/activemq-jdbc-store/pom.xml>
to org.apache.activemq/activemq-jdbc-store/5.15.0-SNAPSHOT/activemq-jdbc-store-5.15.0-SNAPSHOT.pom
No artifacts from ActiveMQ-Trunk-Deploy » ActiveMQ :: JDBC Store #1712 to compare, so performing
full copy of artifacts
[JENKINS] Archiving <https://builds.apache.org/job/ActiveMQ-Trunk-Deploy/ws/activemq-camel/pom.xml>
to org.apache.activemq/activemq-camel/5.15.0-SNAPSHOT/activemq-camel-5.15.0-SNAPSHOT.pom
No artifacts from ActiveMQ-Trunk-Deploy » ActiveMQ :: Camel #1712 to compare, so performing
full copy of artifacts
[JENKINS] Archiving <https://builds.apache.org/job/ActiveMQ-Trunk-Deploy/ws/activemq-runtime-config/pom.xml>
to org.apache.activemq/activemq-runtime-config/5.15.0-SNAPSHOT/activemq-runtime-config-5.15.0-SNAPSHOT.pom
No artifacts from ActiveMQ-Trunk-Deploy » ActiveMQ :: Runtime Configuration #1712 to compare,
so performing full copy of artifacts
[JENKINS] Archiving <https://builds.apache.org/job/ActiveMQ-Trunk-Deploy/ws/pom.xml>
to org.apache.activemq/activemq-parent/5.15.0-SNAPSHOT/activemq-parent-5.15.0-SNAPSHOT.pom
Compressed 59.82 KB of artifacts by 53.5% relative to #1714
[JENKINS] Archiving <https://builds.apache.org/job/ActiveMQ-Trunk-Deploy/ws/activemq-stomp/pom.xml>
to org.apache.activemq/activemq-stomp/5.15.0-SNAPSHOT/activemq-stomp-5.15.0-SNAPSHOT.pom
No artifacts from ActiveMQ-Trunk-Deploy » ActiveMQ :: STOMP Protocol #1712 to compare, so
performing full copy of artifacts
[JENKINS] Archiving <https://builds.apache.org/job/ActiveMQ-Trunk-Deploy/ws/activemq-openwire-generator/pom.xml>
to org.apache.activemq/activemq-openwire-generator/5.15.0-SNAPSHOT/activemq-openwire-generator-5.15.0-SNAPSHOT.pom
No artifacts from ActiveMQ-Trunk-Deploy » ActiveMQ :: Openwire Generator #1712 to compare,
so performing full copy of artifacts
[JENKINS] Archiving <https://builds.apache.org/job/ActiveMQ-Trunk-Deploy/ws/activemq-broker/pom.xml>
to org.apache.activemq/activemq-broker/5.15.0-SNAPSHOT/activemq-broker-5.15.0-SNAPSHOT.pom
No artifacts from ActiveMQ-Trunk-Deploy » ActiveMQ :: Broker #1712 to compare, so performing
full copy of artifacts
[JENKINS] Archiving <https://builds.apache.org/job/ActiveMQ-Trunk-Deploy/ws/activemq-web-demo/pom.xml>
to org.apache.activemq/activemq-web-demo/5.15.0-SNAPSHOT/activemq-web-demo-5.15.0-SNAPSHOT.pom
[JENKINS] Archiving <https://builds.apache.org/job/ActiveMQ-Trunk-Deploy/ws/activemq-mqtt/pom.xml>
to org.apache.activemq/activemq-mqtt/5.15.0-SNAPSHOT/activemq-mqtt-5.15.0-SNAPSHOT.pom
No artifacts from ActiveMQ-Trunk-Deploy » ActiveMQ :: MQTT Protocol #1712 to compare, so
performing full copy of artifacts
[JENKINS] Archiving <https://builds.apache.org/job/ActiveMQ-Trunk-Deploy/ws/activemq-shiro/pom.xml>
to org.apache.activemq/activemq-shiro/5.15.0-SNAPSHOT/activemq-shiro-5.15.0-SNAPSHOT.pom
No artifacts from ActiveMQ-Trunk-Deploy » ActiveMQ :: Shiro #1712 to compare, so performing
full copy of artifacts
[JENKINS] Archiving <https://builds.apache.org/job/ActiveMQ-Trunk-Deploy/ws/activemq-tooling/activemq-perf-maven-plugin/pom.xml>
to org.apache.activemq.tooling/activemq-perf-maven-plugin/5.15.0-SNAPSHOT/activemq-perf-maven-plugin-5.15.0-SNAPSHOT.pom
No artifacts from ActiveMQ-Trunk-Deploy » ActiveMQ :: Performance Test Plugin #1712 to compare,
so performing full copy of artifacts
[JENKINS] Archiving <https://builds.apache.org/job/ActiveMQ-Trunk-Deploy/ws/activemq-run/pom.xml>
to org.apache.activemq/activemq-run/5.15.0-SNAPSHOT/activemq-run-5.15.0-SNAPSHOT.pom
No artifacts from ActiveMQ-Trunk-Deploy » ActiveMQ :: Run Jar #1712 to compare, so performing
full copy of artifacts
[JENKINS] Archiving <https://builds.apache.org/job/ActiveMQ-Trunk-Deploy/ws/activemq-tooling/activemq-maven-plugin/pom.xml>
to org.apache.activemq.tooling/activemq-maven-plugin/5.15.0-SNAPSHOT/activemq-maven-plugin-5.15.0-SNAPSHOT.pom
No artifacts from ActiveMQ-Trunk-Deploy » ActiveMQ :: StartUp/Stop Plugin #1712 to compare,
so performing full copy of artifacts
[JENKINS] Archiving <https://builds.apache.org/job/ActiveMQ-Trunk-Deploy/ws/activemq-karaf/pom.xml>
to org.apache.activemq/activemq-karaf/5.15.0-SNAPSHOT/activemq-karaf-5.15.0-SNAPSHOT.pom
No artifacts from ActiveMQ-Trunk-Deploy » ActiveMQ :: Apache Karaf #1712 to compare, so performing
full copy of artifacts
[JENKINS] Archiving <https://builds.apache.org/job/ActiveMQ-Trunk-Deploy/ws/activemq-web-console/pom.xml>
to org.apache.activemq/activemq-web-console/5.15.0-SNAPSHOT/activemq-web-console-5.15.0-SNAPSHOT.pom
[JENKINS] Archiving <https://builds.apache.org/job/ActiveMQ-Trunk-Deploy/ws/activemq-jaas/pom.xml>
to org.apache.activemq/activemq-jaas/5.15.0-SNAPSHOT/activemq-jaas-5.15.0-SNAPSHOT.pom
No artifacts from ActiveMQ-Trunk-Deploy » ActiveMQ :: JAAS #1712 to compare, so performing
full copy of artifacts
[JENKINS] Archiving <https://builds.apache.org/job/ActiveMQ-Trunk-Deploy/ws/activemq-itests-spring31/pom.xml>
to org.apache.activemq/activemq-itests-spring31/5.15.0-SNAPSHOT/activemq-itests-spring31-5.15.0-SNAPSHOT.pom
[JENKINS] Archiving <https://builds.apache.org/job/ActiveMQ-Trunk-Deploy/ws/activemq-tooling/activemq-memtest-maven-plugin/pom.xml>
to org.apache.activemq.tooling/activemq-memtest-maven-plugin/5.15.0-SNAPSHOT/activemq-memtest-maven-plugin-5.15.0-SNAPSHOT.pom
No artifacts from ActiveMQ-Trunk-Deploy » ActiveMQ :: Memory Usage Test Plugin #1712 to compare,
so performing full copy of artifacts
[JENKINS] Archiving <https://builds.apache.org/job/ActiveMQ-Trunk-Deploy/ws/activemq-ra/pom.xml>
to org.apache.activemq/activemq-ra/5.15.0-SNAPSHOT/activemq-ra-5.15.0-SNAPSHOT.pom
No artifacts from ActiveMQ-Trunk-Deploy » ActiveMQ :: RA #1712 to compare, so performing
full copy of artifacts
[JENKINS] Archiving <https://builds.apache.org/job/ActiveMQ-Trunk-Deploy/ws/activemq-partition/pom.xml>
to org.apache.activemq/activemq-partition/5.15.0-SNAPSHOT/activemq-partition-5.15.0-SNAPSHOT.pom
No artifacts from ActiveMQ-Trunk-Deploy » ActiveMQ :: Partition Management #1712 to compare,
so performing full copy of artifacts
[JENKINS] Archiving <https://builds.apache.org/job/ActiveMQ-Trunk-Deploy/ws/activemq-all/pom.xml>
to org.apache.activemq/activemq-all/5.15.0-SNAPSHOT/activemq-all-5.15.0-SNAPSHOT.pom
No artifacts from ActiveMQ-Trunk-Deploy » ActiveMQ :: All JAR bundle #1712 to compare, so
performing full copy of artifacts
[JENKINS] Archiving <https://builds.apache.org/job/ActiveMQ-Trunk-Deploy/ws/assembly/pom.xml>
to org.apache.activemq/apache-activemq/5.15.0-SNAPSHOT/apache-activemq-5.15.0-SNAPSHOT.pom
[JENKINS] Archiving <https://builds.apache.org/job/ActiveMQ-Trunk-Deploy/ws/activemq-console/pom.xml>
to org.apache.activemq/activemq-console/5.15.0-SNAPSHOT/activemq-console-5.15.0-SNAPSHOT.pom
No artifacts from ActiveMQ-Trunk-Deploy » ActiveMQ :: Console #1712 to compare, so performing
full copy of artifacts
[JENKINS] Archiving <https://builds.apache.org/job/ActiveMQ-Trunk-Deploy/ws/activemq-spring/pom.xml>
to org.apache.activemq/activemq-spring/5.15.0-SNAPSHOT/activemq-spring-5.15.0-SNAPSHOT.pom
No artifacts from ActiveMQ-Trunk-Deploy » ActiveMQ :: Spring #1712 to compare, so performing
full copy of artifacts
[JENKINS] Archiving <https://builds.apache.org/job/ActiveMQ-Trunk-Deploy/ws/activemq-cf/pom.xml>
to org.apache.activemq/activemq-cf/5.15.0-SNAPSHOT/activemq-cf-5.15.0-SNAPSHOT.pom
No artifacts from ActiveMQ-Trunk-Deploy » ActiveMQ :: ConnectionFactory #1712 to compare,
so performing full copy of artifacts
[JENKINS] Archiving <https://builds.apache.org/job/ActiveMQ-Trunk-Deploy/ws/activemq-leveldb-store/pom.xml>
to org.apache.activemq/activemq-leveldb-store/5.15.0-SNAPSHOT/activemq-leveldb-store-5.15.0-SNAPSHOT.pom
No artifacts from ActiveMQ-Trunk-Deploy » ActiveMQ :: LevelDB Store #1712 to compare, so
performing full copy of artifacts
[JENKINS] Archiving <https://builds.apache.org/job/ActiveMQ-Trunk-Deploy/ws/activemq-web/pom.xml>
to org.apache.activemq/activemq-web/5.15.0-SNAPSHOT/activemq-web-5.15.0-SNAPSHOT.pom
No artifacts from ActiveMQ-Trunk-Deploy » ActiveMQ :: Web #1712 to compare, so performing
full copy of artifacts
[JENKINS] Archiving <https://builds.apache.org/job/ActiveMQ-Trunk-Deploy/ws/activemq-log4j-appender/pom.xml>
to org.apache.activemq/activemq-log4j-appender/5.15.0-SNAPSHOT/activemq-log4j-appender-5.15.0-SNAPSHOT.pom
No artifacts from ActiveMQ-Trunk-Deploy » ActiveMQ :: Log4j Appender #1712 to compare, so
performing full copy of artifacts
Sending e-mails to: commits@activemq.apache.org
Sending e-mails to: commits@activemq.apache.org
Sending e-mails to: commits@activemq.apache.org
channel stopped

Mime
View raw message