activemq-commits mailing list archives

Site index · List index
Message view « Date » · « Thread »
Top « Date » · « Thread »
From Apache Jenkins Server <jenk...@builds.apache.org>
Subject Build failed in Jenkins: ActiveMQ-Java7 » ActiveMQ :: Unit Tests #1170
Date Thu, 20 Oct 2016 14:48:09 GMT
See <https://builds.apache.org/job/ActiveMQ-Java7/org.apache.activemq$activemq-unit-tests/1170/>

------------------------------------------
[...truncated 554 lines...]
Tests run: 3, Failures: 0, Errors: 0, Skipped: 2, Time elapsed: 0.683 sec - in org.apache.activemq.bugs.AMQ4853Test
Running org.apache.activemq.bugs.AMQ4887Test
Tests run: 4, Failures: 0, Errors: 0, Skipped: 0, Time elapsed: 1.374 sec - in org.apache.activemq.bugs.AMQ4887Test
Running org.apache.activemq.bugs.AMQ4893Test
Tests run: 4, Failures: 0, Errors: 0, Skipped: 0, Time elapsed: 0.225 sec - in org.apache.activemq.bugs.AMQ4893Test
Running org.apache.activemq.bugs.AMQ4899Test
Tests run: 1, Failures: 0, Errors: 0, Skipped: 0, Time elapsed: 1.078 sec - in org.apache.activemq.bugs.AMQ4899Test
Running org.apache.activemq.bugs.AMQ4930Test
Tests run: 3, Failures: 0, Errors: 0, Skipped: 0, Time elapsed: 9.102 sec - in org.apache.activemq.bugs.AMQ4930Test
Running org.apache.activemq.bugs.AMQ4950Test
Tests run: 1, Failures: 0, Errors: 0, Skipped: 0, Time elapsed: 1.469 sec - in org.apache.activemq.bugs.AMQ4950Test
Running org.apache.activemq.bugs.AMQ4952Test
Tests run: 2, Failures: 0, Errors: 0, Skipped: 0, Time elapsed: 20.007 sec - in org.apache.activemq.bugs.AMQ4952Test
Running org.apache.activemq.bugs.AMQ5035Test
Tests run: 1, Failures: 0, Errors: 0, Skipped: 0, Time elapsed: 2.949 sec - in org.apache.activemq.bugs.AMQ5035Test
Running org.apache.activemq.bugs.AMQ5136Test
Tests run: 2, Failures: 0, Errors: 0, Skipped: 0, Time elapsed: 0.888 sec - in org.apache.activemq.bugs.AMQ5136Test
Running org.apache.activemq.bugs.AMQ5212Test
Tests run: 10, Failures: 0, Errors: 0, Skipped: 0, Time elapsed: 15.767 sec - in org.apache.activemq.bugs.AMQ5212Test
Running org.apache.activemq.bugs.AMQ5266SingleDestTest
Tests run: 3, Failures: 0, Errors: 0, Skipped: 0, Time elapsed: 113.473 sec - in org.apache.activemq.bugs.AMQ5266SingleDestTest
Running org.apache.activemq.bugs.AMQ5274Test
Tests run: 1, Failures: 0, Errors: 0, Skipped: 0, Time elapsed: 15.156 sec - in org.apache.activemq.bugs.AMQ5274Test
Running org.apache.activemq.bugs.AMQ5336Test
Tests run: 1, Failures: 0, Errors: 0, Skipped: 0, Time elapsed: 1.386 sec - in org.apache.activemq.bugs.AMQ5336Test
Running org.apache.activemq.bugs.AMQ5381Test
Tests run: 1, Failures: 0, Errors: 0, Skipped: 0, Time elapsed: 0.862 sec - in org.apache.activemq.bugs.AMQ5381Test
Running org.apache.activemq.bugs.AMQ5421Test
Tests run: 1, Failures: 0, Errors: 0, Skipped: 0, Time elapsed: 4.083 sec - in org.apache.activemq.bugs.AMQ5421Test
Running org.apache.activemq.bugs.AMQ5426Test
Tests run: 1, Failures: 0, Errors: 0, Skipped: 0, Time elapsed: 10.608 sec - in org.apache.activemq.bugs.AMQ5426Test
Running org.apache.activemq.bugs.AMQ5450Test
Tests run: 2, Failures: 0, Errors: 0, Skipped: 0, Time elapsed: 3.281 sec - in org.apache.activemq.bugs.AMQ5450Test
Running org.apache.activemq.bugs.AMQ5486Test
Tests run: 1, Failures: 0, Errors: 0, Skipped: 0, Time elapsed: 1.791 sec - in org.apache.activemq.bugs.AMQ5486Test
Running org.apache.activemq.bugs.AMQ5567Test
Tests run: 6, Failures: 0, Errors: 0, Skipped: 0, Time elapsed: 36.002 sec - in org.apache.activemq.bugs.AMQ5567Test
Running org.apache.activemq.bugs.AMQ5712Test
Tests run: 1, Failures: 0, Errors: 0, Skipped: 0, Time elapsed: 31.34 sec - in org.apache.activemq.bugs.AMQ5712Test
Running org.apache.activemq.bugs.AMQ5814Test
Tests run: 1, Failures: 0, Errors: 0, Skipped: 0, Time elapsed: 1.023 sec - in org.apache.activemq.bugs.AMQ5814Test
Running org.apache.activemq.bugs.AMQ5822Test
Tests run: 1, Failures: 0, Errors: 0, Skipped: 0, Time elapsed: 3.306 sec - in org.apache.activemq.bugs.AMQ5822Test
Running org.apache.activemq.bugs.AMQ5844Test
Tests run: 1, Failures: 1, Errors: 0, Skipped: 0, Time elapsed: 6.556 sec <<< FAILURE!
- in org.apache.activemq.bugs.AMQ5844Test
testRecreateAbortedConsumer(org.apache.activemq.bugs.AMQ5844Test)  Time elapsed: 6.375 sec
 <<< FAILURE!
java.lang.AssertionError: expected null, but was:<ActiveMQTextMessage {commandId = 6, responseRequired
= false, messageId = ID:jenkins-ubuntu2.apache.org-33785-1476973891584-4:1:1:1:2, originalDestination
= null, originalTransactionId = null, producerId = ID:jenkins-ubuntu2.apache.org-33785-1476973891584-4:1:1:1,
destination = queue://TEST.QUEUE, transactionId = TX:ID:jenkins-ubuntu2.apache.org-33785-1476973891584-4:1:1,
expiration = 0, timestamp = 1476973891962, arrival = 0, brokerInTime = 1476973891965, brokerOutTime
= 1476973897021, correlationId = null, replyTo = null, persistent = false, type = null, priority
= 1, groupID = null, groupSequence = 0, targetConsumerId = null, compressed = false, userID
= null, content = org.apache.activemq.util.ByteSequence@3a6749fd, marshalledProperties = null,
dataStructure = null, redeliveryCounter = 0, size = 0, properties = null, readOnlyProperties
= true, readOnlyBody = true, droppable = false, jmsXGroupFirstForConsumer = false, text =
Plain Text Message}>
	at org.junit.Assert.fail(Assert.java:88)
	at org.junit.Assert.failNotNull(Assert.java:755)
	at org.junit.Assert.assertNull(Assert.java:737)
	at org.junit.Assert.assertNull(Assert.java:747)
	at org.apache.activemq.bugs.AMQ5844Test.testRecreateAbortedConsumer(AMQ5844Test.java:206)

Running org.apache.activemq.bugs.AMQ5863CompositePublishTest
Tests run: 3, Failures: 0, Errors: 0, Skipped: 0, Time elapsed: 4.172 sec - in org.apache.activemq.bugs.AMQ5863CompositePublishTest
Running org.apache.activemq.bugs.AMQ5893Test
Tests run: 2, Failures: 0, Errors: 0, Skipped: 0, Time elapsed: 1.222 sec - in org.apache.activemq.bugs.AMQ5893Test
Running org.apache.activemq.bugs.AMQ5914Test
Tests run: 1, Failures: 0, Errors: 0, Skipped: 0, Time elapsed: 2.367 sec - in org.apache.activemq.bugs.AMQ5914Test
Running org.apache.activemq.bugs.AMQ5921Test
Tests run: 1, Failures: 0, Errors: 0, Skipped: 0, Time elapsed: 0.856 sec - in org.apache.activemq.bugs.AMQ5921Test
Running org.apache.activemq.bugs.AMQ6000Test
Tests run: 1, Failures: 0, Errors: 0, Skipped: 0, Time elapsed: 1.169 sec - in org.apache.activemq.bugs.AMQ6000Test
Running org.apache.activemq.bugs.AMQ6059Test
Tests run: 1, Failures: 0, Errors: 0, Skipped: 0, Time elapsed: 4.91 sec - in org.apache.activemq.bugs.AMQ6059Test
Running org.apache.activemq.bugs.AMQ6094Test
Tests run: 1, Failures: 0, Errors: 0, Skipped: 0, Time elapsed: 71.234 sec - in org.apache.activemq.bugs.AMQ6094Test
Running org.apache.activemq.bugs.AMQ6117Test
Tests run: 1, Failures: 0, Errors: 0, Skipped: 0, Time elapsed: 3.482 sec - in org.apache.activemq.bugs.AMQ6117Test
Running org.apache.activemq.bugs.AMQ6121Test
Tests run: 1, Failures: 0, Errors: 0, Skipped: 0, Time elapsed: 9.796 sec - in org.apache.activemq.bugs.AMQ6121Test
Running org.apache.activemq.bugs.AMQ6122Test
Tests run: 1, Failures: 0, Errors: 0, Skipped: 0, Time elapsed: 2.811 sec - in org.apache.activemq.bugs.AMQ6122Test
Running org.apache.activemq.bugs.AMQ6125Test
Tests run: 1, Failures: 0, Errors: 0, Skipped: 0, Time elapsed: 0.744 sec - in org.apache.activemq.bugs.AMQ6125Test
Running org.apache.activemq.bugs.AMQ6131Test
Tests run: 2, Failures: 0, Errors: 0, Skipped: 0, Time elapsed: 21.262 sec - in org.apache.activemq.bugs.AMQ6131Test
Running org.apache.activemq.bugs.AMQ6133PersistJMSRedeliveryTest
Tests run: 1, Failures: 0, Errors: 0, Skipped: 0, Time elapsed: 23.996 sec - in org.apache.activemq.bugs.AMQ6133PersistJMSRedeliveryTest
Running org.apache.activemq.bugs.AMQ6194Test
Tests run: 2, Failures: 0, Errors: 0, Skipped: 0, Time elapsed: 1.076 sec - in org.apache.activemq.bugs.AMQ6194Test
Running org.apache.activemq.bugs.AMQ6240Test
Tests run: 1, Failures: 0, Errors: 0, Skipped: 0, Time elapsed: 7.363 sec - in org.apache.activemq.bugs.AMQ6240Test
Running org.apache.activemq.bugs.AMQ6244Test
Tests run: 1, Failures: 0, Errors: 0, Skipped: 0, Time elapsed: 0.812 sec - in org.apache.activemq.bugs.AMQ6244Test
Running org.apache.activemq.bugs.AMQ6254Test
Tests run: 4, Failures: 0, Errors: 0, Skipped: 0, Time elapsed: 5.308 sec - in org.apache.activemq.bugs.AMQ6254Test
Running org.apache.activemq.bugs.AMQ6264Test
Tests run: 1, Failures: 0, Errors: 0, Skipped: 0, Time elapsed: 4.59 sec - in org.apache.activemq.bugs.AMQ6264Test
Running org.apache.activemq.bugs.AMQ6293Test
Tests run: 1, Failures: 0, Errors: 0, Skipped: 0, Time elapsed: 3.677 sec - in org.apache.activemq.bugs.AMQ6293Test
Running org.apache.activemq.bugs.AMQ6387Test
Tests run: 4, Failures: 0, Errors: 0, Skipped: 0, Time elapsed: 1.415 sec - in org.apache.activemq.bugs.AMQ6387Test
Running org.apache.activemq.bugs.AMQ6459Test
Tests run: 1, Failures: 0, Errors: 0, Skipped: 0, Time elapsed: 18.433 sec - in org.apache.activemq.bugs.AMQ6459Test
Running org.apache.activemq.bugs.AMQ6463Test
Tests run: 1, Failures: 0, Errors: 0, Skipped: 0, Time elapsed: 7.049 sec - in org.apache.activemq.bugs.AMQ6463Test
Running org.apache.activemq.bugs.JMSQueueBrowserPriorityTest
Tests run: 1, Failures: 0, Errors: 0, Skipped: 0, Time elapsed: 12.661 sec - in org.apache.activemq.bugs.JMSQueueBrowserPriorityTest
Running org.apache.activemq.bugs.MemoryUsageBrokerTest
Tests run: 1, Failures: 0, Errors: 0, Skipped: 0, Time elapsed: 15.639 sec - in org.apache.activemq.bugs.MemoryUsageBrokerTest
Running org.apache.activemq.bugs.MessageExpiryClientSideTest
Tests run: 4, Failures: 0, Errors: 0, Skipped: 0, Time elapsed: 1.82 sec - in org.apache.activemq.bugs.MessageExpiryClientSideTest
Running org.apache.activemq.bugs.MessageExpiryTimeDifferenceTest
Tests run: 1, Failures: 0, Errors: 0, Skipped: 0, Time elapsed: 1.947 sec - in org.apache.activemq.bugs.MessageExpiryTimeDifferenceTest
Running org.apache.activemq.bugs.OptimizeAcknowledgeWithExpiredMsgsTest
Tests run: 3, Failures: 0, Errors: 0, Skipped: 0, Time elapsed: 3.32 sec - in org.apache.activemq.bugs.OptimizeAcknowledgeWithExpiredMsgsTest
Running org.apache.activemq.bugs.RedeliveryPluginHeaderTest
Tests run: 1, Failures: 0, Errors: 0, Skipped: 0, Time elapsed: 6.088 sec - in org.apache.activemq.bugs.RedeliveryPluginHeaderTest
Running org.apache.activemq.bugs.SparseAckReplayAfterStoreCleanupLevelDBStoreTest
Tests run: 4, Failures: 0, Errors: 0, Skipped: 0, Time elapsed: 4.343 sec - in org.apache.activemq.bugs.SparseAckReplayAfterStoreCleanupLevelDBStoreTest
Running org.apache.activemq.bugs.TempQueueDeleteOnCloseTest
Tests run: 1, Failures: 0, Errors: 0, Skipped: 0, Time elapsed: 1.055 sec - in org.apache.activemq.bugs.TempQueueDeleteOnCloseTest
Running org.apache.activemq.bugs.TempStorageConfigBrokerTest
Tests run: 2, Failures: 0, Errors: 0, Skipped: 2, Time elapsed: 0.091 sec - in org.apache.activemq.bugs.TempStorageConfigBrokerTest
Running org.apache.activemq.bugs.TransactedStoreUsageSuspendResumeTest
Tests run: 1, Failures: 0, Errors: 0, Skipped: 0, Time elapsed: 78.289 sec - in org.apache.activemq.bugs.TransactedStoreUsageSuspendResumeTest
Running org.apache.activemq.bugs.TrapMessageInJDBCStoreTest
Tests run: 1, Failures: 0, Errors: 0, Skipped: 0, Time elapsed: 6.895 sec - in org.apache.activemq.bugs.TrapMessageInJDBCStoreTest
Running org.apache.activemq.command.ActiveMQBytesMessageTest
Tests run: 19, Failures: 0, Errors: 0, Skipped: 0, Time elapsed: 0.084 sec - in org.apache.activemq.command.ActiveMQBytesMessageTest
Running org.apache.activemq.command.ActiveMQConcurrentDecompressionTest
Tests run: 1, Failures: 0, Errors: 0, Skipped: 0, Time elapsed: 1.884 sec - in org.apache.activemq.command.ActiveMQConcurrentDecompressionTest
Running org.apache.activemq.command.ActiveMQDestinationTest
Tests run: 14, Failures: 0, Errors: 0, Skipped: 0, Time elapsed: 0.2 sec - in org.apache.activemq.command.ActiveMQDestinationTest
Running org.apache.activemq.command.ActiveMQMapMessageTest
Tests run: 20, Failures: 0, Errors: 0, Skipped: 0, Time elapsed: 0.324 sec - in org.apache.activemq.command.ActiveMQMapMessageTest
Running org.apache.activemq.command.ActiveMQMessageTest
Tests run: 51, Failures: 0, Errors: 0, Skipped: 0, Time elapsed: 0.28 sec - in org.apache.activemq.command.ActiveMQMessageTest
Running org.apache.activemq.command.ActiveMQObjectMessageTest
Tests run: 5, Failures: 0, Errors: 0, Skipped: 0, Time elapsed: 0.165 sec - in org.apache.activemq.command.ActiveMQObjectMessageTest
Running org.apache.activemq.command.ActiveMQStreamMessageTest
Tests run: 18, Failures: 0, Errors: 0, Skipped: 0, Time elapsed: 0.305 sec - in org.apache.activemq.command.ActiveMQStreamMessageTest
Running org.apache.activemq.command.ActiveMQTextMessageTest
Tests run: 10, Failures: 0, Errors: 0, Skipped: 0, Time elapsed: 0.184 sec - in org.apache.activemq.command.ActiveMQTextMessageTest
Running org.apache.activemq.command.MessageSendTest
Tests run: 2, Failures: 0, Errors: 0, Skipped: 0, Time elapsed: 0.236 sec - in org.apache.activemq.command.MessageSendTest
Running org.apache.activemq.command.MessageTest
Tests run: 7, Failures: 0, Errors: 0, Skipped: 0, Time elapsed: 0.245 sec - in org.apache.activemq.command.MessageTest
Running org.apache.activemq.config.BrokerPropertiesTest
Tests run: 2, Failures: 0, Errors: 0, Skipped: 0, Time elapsed: 0.666 sec - in org.apache.activemq.config.BrokerPropertiesTest
Running org.apache.activemq.config.BrokerXmlConfigTest
Tests run: 1, Failures: 0, Errors: 0, Skipped: 0, Time elapsed: 1.252 sec - in org.apache.activemq.config.BrokerXmlConfigTest
Running org.apache.activemq.config.JDBCConfigTest
Tests run: 1, Failures: 0, Errors: 0, Skipped: 0, Time elapsed: 3.969 sec - in org.apache.activemq.config.JDBCConfigTest
Running org.apache.activemq.console.command.AMQ3410Test
Tests run: 5, Failures: 0, Errors: 0, Skipped: 0, Time elapsed: 7.298 sec - in org.apache.activemq.console.command.AMQ3410Test
Running org.apache.activemq.console.command.AMQ3411Test
Tests run: 5, Failures: 0, Errors: 0, Skipped: 0, Time elapsed: 4.688 sec - in org.apache.activemq.console.command.AMQ3411Test
Running org.apache.activemq.console.command.PurgeCommandTest
Tests run: 6, Failures: 0, Errors: 0, Skipped: 0, Time elapsed: 5.693 sec - in org.apache.activemq.console.command.PurgeCommandTest
Running org.apache.activemq.filter.DestinationFilterTest
Tests run: 5, Failures: 0, Errors: 0, Skipped: 0, Time elapsed: 0.065 sec - in org.apache.activemq.filter.DestinationFilterTest
Running org.apache.activemq.filter.DestinationMapMemoryTest
Tests run: 2, Failures: 0, Errors: 0, Skipped: 0, Time elapsed: 0.095 sec - in org.apache.activemq.filter.DestinationMapMemoryTest
Running org.apache.activemq.filter.DestinationMapTempDestinationTest
Tests run: 1, Failures: 0, Errors: 0, Skipped: 0, Time elapsed: 0.32 sec - in org.apache.activemq.filter.DestinationMapTempDestinationTest
Running org.apache.activemq.filter.DestinationMapTest
Tests run: 17, Failures: 0, Errors: 0, Skipped: 0, Time elapsed: 0.084 sec - in org.apache.activemq.filter.DestinationMapTest
Running org.apache.activemq.filter.DestinationPathTest
Tests run: 1, Failures: 0, Errors: 0, Skipped: 0, Time elapsed: 0.146 sec - in org.apache.activemq.filter.DestinationPathTest
Running org.apache.activemq.filter.DummyPolicyTest
Tests run: 1, Failures: 0, Errors: 0, Skipped: 0, Time elapsed: 0.51 sec - in org.apache.activemq.filter.DummyPolicyTest
Running org.apache.activemq.jmx.JmxAuditLogTest
Tests run: 1, Failures: 0, Errors: 0, Skipped: 0, Time elapsed: 1.218 sec - in org.apache.activemq.jmx.JmxAuditLogTest
Running org.apache.activemq.jmx.JmxCreateNCTest
Tests run: 1, Failures: 0, Errors: 0, Skipped: 0, Time elapsed: 1.205 sec - in org.apache.activemq.jmx.JmxCreateNCTest
Running org.apache.activemq.jmx.OpenTypeSupportTest
Tests run: 2, Failures: 0, Errors: 0, Skipped: 0, Time elapsed: 1.09 sec - in org.apache.activemq.jmx.OpenTypeSupportTest
Running org.apache.activemq.jmx.TotalMessageCountTest
Tests run: 1, Failures: 0, Errors: 0, Skipped: 0, Time elapsed: 1.529 sec - in org.apache.activemq.jmx.TotalMessageCountTest
Running org.apache.activemq.jndi.ActiveMQInitialContextFactoryTest
Tests run: 3, Failures: 0, Errors: 0, Skipped: 0, Time elapsed: 0.222 sec - in org.apache.activemq.jndi.ActiveMQInitialContextFactoryTest
Running org.apache.activemq.jndi.ActiveMQWASInitialContextFactoryTest
Tests run: 1, Failures: 0, Errors: 0, Skipped: 0, Time elapsed: 0.207 sec - in org.apache.activemq.jndi.ActiveMQWASInitialContextFactoryTest
Running org.apache.activemq.jndi.CustomConnectionFactoryNameTest
Tests run: 4, Failures: 0, Errors: 0, Skipped: 0, Time elapsed: 0.268 sec - in org.apache.activemq.jndi.CustomConnectionFactoryNameTest
Running org.apache.activemq.jndi.DestinationNameWithSlashTest
Tests run: 1, Failures: 0, Errors: 0, Skipped: 0, Time elapsed: 0.206 sec - in org.apache.activemq.jndi.DestinationNameWithSlashTest
Running org.apache.activemq.jndi.InitialContextTest
Tests run: 4, Failures: 0, Errors: 0, Skipped: 0, Time elapsed: 0.223 sec - in org.apache.activemq.jndi.InitialContextTest
Running org.apache.activemq.jndi.ObjectFactoryTest
Tests run: 2, Failures: 0, Errors: 0, Skipped: 0, Time elapsed: 0.213 sec - in org.apache.activemq.jndi.ObjectFactoryTest
Running org.apache.activemq.jndi.XAConnectionFactoryTest
Tests run: 4, Failures: 0, Errors: 0, Skipped: 0, Time elapsed: 0.243 sec - in org.apache.activemq.jndi.XAConnectionFactoryTest
Running org.apache.activemq.joramtests.JoramJmsTest
Tests run: 196, Failures: 0, Errors: 0, Skipped: 0, Time elapsed: 9.753 sec - in org.apache.activemq.joramtests.JoramJmsTest
Running org.apache.activemq.leveldb.LevelDBStoreBrokerTest
Tests run: 127, Failures: 0, Errors: 0, Skipped: 0, Time elapsed: 22.881 sec - in org.apache.activemq.leveldb.LevelDBStoreBrokerTest
Running org.apache.activemq.management.BoundaryStatisticTest
Tests run: 1, Failures: 0, Errors: 0, Skipped: 0, Time elapsed: 0.139 sec - in org.apache.activemq.management.BoundaryStatisticTest
Running org.apache.activemq.management.BoundedRangeStatisticTest
Tests run: 1, Failures: 0, Errors: 0, Skipped: 0, Time elapsed: 0.642 sec - in org.apache.activemq.management.BoundedRangeStatisticTest
Running org.apache.activemq.management.CountStatisticTest
Tests run: 1, Failures: 0, Errors: 0, Skipped: 0, Time elapsed: 0.64 sec - in org.apache.activemq.management.CountStatisticTest
Running org.apache.activemq.management.RangeStatisticTest
Tests run: 1, Failures: 0, Errors: 0, Skipped: 0, Time elapsed: 0.645 sec - in org.apache.activemq.management.RangeStatisticTest
Running org.apache.activemq.management.TimeStatisticTest
Tests run: 1, Failures: 0, Errors: 0, Skipped: 0, Time elapsed: 0.646 sec - in org.apache.activemq.management.TimeStatisticTest
Running org.apache.activemq.memory.MemoryPropertyTest
Tests run: 1, Failures: 0, Errors: 0, Skipped: 0, Time elapsed: 1.513 sec - in org.apache.activemq.memory.MemoryPropertyTest
Running org.apache.activemq.memory.buffer.OrderBasedMemoryBufferTest
Tests run: 1, Failures: 0, Errors: 0, Skipped: 0, Time elapsed: 0.167 sec - in org.apache.activemq.memory.buffer.OrderBasedMemoryBufferTest
Running org.apache.activemq.memory.buffer.SizeBasedMessageBufferTest
Tests run: 1, Failures: 0, Errors: 0, Skipped: 0, Time elapsed: 0.163 sec - in org.apache.activemq.memory.buffer.SizeBasedMessageBufferTest
Running org.apache.activemq.network.CheckDuplicateMessagesOnDuplexTest
Tests run: 1, Failures: 0, Errors: 0, Skipped: 0, Time elapsed: 9.274 sec - in org.apache.activemq.network.CheckDuplicateMessagesOnDuplexTest
Running org.apache.activemq.network.CompressionOverNetworkTest
Tests run: 6, Failures: 0, Errors: 0, Skipped: 0, Time elapsed: 11.73 sec - in org.apache.activemq.network.CompressionOverNetworkTest
Running org.apache.activemq.network.DemandForwardingBridgeTest
Tests run: 6, Failures: 0, Errors: 0, Skipped: 0, Time elapsed: 4.869 sec - in org.apache.activemq.network.DemandForwardingBridgeTest
Running org.apache.activemq.network.DurableSyncNetworkBridgeTest
Tests run: 28, Failures: 1, Errors: 0, Skipped: 1, Time elapsed: 109.504 sec <<<
FAILURE! - in org.apache.activemq.network.DurableSyncNetworkBridgeTest
testSubscriptionRemovedAfterStaticChanged[1](org.apache.activemq.network.DurableSyncNetworkBridgeTest)
 Time elapsed: 14.001 sec  <<< FAILURE!
java.lang.AssertionError: null
	at org.junit.Assert.fail(Assert.java:86)
	at org.junit.Assert.assertTrue(Assert.java:41)
	at org.junit.Assert.assertTrue(Assert.java:52)
	at org.apache.activemq.network.DynamicNetworkTestSupport.assertNCDurableSubsCount(DynamicNetworkTestSupport.java:144)
	at org.apache.activemq.network.DurableSyncNetworkBridgeTest.testSubscriptionRemovedAfterStaticChanged(DurableSyncNetworkBridgeTest.java:278)

Running org.apache.activemq.network.DynamicallyIncludedDestinationsDuplexNetworkTest
Tests run: 10, Failures: 0, Errors: 0, Skipped: 0, Time elapsed: 23.845 sec - in org.apache.activemq.network.DynamicallyIncludedDestinationsDuplexNetworkTest
Running org.apache.activemq.network.ForceDurableNetworkBridgeTest
Tests run: 18, Failures: 0, Errors: 0, Skipped: 0, Time elapsed: 55.458 sec - in org.apache.activemq.network.ForceDurableNetworkBridgeTest
Running org.apache.activemq.network.ForwardingBridgeTest
Tests run: 8, Failures: 0, Errors: 0, Skipped: 0, Time elapsed: 16.98 sec - in org.apache.activemq.network.ForwardingBridgeTest
Running org.apache.activemq.network.MQTTNetworkOfBrokersFailoverTest
Tests run: 1, Failures: 0, Errors: 0, Skipped: 0, Time elapsed: 2.294 sec - in org.apache.activemq.network.MQTTNetworkOfBrokersFailoverTest
Running org.apache.activemq.network.NetworkDestinationFilterTest
Tests run: 1, Failures: 0, Errors: 0, Skipped: 0, Time elapsed: 0.145 sec - in org.apache.activemq.network.NetworkDestinationFilterTest
Running org.apache.activemq.network.NetworkDurableRecreationTest
Tests run: 4, Failures: 0, Errors: 0, Skipped: 0, Time elapsed: 18.961 sec - in org.apache.activemq.network.NetworkDurableRecreationTest
Running org.apache.activemq.network.NetworkLoopBackTest
Tests run: 1, Failures: 0, Errors: 0, Skipped: 0, Time elapsed: 0.912 sec - in org.apache.activemq.network.NetworkLoopBackTest
Running org.apache.activemq.network.NetworkRouteTest
Tests run: 3, Failures: 0, Errors: 0, Skipped: 0, Time elapsed: 0.8 sec - in org.apache.activemq.network.NetworkRouteTest
Running org.apache.activemq.network.VirtualConsumerDemandTest

Results :

Failed tests: 
  ActiveMQXAConnectionTxInterruptTest.testInterruptWhilePendingResponseToAck:217 no errors:
[java.lang.AssertionError]
  AMQ5844Test.testRecreateAbortedConsumer:206 expected null, but was:<ActiveMQTextMessage
{commandId = 6, responseRequired = false, messageId = ID:jenkins-ubuntu2.apache.org-33785-1476973891584-4:1:1:1:2,
originalDestination = null, originalTransactionId = null, producerId = ID:jenkins-ubuntu2.apache.org-33785-1476973891584-4:1:1:1,
destination = queue://TEST.QUEUE, transactionId = TX:ID:jenkins-ubuntu2.apache.org-33785-1476973891584-4:1:1,
expiration = 0, timestamp = 1476973891962, arrival = 0, brokerInTime = 1476973891965, brokerOutTime
= 1476973897021, correlationId = null, replyTo = null, persistent = false, type = null, priority
= 1, groupID = null, groupSequence = 0, targetConsumerId = null, compressed = false, userID
= null, content = org.apache.activemq.util.ByteSequence@3a6749fd, marshalledProperties = null,
dataStructure = null, redeliveryCounter = 0, size = 0, properties = null, readOnlyProperties
= true, readOnlyBody = true, droppable = false, jmsXGroupFirstForConsumer = false, text =
Plain Text Message}>
  DurableSyncNetworkBridgeTest.testSubscriptionRemovedAfterStaticChanged:278->DynamicNetworkTestSupport.assertNCDurableSubsCount:144
null

Tests run: 2164, Failures: 3, Errors: 0, Skipped: 33

[JENKINS] Recording test results

Mime
View raw message