activemq-commits mailing list archives

Site index · List index
Message view « Date » · « Thread »
Top « Date » · « Thread »
From Apache Jenkins Server <jenk...@builds.apache.org>
Subject Build failed in Jenkins: ActiveMQ-Java7-All-UnitTests #555
Date Thu, 20 Oct 2016 20:31:46 GMT
See <https://builds.apache.org/job/ActiveMQ-Java7-All-UnitTests/555/changes>

Changes:

[gtully] AMQ-6471 - map groupClass attribute on mod to authorization map. fix and

------------------------------------------
[...truncated 4281 lines...]
Running org.apache.activemq.store.kahadb.MultiKahaDbVmConcurrentDispatchTest
Tests run: 24, Failures: 0, Errors: 0, Skipped: 6, Time elapsed: 194.61 sec - in org.apache.activemq.store.kahadb.MultiKahaDbVmConcurrentDispatchTest
Running org.apache.activemq.store.kahadb.NoSpaceIOTest
Tests run: 1, Failures: 0, Errors: 0, Skipped: 1, Time elapsed: 0.087 sec - in org.apache.activemq.store.kahadb.NoSpaceIOTest
Running org.apache.activemq.store.kahadb.PBMesssagesTest
Tests run: 1, Failures: 0, Errors: 0, Skipped: 0, Time elapsed: 0.057 sec - in org.apache.activemq.store.kahadb.PBMesssagesTest
Running org.apache.activemq.store.kahadb.SubscriptionRecoveryTest
Tests run: 2, Failures: 0, Errors: 0, Skipped: 0, Time elapsed: 45.089 sec - in org.apache.activemq.store.kahadb.SubscriptionRecoveryTest
Running org.apache.activemq.store.kahadb.TempKahaDBStoreBrokerTest
Tests run: 127, Failures: 0, Errors: 0, Skipped: 0, Time elapsed: 34.632 sec - in org.apache.activemq.store.kahadb.TempKahaDBStoreBrokerTest
Running org.apache.activemq.store.kahadb.plist.KahaDBFilePendingMessageCursorTest
Tests run: 3, Failures: 0, Errors: 0, Skipped: 0, Time elapsed: 3.726 sec - in org.apache.activemq.store.kahadb.plist.KahaDBFilePendingMessageCursorTest
Running org.apache.activemq.store.kahadb.plist.PListTest
Tests run: 15, Failures: 0, Errors: 0, Skipped: 0, Time elapsed: 24.877 sec - in org.apache.activemq.store.kahadb.plist.PListTest
Running org.apache.activemq.store.leveldb.LevelDBNegativeQueueTest
Tests run: 4, Failures: 0, Errors: 0, Skipped: 0, Time elapsed: 187.256 sec - in org.apache.activemq.store.leveldb.LevelDBNegativeQueueTest
Running org.apache.activemq.store.leveldb.LevelDBStoreBrokerTest
Tests run: 127, Failures: 0, Errors: 0, Skipped: 0, Time elapsed: 23.149 sec - in org.apache.activemq.store.leveldb.LevelDBStoreBrokerTest
Running org.apache.activemq.store.leveldb.LevelDbVmConcurrentDispatchTest
Tests run: 12, Failures: 0, Errors: 0, Skipped: 3, Time elapsed: 134.366 sec - in org.apache.activemq.store.leveldb.LevelDbVmConcurrentDispatchTest
Running org.apache.activemq.store.memory.MemoryMessageStoreSizeStatTest
Tests run: 6, Failures: 0, Errors: 0, Skipped: 0, Time elapsed: 4.363 sec - in org.apache.activemq.store.memory.MemoryMessageStoreSizeStatTest
Running org.apache.activemq.store.memory.MemoryMessageStoreSizeTest
Tests run: 1, Failures: 0, Errors: 0, Skipped: 0, Time elapsed: 0.313 sec - in org.apache.activemq.store.memory.MemoryMessageStoreSizeTest
Running org.apache.activemq.test.JmsTopicSendReceiveTest
Tests run: 1, Failures: 0, Errors: 0, Skipped: 0, Time elapsed: 1.037 sec - in org.apache.activemq.test.JmsTopicSendReceiveTest
Running org.apache.activemq.test.JmsTopicSendReceiveWithEmbeddedBrokerAndUserIDTest
Tests run: 3, Failures: 0, Errors: 0, Skipped: 0, Time elapsed: 1.788 sec - in org.apache.activemq.test.JmsTopicSendReceiveWithEmbeddedBrokerAndUserIDTest
Running org.apache.activemq.test.JmsTopicSendReceiveWithTwoConnectionsAndByteSelectorTest
Tests run: 1, Failures: 0, Errors: 0, Skipped: 0, Time elapsed: 1.091 sec - in org.apache.activemq.test.JmsTopicSendReceiveWithTwoConnectionsAndByteSelectorTest
Running org.apache.activemq.test.JmsTopicSendReceiveWithTwoConnectionsAndEmbeddedBrokerTest
Tests run: 1, Failures: 0, Errors: 0, Skipped: 0, Time elapsed: 1.363 sec - in org.apache.activemq.test.JmsTopicSendReceiveWithTwoConnectionsAndEmbeddedBrokerTest
Running org.apache.activemq.test.JmsTopicSendReceiveWithTwoConnectionsTest
Tests run: 1, Failures: 0, Errors: 0, Skipped: 0, Time elapsed: 1.091 sec - in org.apache.activemq.test.JmsTopicSendReceiveWithTwoConnectionsTest
Running org.apache.activemq.test.TemporaryDestinationToFromNameTest
Tests run: 2, Failures: 0, Errors: 0, Skipped: 0, Time elapsed: 0.973 sec - in org.apache.activemq.test.TemporaryDestinationToFromNameTest
Running org.apache.activemq.test.message.NestedMapAndListPropertyTest
Tests run: 1, Failures: 0, Errors: 0, Skipped: 0, Time elapsed: 1.348 sec - in org.apache.activemq.test.message.NestedMapAndListPropertyTest
Running org.apache.activemq.test.message.NestedMapMessageTest
Tests run: 1, Failures: 0, Errors: 0, Skipped: 0, Time elapsed: 1.415 sec - in org.apache.activemq.test.message.NestedMapMessageTest
Running org.apache.activemq.test.retroactive.RetroactiveConsumerTestWithDestinationBasedBufferTest
Tests run: 1, Failures: 0, Errors: 0, Skipped: 0, Time elapsed: 1.73 sec - in org.apache.activemq.test.retroactive.RetroactiveConsumerTestWithDestinationBasedBufferTest
Running org.apache.activemq.test.retroactive.RetroactiveConsumerTestWithLastImagePolicyWithWildcardTest
Tests run: 1, Failures: 0, Errors: 0, Skipped: 0, Time elapsed: 1.739 sec - in org.apache.activemq.test.retroactive.RetroactiveConsumerTestWithLastImagePolicyWithWildcardTest
Running org.apache.activemq.test.retroactive.RetroactiveConsumerTestWithSimpleMessageListTest
Tests run: 1, Failures: 0, Errors: 0, Skipped: 0, Time elapsed: 1.659 sec - in org.apache.activemq.test.retroactive.RetroactiveConsumerTestWithSimpleMessageListTest
Running org.apache.activemq.test.retroactive.RetroactiveConsumerTestWithTimePolicyTest
Tests run: 1, Failures: 0, Errors: 0, Skipped: 0, Time elapsed: 1.755 sec - in org.apache.activemq.test.retroactive.RetroactiveConsumerTestWithTimePolicyTest
Running org.apache.activemq.test.retroactive.RetroactiveConsumerWithMessageQueryTest
Tests run: 1, Failures: 0, Errors: 0, Skipped: 0, Time elapsed: 1.695 sec - in org.apache.activemq.test.retroactive.RetroactiveConsumerWithMessageQueryTest
Running org.apache.activemq.test.rollback.CloseRollbackRedeliveryQueueTest
Tests run: 3, Failures: 0, Errors: 0, Skipped: 0, Time elapsed: 1.197 sec - in org.apache.activemq.test.rollback.CloseRollbackRedeliveryQueueTest
Running org.apache.activemq.test.rollback.RollbacksWhileConsumingLargeQueueTest
Tests run: 2, Failures: 0, Errors: 0, Skipped: 0, Time elapsed: 7.946 sec - in org.apache.activemq.test.rollback.RollbacksWhileConsumingLargeQueueTest
Running org.apache.activemq.transport.QueueClusterTest
Tests run: 1, Failures: 0, Errors: 0, Skipped: 0, Time elapsed: 9.33 sec - in org.apache.activemq.transport.QueueClusterTest
Running org.apache.activemq.transport.SoWriteTimeoutClientTest
Tests run: 1, Failures: 0, Errors: 0, Skipped: 0, Time elapsed: 11.12 sec - in org.apache.activemq.transport.SoWriteTimeoutClientTest
Running org.apache.activemq.transport.SoWriteTimeoutTest

Results :

Failed tests: 
  AMQ2616Test.testQueueResourcesReleased:80 Usage should return to original
  DurableSyncNetworkBridgeTest.testSubscriptionRemovedAfterIncludedChanged:240->DynamicNetworkTestSupport.assertNCDurableSubsCount:144
null
  NetworkRestartPlainTest>CombinationTestSupport.runBare:113->CombinationTestSupport.runBare:107->NetworkRestartTest.testConnectorRestart:52
expected:<[before]> but was:<[test-0]>
  NetworkRestartPlainTest>CombinationTestSupport.runBare:113->CombinationTestSupport.runBare:107->NetworkRestartTest.testConnectorReAdd:85
expected:<[before]> but was:<[test-1]>
  NetworkRestartTest>CombinationTestSupport.runBare:113->CombinationTestSupport.runBare:107->testConnectorRestart:52
expected:<[before]> but was:<[test-2]>
  NetworkRestartTest>CombinationTestSupport.runBare:113->CombinationTestSupport.runBare:107->testConnectorReAdd:85
expected:<[before]> but was:<[test-3]>
  CachedLDAPAuthorizationModuleTest>AbstractCachedLDAPAuthorizationMapLegacyTest.testRestartAsync:291->AbstractCachedLDAPAuthorizationMapLegacyTest.testRestart:344
did not get expected size. 

Tests in error: 
  DurableSyncNetworkBridgeTest.testRemoveSubscriptionPropagate:129->DynamicNetworkTestSupport.removeSubscription:217
» JMS

Tests run: 4576, Failures: 7, Errors: 1, Skipped: 100

[JENKINS] Recording test results
[INFO] ------------------------------------------------------------------------
[INFO] Reactor Summary:
[INFO] 
[INFO] ActiveMQ ........................................... SUCCESS [  9.507 s]
[INFO] ActiveMQ :: Client ................................. SUCCESS [02:24 min]
[INFO] ActiveMQ :: Openwire Legacy Support ................ SUCCESS [  6.746 s]
[INFO] ActiveMQ :: JAAS ................................... SUCCESS [ 20.286 s]
[INFO] ActiveMQ :: Broker ................................. SUCCESS [01:27 min]
[INFO] ActiveMQ :: KahaDB Store ........................... SUCCESS [03:05 min]
[INFO] ActiveMQ :: STOMP Protocol ......................... SUCCESS [11:34 min]
[INFO] ActiveMQ :: MQTT Protocol .......................... SUCCESS [22:28 min]
[INFO] ActiveMQ :: JDBC Store ............................. SUCCESS [ 21.921 s]
[INFO] ActiveMQ :: LevelDB Store .......................... SUCCESS [05:33 min]
[INFO] ActiveMQ :: Generic JMS Pool ....................... SUCCESS [ 50.379 s]
[INFO] ActiveMQ :: Pool ................................... SUCCESS [  8.304 s]
[INFO] ActiveMQ :: RA ..................................... SUCCESS [02:14 min]
[INFO] ActiveMQ :: Spring ................................. SUCCESS [01:02 min]
[INFO] ActiveMQ :: Console ................................ SUCCESS [ 11.168 s]
[INFO] ActiveMQ :: Partition Management ................... SUCCESS [ 25.070 s]
[INFO] ActiveMQ :: Runtime Configuration .................. SUCCESS [08:49 min]
[INFO] ActiveMQ :: Tooling ................................ SUCCESS [  3.516 s]
[INFO] ActiveMQ :: JUnit Rule ............................. SUCCESS [ 15.747 s]
[INFO] ActiveMQ :: Unit Tests ............................. FAILURE [  04:32 h]
[INFO] ------------------------------------------------------------------------
[INFO] BUILD FAILURE
[INFO] ------------------------------------------------------------------------
[INFO] Total time: 05:37 h
[INFO] Finished at: 2016-10-20T20:30:13+00:00
[INFO] Final Memory: 137M/1022M
[INFO] ------------------------------------------------------------------------
Waiting for Jenkins to finish collecting data
[ERROR] Failed to execute goal org.apache.maven.plugins:maven-surefire-plugin:2.16:test (default-test)
on project activemq-unit-tests: ExecutionException; nested exception is java.util.concurrent.ExecutionException:
java.lang.RuntimeException: The forked VM terminated without saying properly goodbye. VM crash
or System.exit called ?
[ERROR] Command was/bin/sh -c cd <https://builds.apache.org/job/ActiveMQ-Java7-All-UnitTests/ws/activemq-unit-tests>
&& /usr/local/asfpackages/java/jdk1.7.0_80/jre/bin/java -Xmx512m -jar <https://builds.apache.org/job/ActiveMQ-Java7-All-UnitTests/ws/activemq-unit-tests/target/surefire/surefirebooter5729269382836500229.jar>
<https://builds.apache.org/job/ActiveMQ-Java7-All-UnitTests/ws/activemq-unit-tests/target/surefire/surefire831682077368726958tmp>
<https://builds.apache.org/job/ActiveMQ-Java7-All-UnitTests/ws/activemq-unit-tests/target/surefire/surefire_8229112494343298581573tmp>
[ERROR] -> [Help 1]
org.apache.maven.lifecycle.LifecycleExecutionException: Failed to execute goal org.apache.maven.plugins:maven-surefire-plugin:2.16:test
(default-test) on project activemq-unit-tests: ExecutionException; nested exception is java.util.concurrent.ExecutionException:
java.lang.RuntimeException: The forked VM terminated without saying properly goodbye. VM crash
or System.exit called ?
Command was/bin/sh -c cd <https://builds.apache.org/job/ActiveMQ-Java7-All-UnitTests/ws/activemq-unit-tests>
&& /usr/local/asfpackages/java/jdk1.7.0_80/jre/bin/java -Xmx512m -jar <https://builds.apache.org/job/ActiveMQ-Java7-All-UnitTests/ws/activemq-unit-tests/target/surefire/surefirebooter5729269382836500229.jar>
<https://builds.apache.org/job/ActiveMQ-Java7-All-UnitTests/ws/activemq-unit-tests/target/surefire/surefire831682077368726958tmp>
<https://builds.apache.org/job/ActiveMQ-Java7-All-UnitTests/ws/activemq-unit-tests/target/surefire/surefire_8229112494343298581573tmp>
	at org.apache.maven.lifecycle.internal.MojoExecutor.execute(MojoExecutor.java:212)
	at org.apache.maven.lifecycle.internal.MojoExecutor.execute(MojoExecutor.java:153)
	at org.apache.maven.lifecycle.internal.MojoExecutor.execute(MojoExecutor.java:145)
	at org.apache.maven.lifecycle.internal.LifecycleModuleBuilder.buildProject(LifecycleModuleBuilder.java:116)
	at org.apache.maven.lifecycle.internal.LifecycleModuleBuilder.buildProject(LifecycleModuleBuilder.java:80)
	at org.apache.maven.lifecycle.internal.builder.singlethreaded.SingleThreadedBuilder.build(SingleThreadedBuilder.java:51)
	at org.apache.maven.lifecycle.internal.LifecycleStarter.execute(LifecycleStarter.java:128)
	at org.apache.maven.DefaultMaven.doExecute(DefaultMaven.java:307)
	at org.apache.maven.DefaultMaven.doExecute(DefaultMaven.java:193)
	at org.apache.maven.DefaultMaven.execute(DefaultMaven.java:106)
	at org.jvnet.hudson.maven3.launcher.Maven32Launcher.main(Maven32Launcher.java:132)
	at sun.reflect.NativeMethodAccessorImpl.invoke0(Native Method)
	at sun.reflect.NativeMethodAccessorImpl.invoke(NativeMethodAccessorImpl.java:57)
	at sun.reflect.DelegatingMethodAccessorImpl.invoke(DelegatingMethodAccessorImpl.java:43)
	at java.lang.reflect.Method.invoke(Method.java:606)
	at org.codehaus.plexus.classworlds.launcher.Launcher.launchStandard(Launcher.java:330)
	at org.codehaus.plexus.classworlds.launcher.Launcher.launch(Launcher.java:238)
	at jenkins.maven3.agent.Maven32Main.launch(Maven32Main.java:186)
	at sun.reflect.NativeMethodAccessorImpl.invoke0(Native Method)
	at sun.reflect.NativeMethodAccessorImpl.invoke(NativeMethodAccessorImpl.java:57)
	at sun.reflect.DelegatingMethodAccessorImpl.invoke(DelegatingMethodAccessorImpl.java:43)
	at java.lang.reflect.Method.invoke(Method.java:606)
	at hudson.maven.Maven3Builder.call(Maven3Builder.java:136)
	at hudson.maven.Maven3Builder.call(Maven3Builder.java:71)
	at hudson.remoting.UserRequest.perform(UserRequest.java:153)
	at hudson.remoting.UserRequest.perform(UserRequest.java:50)
	at hudson.remoting.Request$2.run(Request.java:332)
	at hudson.remoting.InterceptingExecutorService$1.call(InterceptingExecutorService.java:68)
	at java.util.concurrent.FutureTask.run(FutureTask.java:262)
	at java.util.concurrent.ThreadPoolExecutor.runWorker(ThreadPoolExecutor.java:1145)
	at java.util.concurrent.ThreadPoolExecutor$Worker.run(ThreadPoolExecutor.java:615)
	at java.lang.Thread.run(Thread.java:745)
Caused by: org.apache.maven.plugin.MojoFailureException: ExecutionException; nested exception
is java.util.concurrent.ExecutionException: java.lang.RuntimeException: The forked VM terminated
without saying properly goodbye. VM crash or System.exit called ?
Command was/bin/sh -c cd <https://builds.apache.org/job/ActiveMQ-Java7-All-UnitTests/ws/activemq-unit-tests>
&& /usr/local/asfpackages/java/jdk1.7.0_80/jre/bin/java -Xmx512m -jar <https://builds.apache.org/job/ActiveMQ-Java7-All-UnitTests/ws/activemq-unit-tests/target/surefire/surefirebooter5729269382836500229.jar>
<https://builds.apache.org/job/ActiveMQ-Java7-All-UnitTests/ws/activemq-unit-tests/target/surefire/surefire831682077368726958tmp>
<https://builds.apache.org/job/ActiveMQ-Java7-All-UnitTests/ws/activemq-unit-tests/target/surefire/surefire_8229112494343298581573tmp>
	at org.apache.maven.plugin.surefire.SurefirePlugin.assertNoException(SurefirePlugin.java:198)
	at org.apache.maven.plugin.surefire.SurefirePlugin.handleSummary(SurefirePlugin.java:188)
	at org.apache.maven.plugin.surefire.AbstractSurefireMojo.executeAfterPreconditionsChecked(AbstractSurefireMojo.java:852)
	at org.apache.maven.plugin.surefire.AbstractSurefireMojo.execute(AbstractSurefireMojo.java:720)
	at org.apache.maven.plugin.DefaultBuildPluginManager.executeMojo(DefaultBuildPluginManager.java:134)
	at org.apache.maven.lifecycle.internal.MojoExecutor.execute(MojoExecutor.java:207)
	... 31 more
Caused by: org.apache.maven.surefire.booter.SurefireBooterForkException: ExecutionException;
nested exception is java.util.concurrent.ExecutionException: java.lang.RuntimeException: The
forked VM terminated without saying properly goodbye. VM crash or System.exit called ?
Command was/bin/sh -c cd <https://builds.apache.org/job/ActiveMQ-Java7-All-UnitTests/ws/activemq-unit-tests>
&& /usr/local/asfpackages/java/jdk1.7.0_80/jre/bin/java -Xmx512m -jar <https://builds.apache.org/job/ActiveMQ-Java7-All-UnitTests/ws/activemq-unit-tests/target/surefire/surefirebooter5729269382836500229.jar>
<https://builds.apache.org/job/ActiveMQ-Java7-All-UnitTests/ws/activemq-unit-tests/target/surefire/surefire831682077368726958tmp>
<https://builds.apache.org/job/ActiveMQ-Java7-All-UnitTests/ws/activemq-unit-tests/target/surefire/surefire_8229112494343298581573tmp>
	at org.apache.maven.plugin.surefire.booterclient.ForkStarter.runSuitesForkPerTestSet(ForkStarter.java:316)
	at org.apache.maven.plugin.surefire.booterclient.ForkStarter.run(ForkStarter.java:169)
	at org.apache.maven.plugin.surefire.AbstractSurefireMojo.executeProvider(AbstractSurefireMojo.java:958)
	at org.apache.maven.plugin.surefire.AbstractSurefireMojo.executeAfterPreconditionsChecked(AbstractSurefireMojo.java:822)
	... 34 more
Caused by: java.util.concurrent.ExecutionException: java.lang.RuntimeException: The forked
VM terminated without saying properly goodbye. VM crash or System.exit called ?
Command was/bin/sh -c cd <https://builds.apache.org/job/ActiveMQ-Java7-All-UnitTests/ws/activemq-unit-tests>
&& /usr/local/asfpackages/java/jdk1.7.0_80/jre/bin/java -Xmx512m -jar <https://builds.apache.org/job/ActiveMQ-Java7-All-UnitTests/ws/activemq-unit-tests/target/surefire/surefirebooter5729269382836500229.jar>
<https://builds.apache.org/job/ActiveMQ-Java7-All-UnitTests/ws/activemq-unit-tests/target/surefire/surefire831682077368726958tmp>
<https://builds.apache.org/job/ActiveMQ-Java7-All-UnitTests/ws/activemq-unit-tests/target/surefire/surefire_8229112494343298581573tmp>
	at java.util.concurrent.FutureTask.report(FutureTask.java:122)
	at java.util.concurrent.FutureTask.get(FutureTask.java:188)
	at org.apache.maven.plugin.surefire.booterclient.ForkStarter.runSuitesForkPerTestSet(ForkStarter.java:300)
	... 37 more
Caused by: java.lang.RuntimeException: The forked VM terminated without saying properly goodbye.
VM crash or System.exit called ?
Command was/bin/sh -c cd <https://builds.apache.org/job/ActiveMQ-Java7-All-UnitTests/ws/activemq-unit-tests>
&& /usr/local/asfpackages/java/jdk1.7.0_80/jre/bin/java -Xmx512m -jar <https://builds.apache.org/job/ActiveMQ-Java7-All-UnitTests/ws/activemq-unit-tests/target/surefire/surefirebooter5729269382836500229.jar>
<https://builds.apache.org/job/ActiveMQ-Java7-All-UnitTests/ws/activemq-unit-tests/target/surefire/surefire831682077368726958tmp>
<https://builds.apache.org/job/ActiveMQ-Java7-All-UnitTests/ws/activemq-unit-tests/target/surefire/surefire_8229112494343298581573tmp>
	at org.apache.maven.plugin.surefire.booterclient.ForkStarter.fork(ForkStarter.java:485)
	at org.apache.maven.plugin.surefire.booterclient.ForkStarter.fork(ForkStarter.java:352)
	at org.apache.maven.plugin.surefire.booterclient.ForkStarter.access$300(ForkStarter.java:85)
	at org.apache.maven.plugin.surefire.booterclient.ForkStarter$2.call(ForkStarter.java:288)
	at org.apache.maven.plugin.surefire.booterclient.ForkStarter$2.call(ForkStarter.java:283)
	... 4 more
[ERROR] 
[ERROR] Re-run Maven using the -X switch to enable full debug logging.
[ERROR] 
[ERROR] For more information about the errors and possible solutions, please read the following
articles:
[ERROR] [Help 1] http://cwiki.apache.org/confluence/display/MAVEN/MojoFailureException
[ERROR] 
[ERROR] After correcting the problems, you can resume the build with the command
[ERROR]   mvn <goals> -rf :activemq-unit-tests
[JENKINS] Archiving <https://builds.apache.org/job/ActiveMQ-Java7-All-UnitTests/ws/activemq-kahadb-store/pom.xml>
to org.apache.activemq/activemq-kahadb-store/5.15.0-SNAPSHOT/activemq-kahadb-store-5.15.0-SNAPSHOT.pom
[JENKINS] Archiving <https://builds.apache.org/job/ActiveMQ-Java7-All-UnitTests/ws/activemq-kahadb-store/target/activemq-kahadb-store-5.15.0-SNAPSHOT.jar>
to org.apache.activemq/activemq-kahadb-store/5.15.0-SNAPSHOT/activemq-kahadb-store-5.15.0-SNAPSHOT.jar
No artifacts from ActiveMQ-Java7-All-UnitTests » ActiveMQ :: KahaDB Store #554 to compare,
so performing full copy of artifacts
[JENKINS] Archiving <https://builds.apache.org/job/ActiveMQ-Java7-All-UnitTests/ws/activemq-unit-tests/pom.xml>
to org.apache.activemq/activemq-unit-tests/5.15.0-SNAPSHOT/activemq-unit-tests-5.15.0-SNAPSHOT.pom
Compressed 71.40 KB of artifacts by 44.8% relative to #552
[JENKINS] Archiving <https://builds.apache.org/job/ActiveMQ-Java7-All-UnitTests/ws/activemq-openwire-legacy/pom.xml>
to org.apache.activemq/activemq-openwire-legacy/5.15.0-SNAPSHOT/activemq-openwire-legacy-5.15.0-SNAPSHOT.pom
[JENKINS] Archiving <https://builds.apache.org/job/ActiveMQ-Java7-All-UnitTests/ws/activemq-openwire-legacy/target/activemq-openwire-legacy-5.15.0-SNAPSHOT.jar>
to org.apache.activemq/activemq-openwire-legacy/5.15.0-SNAPSHOT/activemq-openwire-legacy-5.15.0-SNAPSHOT.jar
No artifacts from ActiveMQ-Java7-All-UnitTests » ActiveMQ :: Openwire Legacy Support #554
to compare, so performing full copy of artifacts
[JENKINS] Archiving <https://builds.apache.org/job/ActiveMQ-Java7-All-UnitTests/ws/activemq-client/pom.xml>
to org.apache.activemq/activemq-client/5.15.0-SNAPSHOT/activemq-client-5.15.0-SNAPSHOT.pom
[JENKINS] Archiving <https://builds.apache.org/job/ActiveMQ-Java7-All-UnitTests/ws/activemq-client/target/activemq-client-5.15.0-SNAPSHOT.jar>
to org.apache.activemq/activemq-client/5.15.0-SNAPSHOT/activemq-client-5.15.0-SNAPSHOT.jar
No artifacts from ActiveMQ-Java7-All-UnitTests » ActiveMQ :: Client #554 to compare, so performing
full copy of artifacts
[JENKINS] Archiving <https://builds.apache.org/job/ActiveMQ-Java7-All-UnitTests/ws/activemq-tooling/activemq-junit/pom.xml>
to org.apache.activemq.tooling/activemq-junit/5.15.0-SNAPSHOT/activemq-junit-5.15.0-SNAPSHOT.pom
[JENKINS] Archiving <https://builds.apache.org/job/ActiveMQ-Java7-All-UnitTests/ws/activemq-tooling/activemq-junit/target/activemq-junit-5.15.0-SNAPSHOT.jar>
to org.apache.activemq.tooling/activemq-junit/5.15.0-SNAPSHOT/activemq-junit-5.15.0-SNAPSHOT.jar
No artifacts from ActiveMQ-Java7-All-UnitTests » ActiveMQ :: JUnit Rule #554 to compare,
so performing full copy of artifacts
[JENKINS] Archiving <https://builds.apache.org/job/ActiveMQ-Java7-All-UnitTests/ws/activemq-tooling/pom.xml>
to org.apache.activemq.tooling/activemq-tooling/5.15.0-SNAPSHOT/activemq-tooling-5.15.0-SNAPSHOT.pom
No artifacts from ActiveMQ-Java7-All-UnitTests » ActiveMQ :: Tooling #554 to compare, so
performing full copy of artifacts
[JENKINS] Archiving <https://builds.apache.org/job/ActiveMQ-Java7-All-UnitTests/ws/activemq-jms-pool/pom.xml>
to org.apache.activemq/activemq-jms-pool/5.15.0-SNAPSHOT/activemq-jms-pool-5.15.0-SNAPSHOT.pom
[JENKINS] Archiving <https://builds.apache.org/job/ActiveMQ-Java7-All-UnitTests/ws/activemq-jms-pool/target/activemq-jms-pool-5.15.0-SNAPSHOT.jar>
to org.apache.activemq/activemq-jms-pool/5.15.0-SNAPSHOT/activemq-jms-pool-5.15.0-SNAPSHOT.jar
No artifacts from ActiveMQ-Java7-All-UnitTests » ActiveMQ :: Generic JMS Pool #554 to compare,
so performing full copy of artifacts
[JENKINS] Archiving <https://builds.apache.org/job/ActiveMQ-Java7-All-UnitTests/ws/activemq-pool/pom.xml>
to org.apache.activemq/activemq-pool/5.15.0-SNAPSHOT/activemq-pool-5.15.0-SNAPSHOT.pom
[JENKINS] Archiving <https://builds.apache.org/job/ActiveMQ-Java7-All-UnitTests/ws/activemq-pool/target/activemq-pool-5.15.0-SNAPSHOT.jar>
to org.apache.activemq/activemq-pool/5.15.0-SNAPSHOT/activemq-pool-5.15.0-SNAPSHOT.jar
No artifacts from ActiveMQ-Java7-All-UnitTests » ActiveMQ :: Pool #554 to compare, so performing
full copy of artifacts
[JENKINS] Archiving <https://builds.apache.org/job/ActiveMQ-Java7-All-UnitTests/ws/activemq-jdbc-store/pom.xml>
to org.apache.activemq/activemq-jdbc-store/5.15.0-SNAPSHOT/activemq-jdbc-store-5.15.0-SNAPSHOT.pom
[JENKINS] Archiving <https://builds.apache.org/job/ActiveMQ-Java7-All-UnitTests/ws/activemq-jdbc-store/target/activemq-jdbc-store-5.15.0-SNAPSHOT.jar>
to org.apache.activemq/activemq-jdbc-store/5.15.0-SNAPSHOT/activemq-jdbc-store-5.15.0-SNAPSHOT.jar
No artifacts from ActiveMQ-Java7-All-UnitTests » ActiveMQ :: JDBC Store #554 to compare,
so performing full copy of artifacts
[JENKINS] Archiving <https://builds.apache.org/job/ActiveMQ-Java7-All-UnitTests/ws/activemq-runtime-config/pom.xml>
to org.apache.activemq/activemq-runtime-config/5.15.0-SNAPSHOT/activemq-runtime-config-5.15.0-SNAPSHOT.pom
[JENKINS] Archiving <https://builds.apache.org/job/ActiveMQ-Java7-All-UnitTests/ws/activemq-runtime-config/target/activemq-runtime-config-5.15.0-SNAPSHOT.jar>
to org.apache.activemq/activemq-runtime-config/5.15.0-SNAPSHOT/activemq-runtime-config-5.15.0-SNAPSHOT.jar
No artifacts from ActiveMQ-Java7-All-UnitTests » ActiveMQ :: Runtime Configuration #554 to
compare, so performing full copy of artifacts
[JENKINS] Archiving <https://builds.apache.org/job/ActiveMQ-Java7-All-UnitTests/ws/pom.xml>
to org.apache.activemq/activemq-parent/5.15.0-SNAPSHOT/activemq-parent-5.15.0-SNAPSHOT.pom
No artifacts from ActiveMQ-Java7-All-UnitTests » ActiveMQ #554 to compare, so performing
full copy of artifacts
[JENKINS] Archiving <https://builds.apache.org/job/ActiveMQ-Java7-All-UnitTests/ws/activemq-stomp/pom.xml>
to org.apache.activemq/activemq-stomp/5.15.0-SNAPSHOT/activemq-stomp-5.15.0-SNAPSHOT.pom
[JENKINS] Archiving <https://builds.apache.org/job/ActiveMQ-Java7-All-UnitTests/ws/activemq-stomp/target/activemq-stomp-5.15.0-SNAPSHOT.jar>
to org.apache.activemq/activemq-stomp/5.15.0-SNAPSHOT/activemq-stomp-5.15.0-SNAPSHOT.jar
No artifacts from ActiveMQ-Java7-All-UnitTests » ActiveMQ :: STOMP Protocol #554 to compare,
so performing full copy of artifacts
[JENKINS] Archiving <https://builds.apache.org/job/ActiveMQ-Java7-All-UnitTests/ws/activemq-broker/pom.xml>
to org.apache.activemq/activemq-broker/5.15.0-SNAPSHOT/activemq-broker-5.15.0-SNAPSHOT.pom
[JENKINS] Archiving <https://builds.apache.org/job/ActiveMQ-Java7-All-UnitTests/ws/activemq-broker/target/activemq-broker-5.15.0-SNAPSHOT.jar>
to org.apache.activemq/activemq-broker/5.15.0-SNAPSHOT/activemq-broker-5.15.0-SNAPSHOT.jar
[JENKINS] Archiving <https://builds.apache.org/job/ActiveMQ-Java7-All-UnitTests/ws/activemq-broker/target/activemq-broker-5.15.0-SNAPSHOT-tests.jar>
to org.apache.activemq/activemq-broker/5.15.0-SNAPSHOT/activemq-broker-5.15.0-SNAPSHOT-tests.jar
No artifacts from ActiveMQ-Java7-All-UnitTests » ActiveMQ :: Broker #554 to compare, so performing
full copy of artifacts
[JENKINS] Archiving <https://builds.apache.org/job/ActiveMQ-Java7-All-UnitTests/ws/activemq-mqtt/pom.xml>
to org.apache.activemq/activemq-mqtt/5.15.0-SNAPSHOT/activemq-mqtt-5.15.0-SNAPSHOT.pom
[JENKINS] Archiving <https://builds.apache.org/job/ActiveMQ-Java7-All-UnitTests/ws/activemq-mqtt/target/activemq-mqtt-5.15.0-SNAPSHOT.jar>
to org.apache.activemq/activemq-mqtt/5.15.0-SNAPSHOT/activemq-mqtt-5.15.0-SNAPSHOT.jar
No artifacts from ActiveMQ-Java7-All-UnitTests » ActiveMQ :: MQTT Protocol #554 to compare,
so performing full copy of artifacts
[JENKINS] Archiving <https://builds.apache.org/job/ActiveMQ-Java7-All-UnitTests/ws/activemq-jaas/pom.xml>
to org.apache.activemq/activemq-jaas/5.15.0-SNAPSHOT/activemq-jaas-5.15.0-SNAPSHOT.pom
[JENKINS] Archiving <https://builds.apache.org/job/ActiveMQ-Java7-All-UnitTests/ws/activemq-jaas/target/activemq-jaas-5.15.0-SNAPSHOT.jar>
to org.apache.activemq/activemq-jaas/5.15.0-SNAPSHOT/activemq-jaas-5.15.0-SNAPSHOT.jar
No artifacts from ActiveMQ-Java7-All-UnitTests » ActiveMQ :: JAAS #554 to compare, so performing
full copy of artifacts
[JENKINS] Archiving <https://builds.apache.org/job/ActiveMQ-Java7-All-UnitTests/ws/activemq-ra/pom.xml>
to org.apache.activemq/activemq-ra/5.15.0-SNAPSHOT/activemq-ra-5.15.0-SNAPSHOT.pom
[JENKINS] Archiving <https://builds.apache.org/job/ActiveMQ-Java7-All-UnitTests/ws/activemq-ra/target/activemq-ra-5.15.0-SNAPSHOT.jar>
to org.apache.activemq/activemq-ra/5.15.0-SNAPSHOT/activemq-ra-5.15.0-SNAPSHOT.jar
[JENKINS] Archiving <https://builds.apache.org/job/ActiveMQ-Java7-All-UnitTests/ws/activemq-ra/target/xbean/activemq-ra.xsd>
to org.apache.activemq/activemq-ra/5.15.0-SNAPSHOT/activemq-ra-5.15.0-SNAPSHOT.xsd
[JENKINS] Archiving <https://builds.apache.org/job/ActiveMQ-Java7-All-UnitTests/ws/activemq-ra/target/xbean/activemq-ra.xsd.html>
to org.apache.activemq/activemq-ra/5.15.0-SNAPSHOT/activemq-ra-5.15.0-SNAPSHOT-schema.html
[JENKINS] Archiving <https://builds.apache.org/job/ActiveMQ-Java7-All-UnitTests/ws/activemq-ra/target/xbean/activemq-ra.xsd.html>
to org.apache.activemq/activemq-ra/5.15.0-SNAPSHOT/activemq-ra-5.15.0-SNAPSHOT.xsd.html
No artifacts from ActiveMQ-Java7-All-UnitTests » ActiveMQ :: RA #554 to compare, so performing
full copy of artifacts
[JENKINS] Archiving <https://builds.apache.org/job/ActiveMQ-Java7-All-UnitTests/ws/activemq-partition/pom.xml>
to org.apache.activemq/activemq-partition/5.15.0-SNAPSHOT/activemq-partition-5.15.0-SNAPSHOT.pom
[JENKINS] Archiving <https://builds.apache.org/job/ActiveMQ-Java7-All-UnitTests/ws/activemq-partition/target/activemq-partition-5.15.0-SNAPSHOT.jar>
to org.apache.activemq/activemq-partition/5.15.0-SNAPSHOT/activemq-partition-5.15.0-SNAPSHOT.jar
No artifacts from ActiveMQ-Java7-All-UnitTests » ActiveMQ :: Partition Management #554 to
compare, so performing full copy of artifacts
[JENKINS] Archiving <https://builds.apache.org/job/ActiveMQ-Java7-All-UnitTests/ws/activemq-console/pom.xml>
to org.apache.activemq/activemq-console/5.15.0-SNAPSHOT/activemq-console-5.15.0-SNAPSHOT.pom
[JENKINS] Archiving <https://builds.apache.org/job/ActiveMQ-Java7-All-UnitTests/ws/activemq-console/target/activemq-console-5.15.0-SNAPSHOT.jar>
to org.apache.activemq/activemq-console/5.15.0-SNAPSHOT/activemq-console-5.15.0-SNAPSHOT.jar
No artifacts from ActiveMQ-Java7-All-UnitTests » ActiveMQ :: Console #554 to compare, so
performing full copy of artifacts
[JENKINS] Archiving <https://builds.apache.org/job/ActiveMQ-Java7-All-UnitTests/ws/activemq-spring/pom.xml>
to org.apache.activemq/activemq-spring/5.15.0-SNAPSHOT/activemq-spring-5.15.0-SNAPSHOT.pom
[JENKINS] Archiving <https://builds.apache.org/job/ActiveMQ-Java7-All-UnitTests/ws/activemq-spring/target/activemq-spring-5.15.0-SNAPSHOT.jar>
to org.apache.activemq/activemq-spring/5.15.0-SNAPSHOT/activemq-spring-5.15.0-SNAPSHOT.jar
[JENKINS] Archiving <https://builds.apache.org/job/ActiveMQ-Java7-All-UnitTests/ws/activemq-spring/target/classes/activemq.xsd>
to org.apache.activemq/activemq-spring/5.15.0-SNAPSHOT/activemq-spring-5.15.0-SNAPSHOT.xsd
[JENKINS] Archiving <https://builds.apache.org/job/ActiveMQ-Java7-All-UnitTests/ws/activemq-spring/target/classes/activemq.xsd.html>
to org.apache.activemq/activemq-spring/5.15.0-SNAPSHOT/activemq-spring-5.15.0-SNAPSHOT-schema.html
No artifacts from ActiveMQ-Java7-All-UnitTests » ActiveMQ :: Spring #554 to compare, so performing
full copy of artifacts
[JENKINS] Archiving <https://builds.apache.org/job/ActiveMQ-Java7-All-UnitTests/ws/activemq-leveldb-store/pom.xml>
to org.apache.activemq/activemq-leveldb-store/5.15.0-SNAPSHOT/activemq-leveldb-store-5.15.0-SNAPSHOT.pom
[JENKINS] Archiving <https://builds.apache.org/job/ActiveMQ-Java7-All-UnitTests/ws/activemq-leveldb-store/target/activemq-leveldb-store-5.15.0-SNAPSHOT.jar>
to org.apache.activemq/activemq-leveldb-store/5.15.0-SNAPSHOT/activemq-leveldb-store-5.15.0-SNAPSHOT.jar
No artifacts from ActiveMQ-Java7-All-UnitTests » ActiveMQ :: LevelDB Store #554 to compare,
so performing full copy of artifacts
[locks-and-latches] Releasing all the locks
[locks-and-latches] All the locks released
channel stopped

Mime
View raw message