activemq-commits mailing list archives

Site index · List index
Message view « Date » · « Thread »
Top « Date » · « Thread »
From Apache Jenkins Server <jenk...@builds.apache.org>
Subject Build failed in Jenkins: ActiveMQ-Artemis-Master #631
Date Wed, 07 Sep 2016 13:23:33 GMT
See <https://builds.apache.org/job/ActiveMQ-Artemis-Master/631/changes>

Changes:

[mstyk] ARTEMIS-713 Possible integer overflow in

------------------------------------------
[...truncated 35943 lines...]
46/46 KB   64/108 KB   460/763 KB   
46/46 KB   64/108 KB   464/763 KB   
46/46 KB   64/108 KB   464/763 KB   
                                    
Downloaded: https://repo.maven.apache.org/maven2/org/jboss/resteasy/resteasy-atom-provider/3.0.17.Final/resteasy-atom-provider-3.0.17.Final.jar
(46 KB at 417.8 KB/sec)
64/108 KB   468/763 KB              
64/108 KB   472/763 KB   
64/108 KB   476/763 KB   
Downloading: https://repo.maven.apache.org/maven2/org/apache/geronimo/specs/geronimo-annotation_1.1_spec/1.0.1/geronimo-annotation_1.1_spec-1.0.1.jar
64/108 KB   480/763 KB   
64/108 KB   484/763 KB   
64/108 KB   488/763 KB   
64/108 KB   492/763 KB   
64/108 KB   496/763 KB   
68/108 KB   496/763 KB   
72/108 KB   496/763 KB   
76/108 KB   496/763 KB   
80/108 KB   496/763 KB   
80/108 KB   500/763 KB   
80/108 KB   504/763 KB   
80/108 KB   508/763 KB   
80/108 KB   512/763 KB   
80/108 KB   516/763 KB   
80/108 KB   520/763 KB   
80/108 KB   524/763 KB   
80/108 KB   528/763 KB   
84/108 KB   528/763 KB   
88/108 KB   528/763 KB   
92/108 KB   528/763 KB   
96/108 KB   528/763 KB   
96/108 KB   532/763 KB   
96/108 KB   536/763 KB   
96/108 KB   540/763 KB   
96/108 KB   544/763 KB   
96/108 KB   544/763 KB   4/103 KB   
96/108 KB   544/763 KB   8/103 KB   
96/108 KB   544/763 KB   12/103 KB   
96/108 KB   544/763 KB   16/103 KB   
96/108 KB   548/763 KB   16/103 KB   
4/15 KB   96/108 KB   548/763 KB   16/103 KB   
4/15 KB   96/108 KB   552/763 KB   16/103 KB   
8/15 KB   96/108 KB   552/763 KB   16/103 KB   
8/15 KB   96/108 KB   556/763 KB   16/103 KB   
8/15 KB   96/108 KB   560/763 KB   16/103 KB   
12/15 KB   96/108 KB   560/763 KB   16/103 KB   
15/15 KB   96/108 KB   560/763 KB   16/103 KB   
15/15 KB   96/108 KB   560/763 KB   20/103 KB   
15/15 KB   96/108 KB   564/763 KB   20/103 KB   
15/15 KB   96/108 KB   568/763 KB   20/103 KB   
15/15 KB   96/108 KB   572/763 KB   20/103 KB   
15/15 KB   96/108 KB   572/763 KB   24/103 KB   
15/15 KB   96/108 KB   576/763 KB   24/103 KB   
15/15 KB   96/108 KB   576/763 KB   28/103 KB   
15/15 KB   96/108 KB   576/763 KB   32/103 KB   
15/15 KB   100/108 KB   576/763 KB   32/103 KB   
15/15 KB   104/108 KB   576/763 KB   32/103 KB   
15/15 KB   108/108 KB   576/763 KB   32/103 KB   
15/15 KB   108/108 KB   576/763 KB   32/103 KB   
15/15 KB   108/108 KB   580/763 KB   32/103 KB   
15/15 KB   108/108 KB   584/763 KB   32/103 KB   
15/15 KB   108/108 KB   588/763 KB   32/103 KB   
15/15 KB   108/108 KB   592/763 KB   32/103 KB   
15/15 KB   108/108 KB   592/763 KB   36/103 KB   
15/15 KB   108/108 KB   592/763 KB   40/103 KB   
15/15 KB   108/108 KB   592/763 KB   44/103 KB   
15/15 KB   108/108 KB   596/763 KB   44/103 KB   
15/15 KB   108/108 KB   596/763 KB   48/103 KB   
15/15 KB   108/108 KB   600/763 KB   48/103 KB   
15/15 KB   108/108 KB   604/763 KB   48/103 KB   
15/15 KB   108/108 KB   608/763 KB   48/103 KB   
15/15 KB   108/108 KB   608/763 KB   52/103 KB   
15/15 KB   108/108 KB   608/763 KB   56/103 KB   
15/15 KB   108/108 KB   612/763 KB   56/103 KB   
15/15 KB   108/108 KB   612/763 KB   60/103 KB   
15/15 KB   108/108 KB   616/763 KB   60/103 KB   
15/15 KB   108/108 KB   620/763 KB   64/103 KB   
15/15 KB   108/108 KB   624/763 KB   64/103 KB   
15/15 KB   108/108 KB   616/763 KB   64/103 KB   
15/15 KB   108/108 KB   628/763 KB   64/103 KB   
15/15 KB   108/108 KB   632/763 KB   64/103 KB   
                                                 
108/108 KB   636/763 KB   64/103 KB              
Downloaded: https://repo.maven.apache.org/maven2/org/apache/geronimo/specs/geronimo-annotation_1.1_spec/1.0.1/geronimo-annotation_1.1_spec-1.0.1.jar
(15 KB at 127.9 KB/sec)
108/108 KB   640/763 KB   64/103 KB   
108/108 KB   640/763 KB   68/103 KB   
108/108 KB   640/763 KB   72/103 KB   
108/108 KB   640/763 KB   76/103 KB   
108/108 KB   640/763 KB   80/103 KB   
108/108 KB   644/763 KB   80/103 KB   
108/108 KB   648/763 KB   80/103 KB   
108/108 KB   652/763 KB   80/103 KB   
108/108 KB   656/763 KB   80/103 KB   
108/108 KB   656/763 KB   84/103 KB   
108/108 KB   656/763 KB   88/103 KB   
108/108 KB   656/763 KB   92/103 KB   
108/108 KB   656/763 KB   96/103 KB   
108/108 KB   656/763 KB   100/103 KB   
108/108 KB   660/763 KB   100/103 KB   
108/108 KB   660/763 KB   103/103 KB   
108/108 KB   664/763 KB   103/103 KB   
108/108 KB   668/763 KB   103/103 KB   
108/108 KB   672/763 KB   103/103 KB   
108/108 KB   676/763 KB   103/103 KB   
108/108 KB   680/763 KB   103/103 KB   
108/108 KB   684/763 KB   103/103 KB   
108/108 KB   688/763 KB   103/103 KB   
                                       
Downloaded: https://repo.maven.apache.org/maven2/org/jboss/resteasy/tjws/3.0.17.Final/tjws-3.0.17.Final.jar
(108 KB at 911.5 KB/sec)
692/763 KB   103/103 KB                
696/763 KB   103/103 KB   
700/763 KB   103/103 KB   
704/763 KB   103/103 KB   
708/763 KB   103/103 KB   
712/763 KB   103/103 KB   
716/763 KB   103/103 KB   
720/763 KB   103/103 KB   
                          
Downloaded: https://repo.maven.apache.org/maven2/javax/servlet/servlet-api/2.5/servlet-api-2.5.jar
(103 KB at 855.4 KB/sec)
724/763 KB                
728/763 KB   
732/763 KB   
736/763 KB   
740/763 KB   
744/763 KB   
748/763 KB   
752/763 KB   
756/763 KB   
760/763 KB   
763/763 KB   
             
Downloaded: https://repo.maven.apache.org/maven2/org/codehaus/jackson/jackson-mapper-asl/1.9.12/jackson-mapper-asl-1.9.12.jar
(763 KB at 6096.8 KB/sec)
4/78 KB      
8/78 KB   
12/78 KB   
16/78 KB   
20/78 KB   
24/78 KB   
28/78 KB   
32/78 KB   
36/78 KB   
40/78 KB   
44/78 KB   
48/78 KB   
52/78 KB   
56/78 KB   
60/78 KB   
64/78 KB   
68/78 KB   
72/78 KB   
76/78 KB   
78/78 KB   
           
Downloaded: https://repo.maven.apache.org/maven2/org/jboss/resteasy/resteasy-jaxb-provider/3.0.17.Final/resteasy-jaxb-provider-3.0.17.Final.jar
(78 KB at 281.8 KB/sec)
[INFO] 
[INFO] --- maven-enforcer-plugin:1.4:enforce (enforce-maven) @ artemis-rest ---
[INFO] 
[INFO] --- maven-enforcer-plugin:1.4:enforce (enforce-java) @ artemis-rest ---
[INFO] 
[INFO] --- maven-remote-resources-plugin:1.5:process (process-resource-bundles) @ artemis-rest
---
[INFO] 
[INFO] --- maven-resources-plugin:2.6:resources (default-resources) @ artemis-rest ---
[INFO] Using 'UTF-8' encoding to copy filtered resources.
[INFO] Copying 1 resource
[INFO] Copying 3 resources
[INFO] 
[INFO] --- maven-compiler-plugin:3.1:compile (default-compile) @ artemis-rest ---
[INFO] Changes detected - recompiling the module!
[INFO] Compiling 66 source files to <https://builds.apache.org/job/ActiveMQ-Artemis-Master/ws/artemis-rest/target/classes>
<https://builds.apache.org/job/ActiveMQ-Artemis-Master/ws/artemis-rest/src/main/java/org/apache/activemq/artemis/rest/topic/SubscriptionsResource.java>:379:
error: [LongLiteralLowerCaseSuffix] Prefer 'L' to 'l' for the suffix to long literals
            tmp = createConsumer(true, autoAck, subscriptionId, null, consumerTimeoutSeconds
* 1000l, false);
                                                                                         
     ^
    (see http://errorprone.info/bugpattern/LongLiteralLowerCaseSuffix)
  Did you mean 'tmp = createConsumer(true, autoAck, subscriptionId, null, consumerTimeoutSeconds
* 1000L, false);'?
Note: Some input files use or override a deprecated API.
Note: Recompile with -Xlint:deprecation for details.
Note: <https://builds.apache.org/job/ActiveMQ-Artemis-Master/ws/artemis-rest/src/main/java/org/apache/activemq/artemis/rest/Jms.java>
uses unchecked or unsafe operations.
Note: Recompile with -Xlint:unchecked for details.
1 error
[INFO] ------------------------------------------------------------------------
[INFO] Reactor Summary:
[INFO] 
[INFO] ActiveMQ Artemis Parent ............................ SUCCESS [ 12.922 s]
[INFO] ActiveMQ Artemis Commons ........................... SUCCESS [ 10.877 s]
[INFO] ActiveMQ Artemis Core Client ....................... SUCCESS [ 13.079 s]
[INFO] ActiveMQ Artemis Selector Implementation ........... SUCCESS [  6.424 s]
[INFO] ActiveMQ Artemis JMS Client ........................ SUCCESS [  5.731 s]
[INFO] ActiveMQ Artemis Native POM ........................ SUCCESS [  3.418 s]
[INFO] ActiveMQ Artemis Journal ........................... SUCCESS [  4.417 s]
[INFO] ActiveMQ Artemis JDBC Store ........................ SUCCESS [  5.671 s]
[INFO] ActiveMQ Artemis Server ............................ SUCCESS [ 44.190 s]
[INFO] ActiveMQ Artemis Protocols ......................... SUCCESS [  1.341 s]
[INFO] ActiveMQ Artemis Proton Protocol ................... SUCCESS [  5.627 s]
[INFO] ActiveMQ Artemis AMQP Protocol ..................... SUCCESS [  3.702 s]
[INFO] ActiveMQ Artemis STOMP Protocol .................... SUCCESS [  2.875 s]
[INFO] ActiveMQ Artemis OpenWire Protocol ................. SUCCESS [  2.932 s]
[INFO] ActiveMQ Artemis HQClient Protocol ................. SUCCESS [  1.859 s]
[INFO] ActiveMQ Artemis HornetQ Protocol .................. SUCCESS [  1.951 s]
[INFO] ActiveMQ Artemis MQTT Protocol ..................... SUCCESS [  2.933 s]
[INFO] ActiveMQ Artemis DTO ............................... SUCCESS [  4.854 s]
[INFO] ActiveMQ Artemis Boot .............................. SUCCESS [  1.553 s]
[INFO] ActiveMQ Artemis Service Extensions ................ SUCCESS [  3.204 s]
[INFO] ActiveMQ Artemis JMS Server ........................ SUCCESS [  3.973 s]
[INFO] ActiveMQ Artemis CLI ............................... SUCCESS [ 20.021 s]
[INFO] ActiveMQ Artemis Web ............................... SUCCESS [  7.608 s]
[INFO] ActiveMQ Artemis Web ............................... SUCCESS [  1.881 s]
[INFO] ActiveMQ Artemis RAR POM ........................... SUCCESS [  3.728 s]
[INFO] ActiveMQ Artemis REST Interface Implementation ..... FAILURE [  1.830 s]
[INFO] ActiveMQ Artemis Maven Plugin ...................... SKIPPED
[INFO] ActiveMQ Artemis Server OSGi ....................... SKIPPED
[INFO] ActiveMQ Artemis Spring Integration ................ SKIPPED
[INFO] ActiveMQ Artemis Aerogear Integration .............. SKIPPED
[INFO] ActiveMQ Artemis Vert.x Integration ................ SKIPPED
[INFO] Apache ActiveMQ Artemis Distribution ............... SKIPPED
[INFO] ActiveMQ Artemis Tests POM ......................... SKIPPED
[INFO] ActiveMQ Artemis Unit Tests ........................ SKIPPED
[INFO] ActiveMQ Artemis Joram Tests ....................... SKIPPED
[INFO] ActiveMQ Artemis timing Tests ...................... SKIPPED
[INFO] ActiveMQ Artemis JMS Tests ......................... SKIPPED
[INFO] ActiveMQ Artemis Features .......................... SKIPPED
[INFO] ActiveMQ Artemis Test Support ...................... SKIPPED
[INFO] ActiveMQ Artemis Integration Tests ................. SKIPPED
[INFO] ActiveMQ Artemis soak Tests ........................ SKIPPED
[INFO] ActiveMQ Artemis stress Tests ...................... SKIPPED
[INFO] ActiveMQ Artemis performance Tests ................. SKIPPED
[INFO] ActiveMQ Artemis Extra Tests ....................... SKIPPED
[INFO] ------------------------------------------------------------------------
[INFO] BUILD FAILURE
[INFO] ------------------------------------------------------------------------
[INFO] Total time: 03:07 min
[INFO] Finished at: 2016-09-07T13:23:26+00:00
[INFO] Final Memory: 118M/499M
[INFO] ------------------------------------------------------------------------
[ERROR] Failed to execute goal org.apache.maven.plugins:maven-compiler-plugin:3.1:compile
(default-compile) on project artemis-rest: Compilation failure -> [Help 1]
[ERROR] 
[ERROR] To see the full stack trace of the errors, re-run Maven with the -e switch.
[ERROR] Re-run Maven using the -X switch to enable full debug logging.
[ERROR] 
[ERROR] For more information about the errors and possible solutions, please read the following
articles:
[ERROR] [Help 1] http://cwiki.apache.org/confluence/display/MAVEN/MojoFailureException
[ERROR] 
[ERROR] After correcting the problems, you can resume the build with the command
[ERROR]   mvn <goals> -rf :artemis-rest
Build step 'Invoke top-level Maven targets' marked build as failure
Performing Post build task...
Could not match :Too many files with unapproved license  : False
Logical operation result is FALSE
Skipping script  : cat ratReport.txt
END OF POST BUILD TASK 	: 0
Recording test results

Mime
View raw message