activemq-commits mailing list archives

Site index · List index
Message view « Date » · « Thread »
Top « Date » · « Thread »
From Apache Jenkins Server <jenk...@builds.apache.org>
Subject Build failed in Jenkins: ActiveMQ-Artemis-Master #666
Date Wed, 28 Sep 2016 19:15:16 GMT
See <https://builds.apache.org/job/ActiveMQ-Artemis-Master/666/changes>

Changes:

[clebertsuconic] ARTEMIS-739 fix large msg file leak on copy

------------------------------------------
[...truncated 35182 lines...]
22342/22802 KB   
22346/22802 KB   
22350/22802 KB   
22354/22802 KB   
22358/22802 KB   
22362/22802 KB   
22366/22802 KB   
22370/22802 KB   
22374/22802 KB   
22378/22802 KB   
22382/22802 KB   
22386/22802 KB   
22390/22802 KB   
22394/22802 KB   
22398/22802 KB   
22402/22802 KB   
22406/22802 KB   
22410/22802 KB   
22414/22802 KB   
22418/22802 KB   
22422/22802 KB   
22426/22802 KB   
22430/22802 KB   
22434/22802 KB   
22438/22802 KB   
22442/22802 KB   
22446/22802 KB   
22450/22802 KB   
22454/22802 KB   
22458/22802 KB   
22462/22802 KB   
22466/22802 KB   
22470/22802 KB   
22474/22802 KB   
22478/22802 KB   
22482/22802 KB   
22486/22802 KB   
22490/22802 KB   
22494/22802 KB   
22498/22802 KB   
22502/22802 KB   
22506/22802 KB   
22510/22802 KB   
22514/22802 KB   
22518/22802 KB   
22522/22802 KB   
22526/22802 KB   
22530/22802 KB   
22534/22802 KB   
22538/22802 KB   
22542/22802 KB   
22546/22802 KB   
22550/22802 KB   
22554/22802 KB   
22558/22802 KB   
22562/22802 KB   
22566/22802 KB   
22570/22802 KB   
22574/22802 KB   
22578/22802 KB   
22582/22802 KB   
22586/22802 KB   
22590/22802 KB   
22594/22802 KB   
22598/22802 KB   
22602/22802 KB   
22606/22802 KB   
22610/22802 KB   
22614/22802 KB   
22618/22802 KB   
22622/22802 KB   
22626/22802 KB   
22630/22802 KB   
22634/22802 KB   
22638/22802 KB   
22642/22802 KB   
22646/22802 KB   
22650/22802 KB   
22654/22802 KB   
22658/22802 KB   
22662/22802 KB   
22666/22802 KB   
22670/22802 KB   
22674/22802 KB   
22678/22802 KB   
22682/22802 KB   
22686/22802 KB   
22690/22802 KB   
22694/22802 KB   
22698/22802 KB   
22702/22802 KB   
22706/22802 KB   
22710/22802 KB   
22714/22802 KB   
22718/22802 KB   
22722/22802 KB   
22726/22802 KB   
22730/22802 KB   
22734/22802 KB   
22738/22802 KB   
22742/22802 KB   
22746/22802 KB   
22750/22802 KB   
22754/22802 KB   
22758/22802 KB   
22762/22802 KB   
22766/22802 KB   
22770/22802 KB   
22774/22802 KB   
22778/22802 KB   
22782/22802 KB   
22786/22802 KB   
22790/22802 KB   
22794/22802 KB   
22798/22802 KB   
22802/22802 KB   
22802/22802 KB   
                 
Downloaded: https://repo.maven.apache.org/maven2/org/apache/karaf/apache-karaf/4.0.6/apache-karaf-4.0.6.tar.gz
(22802 KB at 10755.3 KB/sec)
[INFO] 
[INFO] --- maven-enforcer-plugin:1.4:enforce (enforce-maven) @ integration-tests ---
[INFO] 
[INFO] --- maven-enforcer-plugin:1.4:enforce (enforce-java) @ integration-tests ---
[INFO] 
[INFO] --- maven-remote-resources-plugin:1.5:process (process-resource-bundles) @ integration-tests
---
Downloading: https://repo.eclipse.org/content/repositories/paho-releases/com/fasterxml/jackson/core/jackson-databind/2.2.2/jackson-databind-2.2.2.pom
                 
Downloading: https://repo.maven.apache.org/maven2/com/fasterxml/jackson/core/jackson-databind/2.2.2/jackson-databind-2.2.2.pom
                 
Downloaded: https://repo.maven.apache.org/maven2/com/fasterxml/jackson/core/jackson-databind/2.2.2/jackson-databind-2.2.2.pom
(0 B at 0.0 KB/sec)
Downloading: https://repo.eclipse.org/content/repositories/paho-releases/com/fasterxml/oss-parent/10/oss-parent-10.pom
                 
Downloading: https://repo.maven.apache.org/maven2/com/fasterxml/oss-parent/10/oss-parent-10.pom
                 
Downloaded: https://repo.maven.apache.org/maven2/com/fasterxml/oss-parent/10/oss-parent-10.pom
(0 B at 0.0 KB/sec)
Downloading: https://repo.eclipse.org/content/repositories/paho-releases/com/fasterxml/jackson/core/jackson-core/2.2.2/jackson-core-2.2.2.pom
                 
Downloading: https://repo.maven.apache.org/maven2/com/fasterxml/jackson/core/jackson-core/2.2.2/jackson-core-2.2.2.pom
                 
Downloaded: https://repo.maven.apache.org/maven2/com/fasterxml/jackson/core/jackson-core/2.2.2/jackson-core-2.2.2.pom
(0 B at 0.0 KB/sec)
Downloading: https://repo.eclipse.org/content/repositories/paho-releases/io/vertx/testtools/2.0.3-final/testtools-2.0.3-final.pom
                 
Downloading: https://repo.maven.apache.org/maven2/io/vertx/testtools/2.0.3-final/testtools-2.0.3-final.pom
                 
Downloaded: https://repo.maven.apache.org/maven2/io/vertx/testtools/2.0.3-final/testtools-2.0.3-final.pom
(0 B at 0.0 KB/sec)
Downloading: https://repo.eclipse.org/content/repositories/paho-releases/io/vertx/vertx-core/2.0.2-final/vertx-core-2.0.2-final.pom
                 
Downloading: https://repo.maven.apache.org/maven2/io/vertx/vertx-core/2.0.2-final/vertx-core-2.0.2-final.pom
                 
Downloaded: https://repo.maven.apache.org/maven2/io/vertx/vertx-core/2.0.2-final/vertx-core-2.0.2-final.pom
(0 B at 0.0 KB/sec)
Downloading: https://repo.eclipse.org/content/repositories/paho-releases/junit/junit-dep/4.11/junit-dep-4.11.pom
                 
Downloading: https://repo.maven.apache.org/maven2/junit/junit-dep/4.11/junit-dep-4.11.pom
                 
Downloaded: https://repo.maven.apache.org/maven2/junit/junit-dep/4.11/junit-dep-4.11.pom (0
B at 0.0 KB/sec)
Downloading: https://repo.eclipse.org/content/repositories/paho-releases/io/vertx/vertx-platform/2.0.2-final/vertx-platform-2.0.2-final.pom
                 
Downloading: https://repo.maven.apache.org/maven2/io/vertx/vertx-platform/2.0.2-final/vertx-platform-2.0.2-final.pom
                 
Downloaded: https://repo.maven.apache.org/maven2/io/vertx/vertx-platform/2.0.2-final/vertx-platform-2.0.2-final.pom
(0 B at 0.0 KB/sec)
[INFO] 
[INFO] --- depends-maven-plugin:1.2:generate-depends-file (generate-depends-file) @ integration-tests
---
[INFO] Created: <https://builds.apache.org/job/ActiveMQ-Artemis-Master/ws/tests/integration-tests/target/classes/META-INF/maven/dependencies.properties>
[INFO] 
[INFO] --- maven-resources-plugin:2.6:resources (default-resources) @ integration-tests ---
[INFO] Using 'UTF-8' encoding to copy filtered resources.
[INFO] skip non existing resourceDirectory <https://builds.apache.org/job/ActiveMQ-Artemis-Master/ws/tests/integration-tests/src/main/resources>
[INFO] Copying 3 resources
[INFO] 
[INFO] --- maven-compiler-plugin:3.1:compile (default-compile) @ integration-tests ---
[INFO] No sources to compile
[INFO] 
[INFO] --- maven-checkstyle-plugin:2.17:check (default) @ integration-tests ---
[INFO] Starting audit...
<https://builds.apache.org/job/ActiveMQ-Artemis-Master/ws/tests/integration-tests/src/test/java/org/apache/activemq/artemis/tests/integration/client/DeadLetterAddressTest.java>:19:8:
error: Unused import - java.io.File.
Audit done.
[INFO] There is 1 error reported by Checkstyle 6.11.2 with <https://builds.apache.org/job/ActiveMQ-Artemis-Master/ws/tests/integration-tests/../../etc/checkstyle.xml>
ruleset.
[ERROR] src/test/java/org/apache/activemq/artemis/tests/integration/client/DeadLetterAddressTest.java:[19,8]
(imports) UnusedImports: Unused import - java.io.File.
[INFO] ------------------------------------------------------------------------
[INFO] Reactor Summary:
[INFO] 
[INFO] ActiveMQ Artemis Parent ............................ SUCCESS [  6.306 s]
[INFO] ActiveMQ Artemis Commons ........................... SUCCESS [ 11.644 s]
[INFO] ActiveMQ Artemis Core Client ....................... SUCCESS [ 12.035 s]
[INFO] ActiveMQ Artemis Selector Implementation ........... SUCCESS [  4.908 s]
[INFO] ActiveMQ Artemis JMS Client ........................ SUCCESS [  5.728 s]
[INFO] ActiveMQ Artemis Native POM ........................ SUCCESS [  3.876 s]
[INFO] ActiveMQ Artemis Journal ........................... SUCCESS [  4.698 s]
[INFO] ActiveMQ Artemis JDBC Store ........................ SUCCESS [  5.977 s]
[INFO] ActiveMQ Artemis Server ............................ SUCCESS [ 46.437 s]
[INFO] ActiveMQ Artemis Protocols ......................... SUCCESS [  1.378 s]
[INFO] ActiveMQ Artemis AMQP Protocol ..................... SUCCESS [  6.881 s]
[INFO] ActiveMQ Artemis STOMP Protocol .................... SUCCESS [  3.042 s]
[INFO] ActiveMQ Artemis OpenWire Protocol ................. SUCCESS [  3.006 s]
[INFO] ActiveMQ Artemis HQClient Protocol ................. SUCCESS [  1.818 s]
[INFO] ActiveMQ Artemis HornetQ Protocol .................. SUCCESS [  2.014 s]
[INFO] ActiveMQ Artemis MQTT Protocol ..................... SUCCESS [  2.908 s]
[INFO] ActiveMQ Artemis DTO ............................... SUCCESS [  4.360 s]
[INFO] ActiveMQ Artemis Boot .............................. SUCCESS [  1.540 s]
[INFO] ActiveMQ Artemis Service Extensions ................ SUCCESS [  3.340 s]
[INFO] ActiveMQ Artemis JMS Server ........................ SUCCESS [  3.985 s]
[INFO] ActiveMQ Artemis CLI ............................... SUCCESS [ 18.107 s]
[INFO] ActiveMQ Artemis Web ............................... SUCCESS [  6.875 s]
[INFO] ActiveMQ Artemis Web ............................... SUCCESS [  2.436 s]
[INFO] ActiveMQ Artemis JUnit Rules ....................... SUCCESS [  7.523 s]
[INFO] ActiveMQ Artemis RAR POM ........................... SUCCESS [  3.793 s]
[INFO] ActiveMQ Artemis REST Interface Implementation ..... SUCCESS [01:18 min]
[INFO] ActiveMQ Artemis Maven Plugin ...................... SUCCESS [  6.278 s]
[INFO] ActiveMQ Artemis Server OSGi ....................... SUCCESS [  3.317 s]
[INFO] ActiveMQ Artemis Spring Integration ................ SUCCESS [  2.358 s]
[INFO] ActiveMQ Artemis Aerogear Integration .............. SUCCESS [  2.665 s]
[INFO] ActiveMQ Artemis Vert.x Integration ................ SUCCESS [  3.021 s]
[INFO] Apache ActiveMQ Artemis Distribution ............... SUCCESS [  5.237 s]
[INFO] ActiveMQ Artemis Tests POM ......................... SUCCESS [  2.417 s]
[INFO] ActiveMQ Artemis Unit Tests ........................ SUCCESS [01:53 min]
[INFO] ActiveMQ Artemis Joram Tests ....................... SUCCESS [ 58.781 s]
[INFO] ActiveMQ Artemis timing Tests ...................... SUCCESS [  2.595 s]
[INFO] ActiveMQ Artemis JMS Tests ......................... SUCCESS [03:03 min]
[INFO] ActiveMQ Artemis Features .......................... SUCCESS [  0.113 s]
[INFO] ActiveMQ Artemis Test Support ...................... SUCCESS [  2.951 s]
[INFO] ActiveMQ Artemis Integration Tests ................. FAILURE [ 16.099 s]
[INFO] ActiveMQ Artemis soak Tests ........................ SKIPPED
[INFO] ActiveMQ Artemis stress Tests ...................... SKIPPED
[INFO] ActiveMQ Artemis performance Tests ................. SKIPPED
[INFO] ActiveMQ Artemis Extra Tests ....................... SKIPPED
[INFO] ------------------------------------------------------------------------
[INFO] BUILD FAILURE
[INFO] ------------------------------------------------------------------------
[INFO] Total time: 10:57 min
[INFO] Finished at: 2016-09-28T19:14:54+00:00
[INFO] Final Memory: 204M/642M
[INFO] ------------------------------------------------------------------------
[ERROR] Failed to execute goal org.apache.maven.plugins:maven-checkstyle-plugin:2.17:check
(default) on project integration-tests: You have 1 Checkstyle violation. -> [Help 1]
[ERROR] 
[ERROR] To see the full stack trace of the errors, re-run Maven with the -e switch.
[ERROR] Re-run Maven using the -X switch to enable full debug logging.
[ERROR] 
[ERROR] For more information about the errors and possible solutions, please read the following
articles:
[ERROR] [Help 1] http://cwiki.apache.org/confluence/display/MAVEN/MojoFailureException
[ERROR] 
[ERROR] After correcting the problems, you can resume the build with the command
[ERROR]   mvn <goals> -rf :integration-tests
Build step 'Invoke top-level Maven targets' marked build as failure
Performing Post build task...
Could not match :Too many files with unapproved license  : False
Logical operation result is FALSE
Skipping script  : cat ratReport.txt
END OF POST BUILD TASK 	: 0
Recording test results

Mime
View raw message