activemq-commits mailing list archives

Site index · List index
Message view « Date » · « Thread »
Top « Date » · « Thread »
From Apache Jenkins Server <jenk...@builds.apache.org>
Subject Build failed in Jenkins: ActiveMQ-Artemis-Master #612
Date Thu, 25 Aug 2016 18:40:15 GMT
See <https://builds.apache.org/job/ActiveMQ-Artemis-Master/612/changes>

Changes:

[clebertsuconic] Unnecessary @SuppressWarnings fixes

[clebertsuconic] Unchecked warning suppression fixes

[clebertsuconic] Missing @Override fixes

[clebertsuconic] Potential resource leak fixes

[clebertsuconic] Spelling fixes

[clebertsuconic] for and while loop to foreach conversions

[clebertsuconic] Javadoc error fixes

[clebertsuconic] ARTEMIS-700 Improving how the log manager is found on Posix systems

------------------------------------------
[...truncated 860 lines...]
[INFO] 
[INFO] --- apache-rat-plugin:0.12:check (default) @ artemis-selector ---
[INFO] Enabled default license matchers.
[INFO] Will parse SCM ignores for exclusions...
[INFO] Finished adding exclusions from SCM ignore files.
[INFO] 61 implicit excludes (use -debug for more details).
[INFO] Exclude: **/*.txt
[INFO] Exclude: **/*.md
[INFO] Exclude: etc/org.eclipse.*
[INFO] Exclude: docs/**/*.json
[INFO] Exclude: docs/**/_book/
[INFO] Exclude: **/target/
[INFO] Exclude: **/META-INF/services/*
[INFO] Exclude: **/*.iml
[INFO] Exclude: **/*.jceks
[INFO] Exclude: **/*.jks
[INFO] Exclude: **/org/apache/activemq/artemis/utils/json/**
[INFO] Exclude: **/org/apache/activemq/artemis/utils/Base64.java
[INFO] Exclude: **/.settings/**
[INFO] Exclude: **/.project
[INFO] Exclude: **/.classpath
[INFO] Exclude: **/.checkstyle
[INFO] Exclude: **/.factorypath
[INFO] Exclude: ratReport.txt
[INFO] Exclude: **/org.apache.activemq.artemis.cfg
[INFO] Exclude: **/*.data
[INFO] Exclude: **/*.bin
[INFO] Exclude: **/src/test/resources/keystore
[INFO] Exclude: **/*.log
[INFO] Exclude: **/*.redo
[INFO] Exclude: **/node/**
[INFO] Exclude: **/node_modules/**
[INFO] Exclude: **/package.json
[INFO] Exclude: **/npm-shrinkwrap.json
[INFO] Exclude: **/CMakeCache.txt
[INFO] Exclude: **/CMakeFiles/
[INFO] Exclude: **/Makefile
[INFO] Exclude: **/cmake_install.cmake
[INFO] Exclude: artemis-native/src/main/c/org_apache_activemq_artemis_jlibaio_LibaioContext.h
[INFO] 23 resources included (use -debug for more details)
[INFO] Rat check: Summary over all files. Unapproved: 0, unknown: 0, generated: 0, approved:
23 licenses.
[INFO] 
[INFO] --- maven-resources-plugin:2.6:testResources (default-testResources) @ artemis-selector
---
[INFO] Using 'UTF-8' encoding to copy filtered resources.
[INFO] skip non existing resourceDirectory <https://builds.apache.org/job/ActiveMQ-Artemis-Master/ws/artemis-selector/src/test/resources>
[INFO] Copying 3 resources
[INFO] Copying 3 resources
[INFO] 
[INFO] --- maven-compiler-plugin:3.1:testCompile (default-testCompile) @ artemis-selector
---
[INFO] Changes detected - recompiling the module!
[INFO] Compiling 3 source files to <https://builds.apache.org/job/ActiveMQ-Artemis-Master/ws/artemis-selector/target/test-classes>
[INFO] 
[INFO] --- maven-enforcer-plugin:1.4:enforce (enforce-maven) @ artemis-selector ---
[INFO] 
[INFO] --- maven-enforcer-plugin:1.4:enforce (enforce-java) @ artemis-selector ---
[INFO] 
[INFO] --- javacc-maven-plugin:2.6:javacc (javacc) @ artemis-selector ---
[INFO] Skipping - all parsers are up to date
[INFO] 
[INFO] --- javacc-maven-plugin:2.6:javacc (default) @ artemis-selector ---
[INFO] Skipping - all parsers are up to date
[INFO] 
[INFO] --- build-helper-maven-plugin:1.8:add-source (add-source) @ artemis-selector ---
[INFO] Source directory: <https://builds.apache.org/job/ActiveMQ-Artemis-Master/ws/artemis-selector/target/generated-sources/javacc>
added.
[INFO] 
[INFO] --- maven-remote-resources-plugin:1.5:process (process-resource-bundles) @ artemis-selector
---
[INFO] 
[INFO] --- maven-resources-plugin:2.6:resources (default-resources) @ artemis-selector ---
[INFO] Using 'UTF-8' encoding to copy filtered resources.
[INFO] skip non existing resourceDirectory <https://builds.apache.org/job/ActiveMQ-Artemis-Master/ws/artemis-selector/src/main/resources>
[INFO] Copying 3 resources
[INFO] Copying 3 resources
[INFO] Copying 3 resources
[INFO] 
[INFO] --- maven-compiler-plugin:3.1:compile (default-compile) @ artemis-selector ---
[INFO] Nothing to compile - all classes are up to date
[INFO] 
[INFO] --- maven-checkstyle-plugin:2.17:check (default) @ artemis-selector ---
[INFO] Starting audit...
Audit done.
[INFO] 
[INFO] --- apache-rat-plugin:0.12:check (default) @ artemis-selector ---
[INFO] Enabled default license matchers.
[INFO] Will parse SCM ignores for exclusions...
[INFO] Finished adding exclusions from SCM ignore files.
[INFO] 61 implicit excludes (use -debug for more details).
[INFO] Exclude: **/*.txt
[INFO] Exclude: **/*.md
[INFO] Exclude: etc/org.eclipse.*
[INFO] Exclude: docs/**/*.json
[INFO] Exclude: docs/**/_book/
[INFO] Exclude: **/target/
[INFO] Exclude: **/META-INF/services/*
[INFO] Exclude: **/*.iml
[INFO] Exclude: **/*.jceks
[INFO] Exclude: **/*.jks
[INFO] Exclude: **/org/apache/activemq/artemis/utils/json/**
[INFO] Exclude: **/org/apache/activemq/artemis/utils/Base64.java
[INFO] Exclude: **/.settings/**
[INFO] Exclude: **/.project
[INFO] Exclude: **/.classpath
[INFO] Exclude: **/.checkstyle
[INFO] Exclude: **/.factorypath
[INFO] Exclude: ratReport.txt
[INFO] Exclude: **/org.apache.activemq.artemis.cfg
[INFO] Exclude: **/*.data
[INFO] Exclude: **/*.bin
[INFO] Exclude: **/src/test/resources/keystore
[INFO] Exclude: **/*.log
[INFO] Exclude: **/*.redo
[INFO] Exclude: **/node/**
[INFO] Exclude: **/node_modules/**
[INFO] Exclude: **/package.json
[INFO] Exclude: **/npm-shrinkwrap.json
[INFO] Exclude: **/CMakeCache.txt
[INFO] Exclude: **/CMakeFiles/
[INFO] Exclude: **/Makefile
[INFO] Exclude: **/cmake_install.cmake
[INFO] Exclude: artemis-native/src/main/c/org_apache_activemq_artemis_jlibaio_LibaioContext.h
[INFO] 23 resources included (use -debug for more details)
[INFO] Rat check: Summary over all files. Unapproved: 0, unknown: 0, generated: 0, approved:
23 licenses.
[INFO] 
[INFO] --- maven-resources-plugin:2.6:testResources (default-testResources) @ artemis-selector
---
[INFO] Using 'UTF-8' encoding to copy filtered resources.
[INFO] skip non existing resourceDirectory <https://builds.apache.org/job/ActiveMQ-Artemis-Master/ws/artemis-selector/src/test/resources>
[INFO] Copying 3 resources
[INFO] Copying 3 resources
[INFO] Copying 3 resources
[INFO] 
[INFO] --- maven-compiler-plugin:3.1:testCompile (default-testCompile) @ artemis-selector
---
[INFO] Nothing to compile - all classes are up to date
[INFO] 
[INFO] --- maven-surefire-plugin:2.18.1:test (default-test) @ artemis-selector ---
[INFO] Surefire report directory: <https://builds.apache.org/job/ActiveMQ-Artemis-Master/ws/artemis-selector/target/surefire-reports>

-------------------------------------------------------
 T E S T S
-------------------------------------------------------
Running org.apache.activemq.artemis.selector.SelectorParserTest
Expression: XPATH '//title[@lang=''eng'']'
Parsing: x = 1 and y = 2
Parsing: (x = 1) and (y = 2)
Parsing: ((x = 1) and (y = 2))
Tests run: 2, Failures: 0, Errors: 0, Skipped: 0, Time elapsed: 0.248 sec - in org.apache.activemq.artemis.selector.SelectorParserTest
Running org.apache.activemq.artemis.selector.SelectorTest
Tests run: 21, Failures: 0, Errors: 0, Skipped: 0, Time elapsed: 0.151 sec - in org.apache.activemq.artemis.selector.SelectorTest
Running org.apache.activemq.artemis.selector.filter.UnaryExpressionTest
Tests run: 1, Failures: 0, Errors: 0, Skipped: 0, Time elapsed: 0 sec - in org.apache.activemq.artemis.selector.filter.UnaryExpressionTest

Results :

Tests run: 24, Failures: 0, Errors: 0, Skipped: 0

[INFO]                                                                         
[INFO] ------------------------------------------------------------------------
[INFO] Building ActiveMQ Artemis JMS Client 1.5.0-SNAPSHOT
[INFO] ------------------------------------------------------------------------
[INFO] 
[INFO] --- maven-enforcer-plugin:1.4:enforce (enforce-maven) @ artemis-jms-client ---
[INFO] 
[INFO] --- maven-enforcer-plugin:1.4:enforce (enforce-java) @ artemis-jms-client ---
[INFO] 
[INFO] --- maven-remote-resources-plugin:1.5:process (process-resource-bundles) @ artemis-jms-client
---
[INFO] 
[INFO] --- maven-resources-plugin:2.6:resources (default-resources) @ artemis-jms-client ---
[INFO] Using 'UTF-8' encoding to copy filtered resources.
[INFO] skip non existing resourceDirectory <https://builds.apache.org/job/ActiveMQ-Artemis-Master/ws/artemis-jms-client/src/main/resources>
[INFO] Copying 3 resources
[INFO] 
[INFO] --- maven-compiler-plugin:3.1:compile (default-compile) @ artemis-jms-client ---
[INFO] Changes detected - recompiling the module!
[INFO] Compiling 67 source files to <https://builds.apache.org/job/ActiveMQ-Artemis-Master/ws/artemis-jms-client/target/classes>
<https://builds.apache.org/job/ActiveMQ-Artemis-Master/ws/artemis-jms-client/src/main/java/org/apache/activemq/artemis/jms/client/ActiveMQTextMessage.java>:124:
error: cannot find symbol
   public boolean isBodyAssignableTo(ctiClass c) {
                                     ^
  symbol:   class ctiClass
  location: class ActiveMQTextMessage
1 error
[INFO] ------------------------------------------------------------------------
[INFO] Reactor Summary:
[INFO] 
[INFO] ActiveMQ Artemis Parent ............................ SUCCESS [  5.808 s]
[INFO] ActiveMQ Artemis Commons ........................... SUCCESS [  8.991 s]
[INFO] ActiveMQ Artemis Core Client ....................... SUCCESS [ 11.204 s]
[INFO] ActiveMQ Artemis Selector Implementation ........... SUCCESS [  4.452 s]
[INFO] ActiveMQ Artemis JMS Client ........................ FAILURE [  1.018 s]
[INFO] ActiveMQ Artemis Native POM ........................ SKIPPED
[INFO] ActiveMQ Artemis Journal ........................... SKIPPED
[INFO] ActiveMQ Artemis JDBC Store ........................ SKIPPED
[INFO] ActiveMQ Artemis Server ............................ SKIPPED
[INFO] ActiveMQ Artemis Protocols ......................... SKIPPED
[INFO] ActiveMQ Artemis Proton Protocol ................... SKIPPED
[INFO] ActiveMQ Artemis AMQP Protocol ..................... SKIPPED
[INFO] ActiveMQ Artemis STOMP Protocol .................... SKIPPED
[INFO] ActiveMQ Artemis OpenWire Protocol ................. SKIPPED
[INFO] ActiveMQ Artemis HQClient Protocol ................. SKIPPED
[INFO] ActiveMQ Artemis HornetQ Protocol .................. SKIPPED
[INFO] ActiveMQ Artemis MQTT Protocol ..................... SKIPPED
[INFO] ActiveMQ Artemis DTO ............................... SKIPPED
[INFO] ActiveMQ Artemis Boot .............................. SKIPPED
[INFO] ActiveMQ Artemis Service Extensions ................ SKIPPED
[INFO] ActiveMQ Artemis JMS Server ........................ SKIPPED
[INFO] ActiveMQ Artemis CLI ............................... SKIPPED
[INFO] ActiveMQ Artemis Web ............................... SKIPPED
[INFO] ActiveMQ Artemis Web ............................... SKIPPED
[INFO] ActiveMQ Artemis RAR POM ........................... SKIPPED
[INFO] ActiveMQ Artemis REST Interface Implementation ..... SKIPPED
[INFO] ActiveMQ Artemis Maven Plugin ...................... SKIPPED
[INFO] ActiveMQ Artemis Server OSGi ....................... SKIPPED
[INFO] ActiveMQ Artemis Spring Integration ................ SKIPPED
[INFO] ActiveMQ Artemis Aerogear Integration .............. SKIPPED
[INFO] ActiveMQ Artemis Vert.x Integration ................ SKIPPED
[INFO] Apache ActiveMQ Artemis Distribution ............... SKIPPED
[INFO] ActiveMQ Artemis Tests POM ......................... SKIPPED
[INFO] ActiveMQ Artemis Unit Tests ........................ SKIPPED
[INFO] ActiveMQ Artemis Joram Tests ....................... SKIPPED
[INFO] ActiveMQ Artemis timing Tests ...................... SKIPPED
[INFO] ActiveMQ Artemis JMS Tests ......................... SKIPPED
[INFO] ActiveMQ Artemis Features .......................... SKIPPED
[INFO] ActiveMQ Artemis Test Support ...................... SKIPPED
[INFO] ActiveMQ Artemis Integration Tests ................. SKIPPED
[INFO] ActiveMQ Artemis soak Tests ........................ SKIPPED
[INFO] ActiveMQ Artemis stress Tests ...................... SKIPPED
[INFO] ActiveMQ Artemis performance Tests ................. SKIPPED
[INFO] ActiveMQ Artemis Extra Tests ....................... SKIPPED
[INFO] ------------------------------------------------------------------------
[INFO] BUILD FAILURE
[INFO] ------------------------------------------------------------------------
[INFO] Total time: 32.994 s
[INFO] Finished at: 2016-08-25T18:40:29+00:00
[INFO] Final Memory: 84M/1563M
[INFO] ------------------------------------------------------------------------
[ERROR] Failed to execute goal org.apache.maven.plugins:maven-compiler-plugin:3.1:compile
(default-compile) on project artemis-jms-client: Compilation failure -> [Help 1]
[ERROR] 
[ERROR] To see the full stack trace of the errors, re-run Maven with the -e switch.
[ERROR] Re-run Maven using the -X switch to enable full debug logging.
[ERROR] 
[ERROR] For more information about the errors and possible solutions, please read the following
articles:
[ERROR] [Help 1] http://cwiki.apache.org/confluence/display/MAVEN/MojoFailureException
[ERROR] 
[ERROR] After correcting the problems, you can resume the build with the command
[ERROR]   mvn <goals> -rf :artemis-jms-client
Build step 'Invoke top-level Maven targets' marked build as failure
Performing Post build task...
Could not match :Too many files with unapproved license  : False
Logical operation result is FALSE
Skipping script  : cat ratReport.txt
END OF POST BUILD TASK 	: 0
Recording test results

Mime
View raw message