activemq-commits mailing list archives

Site index · List index
Message view « Date » · « Thread »
Top « Date » · « Thread »
From Apache Jenkins Server <jenk...@builds.apache.org>
Subject Build failed in Jenkins: ActiveMQ-Artemis-Master #551
Date Mon, 25 Jul 2016 10:01:36 GMT
See <https://builds.apache.org/job/ActiveMQ-Artemis-Master/551/changes>

Changes:

[andy.tayls67] ARTEMIS-645 ClusteredGroupingTest fails

------------------------------------------
[...truncated 3033 lines...]
	at java.net.InetSocketAddress.checkPort(InetSocketAddress.java:143) [rt.jar:1.8.0_74]
	at java.net.InetSocketAddress.<init>(InetSocketAddress.java:188) [rt.jar:1.8.0_74]
	at org.apache.activemq.artemis.api.core.UDPBroadcastEndpointFactory$UDPBroadcastEndpoint.openClient(UDPBroadcastEndpointFactory.java:207)
[:]
	at org.apache.activemq.artemis.core.cluster.DiscoveryGroup.start(DiscoveryGroup.java:105)
[:]
	at org.apache.activemq.artemis.core.client.impl.ServerLocatorImpl.initialise(ServerLocatorImpl.java:306)
[:]
	... 43 more

[main] 10:01:16,724 INFO  [org.apache.activemq.artemis.core.server] AMQ221002: Apache ActiveMQ
Artemis Message Broker version 1.4.0-SNAPSHOT [b9f0c745-524e-11e6-b81b-020007a90005] stopped,
uptime 0.550 seconds
[main] 10:01:16,728 INFO  [org.apache.activemq.artemis.core.server] #*#*# Finished test: liveOnlyTest()...
[main] 10:01:16,730 INFO  [org.apache.activemq.artemis.core.server] #*#*# Starting test: ReplicaTest()...
#test ReplicaTest
[main] 10:01:16,773 INFO  [org.apache.activemq.artemis.core.server] AMQ221000: backup Message
Broker is starting with configuration Broker Configuration (clustered=false,journalDirectory=<https://builds.apache.org/job/ActiveMQ-Artemis-Master/ws/artemis-server/./target/tmp/junit2521097672971458879/data/journal,bindingsDirectory=/home/jenkins/jenkins-slave/workspace/ActiveMQ-Artemis-Master/artemis-server/./target/tmp/junit2521097672971458879/data/bindings,largeMessagesDirectory=/home/jenkins/jenkins-slave/workspace/ActiveMQ-Artemis-Master/artemis-server/./target/tmp/junit2521097672971458879/data/largemessages,pagingDirectory=/home/jenkins/jenkins-slave/workspace/ActiveMQ-Artemis-Master/artemis-server/./target/tmp/junit2521097672971458879/data/paging)>
[AMQ119000: Activation for server ActiveMQServerImpl::serverUUID=null] 10:01:16,796 WARN 
[org.apache.activemq.artemis.core.server.impl.ActiveMQServerImpl] null: java.lang.InterruptedException
	at java.util.concurrent.locks.AbstractQueuedSynchronizer.acquireSharedInterruptibly(AbstractQueuedSynchronizer.java:1302)
[rt.jar:1.8.0_74]
	at java.util.concurrent.Semaphore.acquire(Semaphore.java:312) [rt.jar:1.8.0_74]
	at org.apache.activemq.artemis.core.server.impl.ActiveMQServerImpl.lockActivation(ActiveMQServerImpl.java:468)
[:]
	at org.apache.activemq.artemis.core.server.impl.ActiveMQServerImpl$ActivationThread.run(ActiveMQServerImpl.java:2344)
[:]

[AMQ119000: Activation for server ActiveMQServerImpl::serverUUID=null] 10:01:16,803 INFO 
[org.apache.activemq.artemis.core.server] AMQ222162: Moving data directory <https://builds.apache.org/job/ActiveMQ-Artemis-Master/ws/artemis-server/./target/tmp/junit2521097672971458879/data/journal>
to <https://builds.apache.org/job/ActiveMQ-Artemis-Master/ws/artemis-server/./target/tmp/junit2521097672971458879/data/journal/oldreplica.1>
[main] 10:01:16,806 INFO  [org.apache.activemq.artemis.core.server] AMQ221002: Apache ActiveMQ
Artemis Message Broker version 1.4.0-SNAPSHOT [null] stopped, uptime 0.047 seconds
[main] 10:01:16,809 INFO  [org.apache.activemq.artemis.core.server] #*#*# Finished test: ReplicaTest()...
[main] 10:01:16,810 INFO  [org.apache.activemq.artemis.core.server] #*#*# Starting test: ReplicatedTest()...
#test ReplicatedTest
[main] 10:01:16,846 INFO  [org.apache.activemq.artemis.core.server] AMQ221000: live Message
Broker is starting with configuration Broker Configuration (clustered=false,journalDirectory=<https://builds.apache.org/job/ActiveMQ-Artemis-Master/ws/artemis-server/./target/tmp/junit1432872233386267996/data/journal,bindingsDirectory=/home/jenkins/jenkins-slave/workspace/ActiveMQ-Artemis-Master/artemis-server/./target/tmp/junit1432872233386267996/data/bindings,largeMessagesDirectory=/home/jenkins/jenkins-slave/workspace/ActiveMQ-Artemis-Master/artemis-server/./target/tmp/junit1432872233386267996/data/largemessages,pagingDirectory=/home/jenkins/jenkins-slave/workspace/ActiveMQ-Artemis-Master/artemis-server/./target/tmp/junit1432872233386267996/data/paging)>
[main] 10:01:16,848 INFO  [org.apache.activemq.artemis.core.server] AMQ221012: Using AIO Journal
[main] 10:01:16,849 INFO  [org.apache.activemq.artemis.core.server] AMQ221043: Protocol module
found: [artemis-server]. Adding protocol support for: CORE
[main] 10:01:17,211 INFO  [org.apache.activemq.artemis.core.server] AMQ221007: Server is now
live
[main] 10:01:17,211 INFO  [org.apache.activemq.artemis.core.server] AMQ221001: Apache ActiveMQ
Artemis Message Broker version 1.4.0-SNAPSHOT [localhost, nodeID=ba54b939-524e-11e6-b81b-020007a90005]

[main] 10:01:17,250 INFO  [org.apache.activemq.artemis.core.server] AMQ221002: Apache ActiveMQ
Artemis Message Broker version 1.4.0-SNAPSHOT [ba54b939-524e-11e6-b81b-020007a90005] stopped,
uptime 0.416 seconds
[main] 10:01:17,254 INFO  [org.apache.activemq.artemis.core.server] #*#*# Finished test: ReplicatedTest()...
[main] 10:01:17,255 INFO  [org.apache.activemq.artemis.core.server] #*#*# Starting test: colocatedTest2nullbackup()...
#test colocatedTest2nullbackup
[main] 10:01:17,292 INFO  [org.apache.activemq.artemis.core.server] AMQ221000: live Message
Broker is starting with configuration Broker Configuration (clustered=false,journalDirectory=<https://builds.apache.org/job/ActiveMQ-Artemis-Master/ws/artemis-server/./target/tmp/junit7848229183149605281/data/journal,bindingsDirectory=/home/jenkins/jenkins-slave/workspace/ActiveMQ-Artemis-Master/artemis-server/./target/tmp/junit7848229183149605281/data/bindings,largeMessagesDirectory=/home/jenkins/jenkins-slave/workspace/ActiveMQ-Artemis-Master/artemis-server/./target/tmp/junit7848229183149605281/data/largemessages,pagingDirectory=/home/jenkins/jenkins-slave/workspace/ActiveMQ-Artemis-Master/artemis-server/./target/tmp/junit7848229183149605281/data/paging)>
[main] 10:01:17,292 INFO  [org.apache.activemq.artemis.core.server] AMQ221006: Waiting to
obtain live lock
[main] 10:01:17,293 INFO  [org.apache.activemq.artemis.core.server] AMQ221012: Using AIO Journal
[main] 10:01:17,294 INFO  [org.apache.activemq.artemis.core.server] AMQ221043: Protocol module
found: [artemis-server]. Adding protocol support for: CORE
[main] 10:01:17,320 INFO  [org.apache.activemq.artemis.core.server] AMQ221034: Waiting indefinitely
to obtain live lock
[main] 10:01:17,321 INFO  [org.apache.activemq.artemis.core.server] AMQ221035: Live Server
Obtained live lock
[main] 10:01:17,638 INFO  [org.apache.activemq.artemis.core.server] AMQ221007: Server is now
live
[main] 10:01:17,639 INFO  [org.apache.activemq.artemis.core.server] AMQ221001: Apache ActiveMQ
Artemis Message Broker version 1.4.0-SNAPSHOT [localhost, nodeID=ba98a00a-524e-11e6-b81b-020007a90005]

[main] 10:01:17,670 INFO  [org.apache.activemq.artemis.core.server] AMQ221002: Apache ActiveMQ
Artemis Message Broker version 1.4.0-SNAPSHOT [ba98a00a-524e-11e6-b81b-020007a90005] stopped,
uptime 0.392 seconds
[main] 10:01:17,675 INFO  [org.apache.activemq.artemis.core.server] #*#*# Finished test: colocatedTest2nullbackup()...
[main] 10:01:17,677 INFO  [org.apache.activemq.artemis.core.server] #*#*# Starting test: SharedStoreSlaveTest()...
#test SharedStoreSlaveTest
[main] 10:01:17,726 INFO  [org.apache.activemq.artemis.core.server] AMQ221000: backup Message
Broker is starting with configuration Broker Configuration (clustered=false,journalDirectory=<https://builds.apache.org/job/ActiveMQ-Artemis-Master/ws/artemis-server/./target/tmp/junit2612796169758452730/data/journal,bindingsDirectory=/home/jenkins/jenkins-slave/workspace/ActiveMQ-Artemis-Master/artemis-server/./target/tmp/junit2612796169758452730/data/bindings,largeMessagesDirectory=/home/jenkins/jenkins-slave/workspace/ActiveMQ-Artemis-Master/artemis-server/./target/tmp/junit2612796169758452730/data/largemessages,pagingDirectory=/home/jenkins/jenkins-slave/workspace/ActiveMQ-Artemis-Master/artemis-server/./target/tmp/junit2612796169758452730/data/paging)>
[AMQ119000: Activation for server ActiveMQServerImpl::serverUUID=badad92c-524e-11e6-b81b-020007a90005]
10:01:17,728 WARN  [org.apache.activemq.artemis.core.server.impl.ActiveMQServerImpl] null:
java.lang.InterruptedException
	at java.util.concurrent.locks.AbstractQueuedSynchronizer.acquireSharedInterruptibly(AbstractQueuedSynchronizer.java:1302)
[rt.jar:1.8.0_74]
	at java.util.concurrent.Semaphore.acquire(Semaphore.java:312) [rt.jar:1.8.0_74]
	at org.apache.activemq.artemis.core.server.impl.ActiveMQServerImpl.lockActivation(ActiveMQServerImpl.java:468)
[:]
	at org.apache.activemq.artemis.core.server.impl.ActiveMQServerImpl$ActivationThread.run(ActiveMQServerImpl.java:2344)
[:]

[AMQ119000: Activation for server ActiveMQServerImpl::serverUUID=badad92c-524e-11e6-b81b-020007a90005]
10:01:17,729 INFO  [org.apache.activemq.artemis.core.server] AMQ221032: Waiting to become
backup node
[AMQ119000: Activation for server ActiveMQServerImpl::serverUUID=badad92c-524e-11e6-b81b-020007a90005]
10:01:17,729 INFO  [org.apache.activemq.artemis.core.server] AMQ221033: ** got backup lock
[main] 10:01:17,733 INFO  [org.apache.activemq.artemis.core.server] AMQ221002: Apache ActiveMQ
Artemis Message Broker version 1.4.0-SNAPSHOT [badad92c-524e-11e6-b81b-020007a90005] stopped,
uptime 0.021 seconds
[main] 10:01:17,736 INFO  [org.apache.activemq.artemis.core.server] #*#*# Finished test: SharedStoreSlaveTest()...
[main] 10:01:17,737 INFO  [org.apache.activemq.artemis.core.server] #*#*# Starting test: liveOnlyTest2()...
#test liveOnlyTest2
[main] 10:01:17,777 INFO  [org.apache.activemq.artemis.core.server] AMQ221000: live Message
Broker is starting with configuration Broker Configuration (clustered=false,journalDirectory=<https://builds.apache.org/job/ActiveMQ-Artemis-Master/ws/artemis-server/./target/tmp/junit1779331057259904067/data/journal,bindingsDirectory=/home/jenkins/jenkins-slave/workspace/ActiveMQ-Artemis-Master/artemis-server/./target/tmp/junit1779331057259904067/data/bindings,largeMessagesDirectory=/home/jenkins/jenkins-slave/workspace/ActiveMQ-Artemis-Master/artemis-server/./target/tmp/junit1779331057259904067/data/largemessages,pagingDirectory=/home/jenkins/jenkins-slave/workspace/ActiveMQ-Artemis-Master/artemis-server/./target/tmp/junit1779331057259904067/data/paging)>
[main] 10:01:17,778 INFO  [org.apache.activemq.artemis.core.server] AMQ221012: Using AIO Journal
[main] 10:01:17,780 INFO  [org.apache.activemq.artemis.core.server] AMQ221043: Protocol module
found: [artemis-server]. Adding protocol support for: CORE
[main] 10:01:18,123 INFO  [org.apache.activemq.artemis.core.server] AMQ221007: Server is now
live
[main] 10:01:18,124 INFO  [org.apache.activemq.artemis.core.server] AMQ221001: Apache ActiveMQ
Artemis Message Broker version 1.4.0-SNAPSHOT [localhost, nodeID=bae27a4d-524e-11e6-b81b-020007a90005]

[main] 10:01:18,159 INFO  [org.apache.activemq.artemis.core.server] AMQ221002: Apache ActiveMQ
Artemis Message Broker version 1.4.0-SNAPSHOT [bae27a4d-524e-11e6-b81b-020007a90005] stopped,
uptime 0.395 seconds
[main] 10:01:18,165 INFO  [org.apache.activemq.artemis.core.server] #*#*# Finished test: liveOnlyTest2()...
[main] 10:01:18,167 INFO  [org.apache.activemq.artemis.core.server] #*#*# Starting test: liveOnlyTest3()...
#test liveOnlyTest3
[main] 10:01:18,235 INFO  [org.apache.activemq.artemis.core.server] AMQ221000: live Message
Broker is starting with configuration Broker Configuration (clustered=false,journalDirectory=<https://builds.apache.org/job/ActiveMQ-Artemis-Master/ws/artemis-server/./target/tmp/junit1297290820517624945/data/journal,bindingsDirectory=/home/jenkins/jenkins-slave/workspace/ActiveMQ-Artemis-Master/artemis-server/./target/tmp/junit1297290820517624945/data/bindings,largeMessagesDirectory=/home/jenkins/jenkins-slave/workspace/ActiveMQ-Artemis-Master/artemis-server/./target/tmp/junit1297290820517624945/data/largemessages,pagingDirectory=/home/jenkins/jenkins-slave/workspace/ActiveMQ-Artemis-Master/artemis-server/./target/tmp/junit1297290820517624945/data/paging)>
[main] 10:01:18,236 INFO  [org.apache.activemq.artemis.core.server] AMQ221012: Using AIO Journal
[main] 10:01:18,237 INFO  [org.apache.activemq.artemis.core.server] AMQ221043: Protocol module
found: [artemis-server]. Adding protocol support for: CORE
[main] 10:01:18,582 INFO  [org.apache.activemq.artemis.core.server] AMQ221007: Server is now
live
[main] 10:01:18,583 INFO  [org.apache.activemq.artemis.core.server] AMQ221001: Apache ActiveMQ
Artemis Message Broker version 1.4.0-SNAPSHOT [localhost, nodeID=bb2883fe-524e-11e6-b81b-020007a90005]

[main] 10:01:18,638 INFO  [org.apache.activemq.artemis.core.server] AMQ221002: Apache ActiveMQ
Artemis Message Broker version 1.4.0-SNAPSHOT [bb2883fe-524e-11e6-b81b-020007a90005] stopped,
uptime 0.417 seconds
[main] 10:01:18,642 INFO  [org.apache.activemq.artemis.core.server] #*#*# Finished test: liveOnlyTest3()...
[main] 10:01:18,644 INFO  [org.apache.activemq.artemis.core.server] #*#*# Starting test: liveOnlyTest4()...
#test liveOnlyTest4
[main] 10:01:18,682 INFO  [org.apache.activemq.artemis.core.server] AMQ221000: live Message
Broker is starting with configuration Broker Configuration (clustered=false,journalDirectory=<https://builds.apache.org/job/ActiveMQ-Artemis-Master/ws/artemis-server/./target/tmp/junit4408525596551747781/data/journal,bindingsDirectory=/home/jenkins/jenkins-slave/workspace/ActiveMQ-Artemis-Master/artemis-server/./target/tmp/junit4408525596551747781/data/bindings,largeMessagesDirectory=/home/jenkins/jenkins-slave/workspace/ActiveMQ-Artemis-Master/artemis-server/./target/tmp/junit4408525596551747781/data/largemessages,pagingDirectory=/home/jenkins/jenkins-slave/workspace/ActiveMQ-Artemis-Master/artemis-server/./target/tmp/junit4408525596551747781/data/paging)>
[main] 10:01:18,683 INFO  [org.apache.activemq.artemis.core.server] AMQ221012: Using AIO Journal
[main] 10:01:18,687 INFO  [org.apache.activemq.artemis.core.server] AMQ221043: Protocol module
found: [artemis-server]. Adding protocol support for: CORE
[Finalizer] 10:01:18,809 WARN  [org.apache.activemq.artemis.core.server] AMQ222000: ActiveMQServer
is being finalized and has not been stopped. Please remember to stop the server before letting
it go out of scope
[Finalizer] 10:01:18,811 INFO  [org.apache.activemq.artemis.core.server] AMQ221002: Apache
ActiveMQ Artemis Message Broker version 1.4.0-SNAPSHOT [null] stopped, uptime 2.051 seconds
[main] 10:01:19,109 INFO  [org.apache.activemq.artemis.core.server] AMQ221007: Server is now
live
[main] 10:01:19,109 INFO  [org.apache.activemq.artemis.core.server] AMQ221001: Apache ActiveMQ
Artemis Message Broker version 1.4.0-SNAPSHOT [localhost, nodeID=bb6cdfff-524e-11e6-b81b-020007a90005]

[main] 10:01:19,133 INFO  [org.apache.activemq.artemis.core.server] AMQ221002: Apache ActiveMQ
Artemis Message Broker version 1.4.0-SNAPSHOT [bb6cdfff-524e-11e6-b81b-020007a90005] stopped,
uptime 0.465 seconds
[main] 10:01:19,137 INFO  [org.apache.activemq.artemis.core.server] #*#*# Finished test: liveOnlyTest4()...
[main] 10:01:19,143 INFO  [org.apache.activemq.artemis.core.server] #*#*# Starting test: liveOnlyTest5()...
#test liveOnlyTest5
[main] 10:01:19,182 INFO  [org.apache.activemq.artemis.core.server] AMQ221000: live Message
Broker is starting with configuration Broker Configuration (clustered=false,journalDirectory=<https://builds.apache.org/job/ActiveMQ-Artemis-Master/ws/artemis-server/./target/tmp/junit3855130462412040533/data/journal,bindingsDirectory=/home/jenkins/jenkins-slave/workspace/ActiveMQ-Artemis-Master/artemis-server/./target/tmp/junit3855130462412040533/data/bindings,largeMessagesDirectory=/home/jenkins/jenkins-slave/workspace/ActiveMQ-Artemis-Master/artemis-server/./target/tmp/junit3855130462412040533/data/largemessages,pagingDirectory=/home/jenkins/jenkins-slave/workspace/ActiveMQ-Artemis-Master/artemis-server/./target/tmp/junit3855130462412040533/data/paging)>
[main] 10:01:19,183 INFO  [org.apache.activemq.artemis.core.server] AMQ221012: Using AIO Journal
[main] 10:01:19,184 INFO  [org.apache.activemq.artemis.core.server] AMQ221043: Protocol module
found: [artemis-server]. Adding protocol support for: CORE
[main] 10:01:19,519 INFO  [org.apache.activemq.artemis.core.server] AMQ221007: Server is now
live
[main] 10:01:19,519 INFO  [org.apache.activemq.artemis.core.server] AMQ221001: Apache ActiveMQ
Artemis Message Broker version 1.4.0-SNAPSHOT [localhost, nodeID=bbb90430-524e-11e6-b81b-020007a90005]

[main] 10:01:19,555 INFO  [org.apache.activemq.artemis.core.server] AMQ221002: Apache ActiveMQ
Artemis Message Broker version 1.4.0-SNAPSHOT [bbb90430-524e-11e6-b81b-020007a90005] stopped,
uptime 0.381 seconds
[main] 10:01:19,560 INFO  [org.apache.activemq.artemis.core.server] #*#*# Finished test: liveOnlyTest5()...
[main] 10:01:19,562 INFO  [org.apache.activemq.artemis.core.server] #*#*# Starting test: ReplicaTest2()...
#test ReplicaTest2
[main] 10:01:19,597 INFO  [org.apache.activemq.artemis.core.server] AMQ221000: backup Message
Broker is starting with configuration Broker Configuration (clustered=false,journalDirectory=<https://builds.apache.org/job/ActiveMQ-Artemis-Master/ws/artemis-server/./target/tmp/junit8856270060520085771/data/journal,bindingsDirectory=/home/jenkins/jenkins-slave/workspace/ActiveMQ-Artemis-Master/artemis-server/./target/tmp/junit8856270060520085771/data/bindings,largeMessagesDirectory=/home/jenkins/jenkins-slave/workspace/ActiveMQ-Artemis-Master/artemis-server/./target/tmp/junit8856270060520085771/data/largemessages,pagingDirectory=/home/jenkins/jenkins-slave/workspace/ActiveMQ-Artemis-Master/artemis-server/./target/tmp/junit8856270060520085771/data/paging)>
[AMQ119000: Activation for server ActiveMQServerImpl::serverUUID=null] 10:01:19,599 WARN 
[org.apache.activemq.artemis.core.server.impl.ActiveMQServerImpl] null: java.lang.InterruptedException
	at java.util.concurrent.locks.AbstractQueuedSynchronizer.acquireSharedInterruptibly(AbstractQueuedSynchronizer.java:1302)
[rt.jar:1.8.0_74]
	at java.util.concurrent.Semaphore.acquire(Semaphore.java:312) [rt.jar:1.8.0_74]
	at org.apache.activemq.artemis.core.server.impl.ActiveMQServerImpl.lockActivation(ActiveMQServerImpl.java:468)
[:]
	at org.apache.activemq.artemis.core.server.impl.ActiveMQServerImpl$ActivationThread.run(ActiveMQServerImpl.java:2344)
[:]

[AMQ119000: Activation for server ActiveMQServerImpl::serverUUID=null] 10:01:19,601 INFO 
[org.apache.activemq.artemis.core.server] AMQ222162: Moving data directory <https://builds.apache.org/job/ActiveMQ-Artemis-Master/ws/artemis-server/./target/tmp/junit8856270060520085771/data/journal>
to <https://builds.apache.org/job/ActiveMQ-Artemis-Master/ws/artemis-server/./target/tmp/junit8856270060520085771/data/journal/oldreplica.1>
[main] 10:01:19,604 INFO  [org.apache.activemq.artemis.core.server] AMQ221002: Apache ActiveMQ
Artemis Message Broker version 1.4.0-SNAPSHOT [null] stopped, uptime 0.020 seconds
[main] 10:01:19,606 INFO  [org.apache.activemq.artemis.core.server] #*#*# Finished test: ReplicaTest2()...
[main] 10:01:19,608 INFO  [org.apache.activemq.artemis.core.server] #*#*# Starting test: ReplicaTest3()...
#test ReplicaTest3
[main] 10:01:19,640 INFO  [org.apache.activemq.artemis.core.server] AMQ221000: backup Message
Broker is starting with configuration Broker Configuration (clustered=false,journalDirectory=<https://builds.apache.org/job/ActiveMQ-Artemis-Master/ws/artemis-server/./target/tmp/junit4540661159298647729/data/journal,bindingsDirectory=/home/jenkins/jenkins-slave/workspace/ActiveMQ-Artemis-Master/artemis-server/./target/tmp/junit4540661159298647729/data/bindings,largeMessagesDirectory=/home/jenkins/jenkins-slave/workspace/ActiveMQ-Artemis-Master/artemis-server/./target/tmp/junit4540661159298647729/data/largemessages,pagingDirectory=/home/jenkins/jenkins-slave/workspace/ActiveMQ-Artemis-Master/artemis-server/./target/tmp/junit4540661159298647729/data/paging)>
[AMQ119000: Activation for server ActiveMQServerImpl::serverUUID=null] 10:01:19,646 INFO 
[org.apache.activemq.artemis.core.server] AMQ222162: Moving data directory <https://builds.apache.org/job/ActiveMQ-Artemis-Master/ws/artemis-server/./target/tmp/junit4540661159298647729/data/journal>
to <https://builds.apache.org/job/ActiveMQ-Artemis-Master/ws/artemis-server/./target/tmp/junit4540661159298647729/data/journal/oldreplica.1>
[main] 10:01:19,648 INFO  [org.apache.activemq.artemis.core.server] AMQ221002: Apache ActiveMQ
Artemis Message Broker version 1.4.0-SNAPSHOT [null] stopped, uptime 0.023 seconds
[main] 10:01:19,650 INFO  [org.apache.activemq.artemis.core.server] #*#*# Finished test: ReplicaTest3()...
[main] 10:01:19,651 INFO  [org.apache.activemq.artemis.core.server] #*#*# Starting test: colocatedTestNullBackup()...
#test colocatedTestNullBackup
[main] 10:01:19,682 INFO  [org.apache.activemq.artemis.core.server] AMQ221000: live Message
Broker is starting with configuration Broker Configuration (clustered=false,journalDirectory=<https://builds.apache.org/job/ActiveMQ-Artemis-Master/ws/artemis-server/./target/tmp/junit4430749189136168894/data/journal,bindingsDirectory=/home/jenkins/jenkins-slave/workspace/ActiveMQ-Artemis-Master/artemis-server/./target/tmp/junit4430749189136168894/data/bindings,largeMessagesDirectory=/home/jenkins/jenkins-slave/workspace/ActiveMQ-Artemis-Master/artemis-server/./target/tmp/junit4430749189136168894/data/largemessages,pagingDirectory=/home/jenkins/jenkins-slave/workspace/ActiveMQ-Artemis-Master/artemis-server/./target/tmp/junit4430749189136168894/data/paging)>
[main] 10:01:19,683 INFO  [org.apache.activemq.artemis.core.server] AMQ221012: Using AIO Journal
[main] 10:01:19,684 INFO  [org.apache.activemq.artemis.core.server] AMQ221043: Protocol module
found: [artemis-server]. Adding protocol support for: CORE
[main] 10:01:20,002 INFO  [org.apache.activemq.artemis.core.server] AMQ221007: Server is now
live
[main] 10:01:20,003 INFO  [org.apache.activemq.artemis.core.server] AMQ221001: Apache ActiveMQ
Artemis Message Broker version 1.4.0-SNAPSHOT [localhost, nodeID=bc054f74-524e-11e6-b81b-020007a90005]

[main] 10:01:20,038 INFO  [org.apache.activemq.artemis.core.server] AMQ221002: Apache ActiveMQ
Artemis Message Broker version 1.4.0-SNAPSHOT [bc054f74-524e-11e6-b81b-020007a90005] stopped,
uptime 0.369 seconds
[main] 10:01:20,044 INFO  [org.apache.activemq.artemis.core.server] #*#*# Finished test: colocatedTestNullBackup()...
Tests run: 17, Failures: 0, Errors: 0, Skipped: 0, Time elapsed: 5.468 sec - in org.apache.activemq.artemis.core.config.impl.HAPolicyConfigurationTest
Running org.apache.activemq.artemis.core.config.impl.ValidatorsTest
Tests run: 8, Failures: 0, Errors: 0, Skipped: 0, Time elapsed: 0.013 sec - in org.apache.activemq.artemis.core.config.impl.ValidatorsTest
Running org.apache.activemq.artemis.core.config.impl.WrongRoleFileConfigurationParserTest
[main] 10:01:20,068 INFO  [org.apache.activemq.artemis.core.server] #*#*# Starting test: testParsingDefaultServerConfig()...
#test testParsingDefaultServerConfig
[main] 10:01:20,075 WARN  [org.apache.activemq.artemis.core.server] AMQ222177: Wrong configuration
for role, create-durable-queue is not a valid permission
[main] 10:01:20,075 WARN  [org.apache.activemq.artemis.core.server] AMQ222177: Wrong configuration
for role, delete-durable-queue is not a valid permission
[main] 10:01:20,079 INFO  [org.apache.activemq.artemis.core.server] #*#*# Finished test: testParsingDefaultServerConfig()...
Tests run: 1, Failures: 0, Errors: 0, Skipped: 0, Time elapsed: 0.015 sec - in org.apache.activemq.artemis.core.config.impl.WrongRoleFileConfigurationParserTest
Running org.apache.activemq.artemis.core.filter.impl.FilterTest
[Finalizer] 10:01:20,344 WARN  [org.apache.activemq.artemis.core.server] AMQ222000: ActiveMQServer
is being finalized and has not been stopped. Please remember to stop the server before letting
it go out of scope
[Finalizer] 10:01:20,345 INFO  [org.apache.activemq.artemis.core.server] AMQ221002: Apache
ActiveMQ Artemis Message Broker version 1.4.0-SNAPSHOT [null] stopped, uptime 0.720 seconds
[Finalizer] 10:01:20,345 WARN  [org.apache.activemq.artemis.core.server] AMQ222000: ActiveMQServer
is being finalized and has not been stopped. Please remember to stop the server before letting
it go out of scope
[Finalizer] 10:01:20,346 INFO  [org.apache.activemq.artemis.core.server] AMQ221002: Apache
ActiveMQ Artemis Message Broker version 1.4.0-SNAPSHOT [null] stopped, uptime 0.762 seconds
[main] 10:01:20,388 ERROR [org.apache.activemq.artemis.core.server] AMQ224006: Invalid filter:
color = 'red
[main] 10:01:20,389 ERROR [org.apache.activemq.artemis.core.server] AMQ224006: Invalid filter:
color = 'red
[main] 10:01:20,391 ERROR [org.apache.activemq.artemis.core.server] AMQ224006: Invalid filter:
3
[main] 10:01:20,391 ERROR [org.apache.activemq.artemis.core.server] AMQ224006: Invalid filter:
3
Tests run: 21, Failures: 0, Errors: 0, Skipped: 0, Time elapsed: 0.34 sec - in org.apache.activemq.artemis.core.filter.impl.FilterTest
Running org.apache.activemq.artemis.core.list.PriorityLinkedListTest
Tests run: 11, Failures: 0, Errors: 0, Skipped: 0, Time elapsed: 0.023 sec - in org.apache.activemq.artemis.core.list.PriorityLinkedListTest
Running org.apache.activemq.artemis.core.message.impl.MessagePropertyTest
[main] 10:01:20,449 INFO  [org.apache.activemq.artemis.core.server] #*#*# Starting test: testProperties()...
#test testProperties
[main] 10:01:20,484 INFO  [org.apache.activemq.artemis.core.server] AMQ221000: live Message
Broker is starting with configuration Broker Configuration (clustered=false,journalDirectory=<https://builds.apache.org/job/ActiveMQ-Artemis-Master/ws/artemis-server/./target/tmp/junit6977349060464167854/journal0-L,bindingsDirectory=/home/jenkins/jenkins-slave/workspace/ActiveMQ-Artemis-Master/artemis-server/./target/tmp/junit6977349060464167854/bindings0-L,largeMessagesDirectory=/home/jenkins/jenkins-slave/workspace/ActiveMQ-Artemis-Master/artemis-server/./target/tmp/junit6977349060464167854/large-msg0-L,pagingDirectory=/home/jenkins/jenkins-slave/workspace/ActiveMQ-Artemis-Master/artemis-server/./target/tmp/junit6977349060464167854/page0-L)>
[main] 10:01:20,485 INFO  [org.apache.activemq.artemis.core.server] AMQ221012: Using AIO Journal
[main] 10:01:20,489 INFO  [org.apache.activemq.artemis.core.server] AMQ221043: Protocol module
found: [artemis-server]. Adding protocol support for: CORE
[main] 10:01:20,598 INFO  [org.apache.activemq.artemis.core.server] AMQ221007: Server is now
live
[main] 10:01:20,598 INFO  [org.apache.activemq.artemis.core.server] AMQ221001: Apache ActiveMQ
Artemis Message Broker version 1.4.0-SNAPSHOT [localhost, nodeID=bc7fd6a6-524e-11e6-b81b-020007a90005]

[main] 10:01:21,271 INFO  [org.apache.activemq.artemis.core.server] AMQ221002: Apache ActiveMQ
Artemis Message Broker version 1.4.0-SNAPSHOT [bc7fd6a6-524e-11e6-b81b-020007a90005] stopped,
uptime 0.805 seconds
[main] 10:01:21,276 INFO  [org.apache.activemq.artemis.core.server] #*#*# Finished test: testProperties()...
Tests run: 1, Failures: 0, Errors: 0, Skipped: 0, Time elapsed: 0.828 sec - in org.apache.activemq.artemis.core.message.impl.MessagePropertyTest
Running org.apache.activemq.artemis.core.security.RoleTest
Tests run: 5, Failures: 0, Errors: 0, Skipped: 0, Time elapsed: 0.008 sec - in org.apache.activemq.artemis.core.security.RoleTest
Running org.apache.activemq.artemis.core.security.jaas.CertificateLoginModuleTest
Tests run: 3, Failures: 0, Errors: 0, Skipped: 0, Time elapsed: 0.018 sec - in org.apache.activemq.artemis.core.security.jaas.CertificateLoginModuleTest
Running org.apache.activemq.artemis.core.security.jaas.GuestLoginModuleTest
Tests run: 2, Failures: 0, Errors: 0, Skipped: 0, Time elapsed: 0.023 sec - in org.apache.activemq.artemis.core.security.jaas.GuestLoginModuleTest
Running org.apache.activemq.artemis.core.security.jaas.LDAPLoginModuleTest
Using partition factory JdbmPartitionFactory
[main] 10:01:26,473 ERROR [org.apache.activemq.artemis.core.server] javax.naming.NamingException:
Empty password is not allowed
Tests run: 3, Failures: 0, Errors: 0, Skipped: 0, Time elapsed: 5.982 sec - in org.apache.activemq.artemis.core.security.jaas.LDAPLoginModuleTest
Running org.apache.activemq.artemis.core.security.jaas.LDAPModuleRoleExpansionTest
Using partition factory JdbmPartitionFactory
SUREFIRE-859: Java HotSpot(TM) 64-Bit Server VM warning: INFO: os::commit_memory(0x000000078a300000,
360185856, 0) failed; error='Cannot allocate memory' (errno=12)
#
# There is insufficient memory for the Java Runtime Environment to continue.
# Native memory allocation (mmap) failed to map 360185856 bytes for committing reserved memory.
# An error report file with more information is saved as:
# <https://builds.apache.org/job/ActiveMQ-Artemis-Master/ws/artemis-server/hs_err_pid25410.log>

Results :

Tests run: 97, Failures: 0, Errors: 0, Skipped: 0

[INFO] ------------------------------------------------------------------------
[INFO] Reactor Summary:
[INFO] 
[INFO] ActiveMQ Artemis Parent ............................ SUCCESS [ 10.563 s]
[INFO] ActiveMQ Artemis Commons ........................... SUCCESS [ 11.905 s]
[INFO] ActiveMQ Artemis Core Client ....................... SUCCESS [ 14.156 s]
[INFO] ActiveMQ Artemis Selector Implementation ........... SUCCESS [  8.515 s]
[INFO] ActiveMQ Artemis JMS Client ........................ SUCCESS [  5.551 s]
[INFO] ActiveMQ Artemis Native POM ........................ SUCCESS [  5.955 s]
[INFO] ActiveMQ Artemis Journal ........................... SUCCESS [  6.564 s]
[INFO] ActiveMQ Artemis JDBC Store ........................ SUCCESS [  9.104 s]
[INFO] ActiveMQ Artemis Server ............................ FAILURE [ 37.318 s]
[INFO] ActiveMQ Artemis Protocols ......................... SKIPPED
[INFO] ActiveMQ Artemis Proton Protocol ................... SKIPPED
[INFO] ActiveMQ Artemis AMQP Protocol ..................... SKIPPED
[INFO] ActiveMQ Artemis STOMP Protocol .................... SKIPPED
[INFO] ActiveMQ Artemis OpenWire Protocol ................. SKIPPED
[INFO] ActiveMQ Artemis HQClient Protocol ................. SKIPPED
[INFO] ActiveMQ Artemis HornetQ Protocol .................. SKIPPED
[INFO] ActiveMQ Artemis MQTT Protocol ..................... SKIPPED
[INFO] ActiveMQ Artemis DTO ............................... SKIPPED
[INFO] ActiveMQ Artemis Boot .............................. SKIPPED
[INFO] ActiveMQ Artemis Service Extensions ................ SKIPPED
[INFO] ActiveMQ Artemis JMS Server ........................ SKIPPED
[INFO] ActiveMQ Artemis CLI ............................... SKIPPED
[INFO] ActiveMQ Artemis Web ............................... SKIPPED
[INFO] ActiveMQ Artemis Web ............................... SKIPPED
[INFO] ActiveMQ Artemis RAR POM ........................... SKIPPED
[INFO] ActiveMQ Artemis REST Interface Implementation ..... SKIPPED
[INFO] ActiveMQ Artemis Maven Plugin ...................... SKIPPED
[INFO] ActiveMQ Artemis Server OSGi ....................... SKIPPED
[INFO] ActiveMQ Artemis Spring Integration ................ SKIPPED
[INFO] ActiveMQ Artemis Aerogear Integration .............. SKIPPED
[INFO] ActiveMQ Artemis Vert.x Integration ................ SKIPPED
[INFO] Apache ActiveMQ Artemis Distribution ............... SKIPPED
[INFO] ActiveMQ Artemis Tests POM ......................... SKIPPED
[INFO] ActiveMQ Artemis Unit Tests ........................ SKIPPED
[INFO] ActiveMQ Artemis Joram Tests ....................... SKIPPED
[INFO] ActiveMQ Artemis timing Tests ...................... SKIPPED
[INFO] ActiveMQ Artemis JMS Tests ......................... SKIPPED
[INFO] ActiveMQ Artemis Features .......................... SKIPPED
[INFO] ActiveMQ Artemis Test Support ...................... SKIPPED
[INFO] ActiveMQ Artemis Integration Tests ................. SKIPPED
[INFO] ActiveMQ Artemis soak Tests ........................ SKIPPED
[INFO] ActiveMQ Artemis stress Tests ...................... SKIPPED
[INFO] ActiveMQ Artemis performance Tests ................. SKIPPED
[INFO] ActiveMQ Artemis Extra Tests ....................... SKIPPED
[INFO] ------------------------------------------------------------------------
[INFO] BUILD FAILURE
[INFO] ------------------------------------------------------------------------
[INFO] Total time: 01:53 min
[INFO] Finished at: 2016-07-25T10:01:29+00:00
[INFO] Final Memory: 100M/1557M
[INFO] ------------------------------------------------------------------------
[ERROR] Failed to execute goal org.apache.maven.plugins:maven-surefire-plugin:2.18.1:test
(default-test) on project artemis-server: Execution default-test of goal org.apache.maven.plugins:maven-surefire-plugin:2.18.1:test
failed: The forked VM terminated without properly saying goodbye. VM crash or System.exit
called?
[ERROR] Command was /bin/sh -c cd <https://builds.apache.org/job/ActiveMQ-Artemis-Master/ws/artemis-server>
&& /home/jenkins/jenkins-slave/tools/hudson.model.JDK/latest1.8/jre/bin/java -Djava.util.logging.manager=org.jboss.logmanager.LogManager
-Dlogging.configuration=<https://builds.apache.org/job/ActiveMQ-Artemis-Master/ws/artemis-server/../tests/config/logging.properties>
-Djava.library.path=<https://builds.apache.org/job/ActiveMQ-Artemis-Master/ws/artemis-server/../artemis-native/bin>
-Djgroups.bind_addr=localhost -Dorg.apache.activemq.artemis.api.core.UDPBroadcastEndpointFactory.localBindAddress=localhost
-Djava.net.preferIPv4Stack=true -jar <https://builds.apache.org/job/ActiveMQ-Artemis-Master/ws/artemis-server/target/surefire/surefirebooter7496382929047067296.jar>
<https://builds.apache.org/job/ActiveMQ-Artemis-Master/ws/artemis-server/target/surefire/surefire8597784891929345729tmp>
<https://builds.apache.org/job/ActiveMQ-Artemis-Master/ws/artemis-server/target/surefire/surefire_74056717065931128751tmp>
[ERROR] -> [Help 1]
[ERROR] 
[ERROR] To see the full stack trace of the errors, re-run Maven with the -e switch.
[ERROR] Re-run Maven using the -X switch to enable full debug logging.
[ERROR] 
[ERROR] For more information about the errors and possible solutions, please read the following
articles:
[ERROR] [Help 1] http://cwiki.apache.org/confluence/display/MAVEN/PluginExecutionException
[ERROR] 
[ERROR] After correcting the problems, you can resume the build with the command
[ERROR]   mvn <goals> -rf :artemis-server
Build step 'Invoke top-level Maven targets' marked build as failure
Performing Post build task...
Could not match :Too many files with unapproved license  : False
Logical operation result is FALSE
Skipping script  : cat ratReport.txt
END OF POST BUILD TASK 	: 0
Recording test results

Mime
View raw message