activemq-commits mailing list archives

Site index · List index
Message view « Date » · « Thread »
Top « Date » · « Thread »
From Apache Jenkins Server <jenk...@builds.apache.org>
Subject Build failed in Jenkins: ActiveMQ-Java8 #775
Date Tue, 26 Jul 2016 20:53:26 GMT
See <https://builds.apache.org/job/ActiveMQ-Java8/775/changes>

Changes:

[christopher.l.shannon] https://issues.apache.org/jira/browse/AMQ-6375

------------------------------------------
[...truncated 1857 lines...]
[WARNING] Bundle org.apache.activemq:activemq-blueprint:bundle:5.14.0-SNAPSHOT : Superfluous
export-package instructions: [org.apache.activemq**]
[INFO] 
[INFO] --- maven-site-plugin:3.4:attach-descriptor (attach-descriptor) @ activemq-blueprint
---
[INFO] 
[INFO] --- ianal-maven-plugin:1.0-alpha-1:verify-legal-files (default) @ activemq-blueprint
---
[INFO] Checking legal files in: activemq-blueprint-5.14.0-SNAPSHOT.jar
[INFO] 
[INFO] --- maven-install-plugin:2.5.2:install (default-install) @ activemq-blueprint ---
[INFO] Installing <https://builds.apache.org/job/ActiveMQ-Java8/ws/activemq-blueprint/target/activemq-blueprint-5.14.0-SNAPSHOT.jar>
to /home/jenkins/jenkins-slave/maven-repositories/0/org/apache/activemq/activemq-blueprint/5.14.0-SNAPSHOT/activemq-blueprint-5.14.0-SNAPSHOT.jar
[INFO] Installing <https://builds.apache.org/job/ActiveMQ-Java8/ws/activemq-blueprint/pom.xml>
to /home/jenkins/jenkins-slave/maven-repositories/0/org/apache/activemq/activemq-blueprint/5.14.0-SNAPSHOT/activemq-blueprint-5.14.0-SNAPSHOT.pom
[INFO] 
[INFO] --- maven-bundle-plugin:2.3.7:install (default-install) @ activemq-blueprint ---
[INFO] Installing org/apache/activemq/activemq-blueprint/5.14.0-SNAPSHOT/activemq-blueprint-5.14.0-SNAPSHOT.jar
[INFO] Writing OBR metadata
[INFO] 
[INFO] >>> maven-source-plugin:2.4:jar (default-cli) > generate-sources @ activemq-blueprint
>>>
[INFO] 
[INFO] --- maven-enforcer-plugin:1.3.1:enforce (default) @ activemq-blueprint ---
[INFO] 
[INFO] --- maven-bundle-plugin:2.3.7:cleanVersions (cleanVersions) @ activemq-blueprint ---
[WARNING] Failed to getClass for org.apache.maven.plugin.source.SourceJarMojo
[INFO] 
[INFO] <<< maven-source-plugin:2.4:jar (default-cli) < generate-sources @ activemq-blueprint
<<<
[INFO] 
[INFO] --- maven-source-plugin:2.4:jar (default-cli) @ activemq-blueprint ---
[INFO] Building jar: <https://builds.apache.org/job/ActiveMQ-Java8/ws/activemq-blueprint/target/activemq-blueprint-5.14.0-SNAPSHOT-sources.jar>
[INFO]                                                                         
[INFO] ------------------------------------------------------------------------
[INFO] Skipping ActiveMQ :: Web Demo
[INFO] This project has been banned from the build due to previous failures.
[INFO] ------------------------------------------------------------------------
[INFO]                                                                         
[INFO] ------------------------------------------------------------------------
[INFO] Skipping ActiveMQ :: Web Console
[INFO] This project has been banned from the build due to previous failures.
[INFO] ------------------------------------------------------------------------
[INFO]                                                                         
[INFO] ------------------------------------------------------------------------
[INFO] Skipping ActiveMQ :: Karaf Integration Tests
[INFO] This project has been banned from the build due to previous failures.
[INFO] ------------------------------------------------------------------------
[INFO]                                                                         
[INFO] ------------------------------------------------------------------------
[INFO] Skipping ActiveMQ :: Integration Test :: Spring 3.1
[INFO] This project has been banned from the build due to previous failures.
[INFO] ------------------------------------------------------------------------
[INFO]                                                                         
[INFO] ------------------------------------------------------------------------
[INFO] Skipping ActiveMQ :: Assembly
[INFO] This project has been banned from the build due to previous failures.
[INFO] ------------------------------------------------------------------------
[INFO] ------------------------------------------------------------------------
[INFO] Reactor Summary:
[INFO] 
[INFO] ActiveMQ ........................................... SUCCESS [  4.326 s]
[INFO] ActiveMQ :: Openwire Generator ..................... SUCCESS [  4.967 s]
[INFO] ActiveMQ :: Client ................................. SUCCESS [01:31 min]
[INFO] ActiveMQ :: Openwire Legacy Support ................ SUCCESS [  3.838 s]
[INFO] ActiveMQ :: JAAS ................................... SUCCESS [ 31.438 s]
[INFO] ActiveMQ :: Broker ................................. SUCCESS [01:20 min]
[INFO] ActiveMQ :: KahaDB Store ........................... SUCCESS [11:06 min]
[INFO] ActiveMQ :: STOMP Protocol ......................... SUCCESS [11:24 min]
[INFO] ActiveMQ :: MQTT Protocol .......................... SUCCESS [20:20 min]
[INFO] ActiveMQ :: JDBC Store ............................. SUCCESS [  2.983 s]
[INFO] ActiveMQ :: LevelDB Store .......................... FAILURE [ 15.593 s]
[INFO] ActiveMQ :: Generic JMS Pool ....................... SUCCESS [ 41.483 s]
[INFO] ActiveMQ :: Pool ................................... SUCCESS [  3.585 s]
[INFO] ActiveMQ :: RA ..................................... SUCCESS [02:35 min]
[INFO] ActiveMQ :: Spring ................................. SKIPPED
[INFO] ActiveMQ :: Console ................................ SUCCESS [  5.956 s]
[INFO] ActiveMQ :: Partition Management ................... SKIPPED
[INFO] ActiveMQ :: Runtime Configuration .................. SKIPPED
[INFO] ActiveMQ :: Tooling ................................ SUCCESS [  0.758 s]
[INFO] ActiveMQ :: JUnit Rule ............................. SKIPPED
[INFO] ActiveMQ :: Unit Tests ............................. SKIPPED
[INFO] ActiveMQ :: HTTP Protocol Support .................. SKIPPED
[INFO] ActiveMQ :: AMQP ................................... SKIPPED
[INFO] ActiveMQ :: Camel .................................. SKIPPED
[INFO] ActiveMQ :: All JAR bundle ......................... SKIPPED
[INFO] ActiveMQ :: Log4j Appender ......................... SUCCESS [  4.469 s]
[INFO] ActiveMQ :: Apache Karaf ........................... SKIPPED
[INFO] ActiveMQ :: RAR .................................... SKIPPED
[INFO] ActiveMQ :: Run Jar ................................ SUCCESS [  1.988 s]
[INFO] ActiveMQ :: Shiro .................................. SKIPPED
[INFO] ActiveMQ :: Memory Usage Test Plugin ............... SUCCESS [  3.914 s]
[INFO] ActiveMQ :: Performance Test Plugin ................ SKIPPED
[INFO] ActiveMQ :: StartUp/Stop Plugin .................... SKIPPED
[INFO] ActiveMQ :: Web .................................... SKIPPED
[INFO] ActiveMQ :: OSGi bundle ............................ SKIPPED
[INFO] ActiveMQ :: Blueprint .............................. SUCCESS [  1.621 s]
[INFO] ActiveMQ :: Web Demo ............................... SKIPPED
[INFO] ActiveMQ :: Web Console ............................ SKIPPED
[INFO] ActiveMQ :: Karaf Integration Tests ................ SKIPPED
[INFO] ActiveMQ :: Integration Test :: Spring 3.1 ......... SKIPPED
[INFO] ActiveMQ :: Assembly ............................... SKIPPED
[INFO] ------------------------------------------------------------------------
[INFO] BUILD FAILURE
[INFO] ------------------------------------------------------------------------
[INFO] Total time: 50:49 min
[INFO] Finished at: 2016-07-26T20:53:41+00:00
[INFO] Final Memory: 88M/1321M
[INFO] ------------------------------------------------------------------------
[ERROR] Failed to execute goal net.alchim31.maven:scala-maven-plugin:3.1.0:compile (default)
on project activemq-leveldb-store: wrap: org.apache.commons.exec.ExecuteException: Process
exited with an error: 1(Exit value: 1) -> [Help 1]
org.apache.maven.lifecycle.LifecycleExecutionException: Failed to execute goal net.alchim31.maven:scala-maven-plugin:3.1.0:compile
(default) on project activemq-leveldb-store: wrap: org.apache.commons.exec.ExecuteException:
Process exited with an error: 1(Exit value: 1)
	at org.apache.maven.lifecycle.internal.MojoExecutor.execute(MojoExecutor.java:212)
	at org.apache.maven.lifecycle.internal.MojoExecutor.execute(MojoExecutor.java:153)
	at org.apache.maven.lifecycle.internal.MojoExecutor.execute(MojoExecutor.java:145)
	at org.apache.maven.lifecycle.internal.LifecycleModuleBuilder.buildProject(LifecycleModuleBuilder.java:116)
	at org.apache.maven.lifecycle.internal.LifecycleModuleBuilder.buildProject(LifecycleModuleBuilder.java:80)
	at org.apache.maven.lifecycle.internal.builder.singlethreaded.SingleThreadedBuilder.build(SingleThreadedBuilder.java:51)
	at org.apache.maven.lifecycle.internal.LifecycleStarter.execute(LifecycleStarter.java:128)
	at org.apache.maven.DefaultMaven.doExecute(DefaultMaven.java:307)
	at org.apache.maven.DefaultMaven.doExecute(DefaultMaven.java:193)
	at org.apache.maven.DefaultMaven.execute(DefaultMaven.java:106)
	at org.jvnet.hudson.maven3.launcher.Maven32Launcher.main(Maven32Launcher.java:132)
	at sun.reflect.NativeMethodAccessorImpl.invoke0(Native Method)
	at sun.reflect.NativeMethodAccessorImpl.invoke(NativeMethodAccessorImpl.java:62)
	at sun.reflect.DelegatingMethodAccessorImpl.invoke(DelegatingMethodAccessorImpl.java:43)
	at java.lang.reflect.Method.invoke(Method.java:483)
	at org.codehaus.plexus.classworlds.launcher.Launcher.launchStandard(Launcher.java:330)
	at org.codehaus.plexus.classworlds.launcher.Launcher.launch(Launcher.java:238)
	at jenkins.maven3.agent.Maven32Main.launch(Maven32Main.java:186)
	at sun.reflect.NativeMethodAccessorImpl.invoke0(Native Method)
	at sun.reflect.NativeMethodAccessorImpl.invoke(NativeMethodAccessorImpl.java:62)
	at sun.reflect.DelegatingMethodAccessorImpl.invoke(DelegatingMethodAccessorImpl.java:43)
	at java.lang.reflect.Method.invoke(Method.java:483)
	at hudson.maven.Maven3Builder.call(Maven3Builder.java:136)
	at hudson.maven.Maven3Builder.call(Maven3Builder.java:71)
	at hudson.remoting.UserRequest.perform(UserRequest.java:120)
	at hudson.remoting.UserRequest.perform(UserRequest.java:48)
	at hudson.remoting.Request$2.run(Request.java:326)
	at hudson.remoting.InterceptingExecutorService$1.call(InterceptingExecutorService.java:68)
	at java.util.concurrent.FutureTask.run(FutureTask.java:266)
	at java.util.concurrent.ThreadPoolExecutor.runWorker(ThreadPoolExecutor.java:1142)
	at java.util.concurrent.ThreadPoolExecutor$Worker.run(ThreadPoolExecutor.java:617)
	at java.lang.Thread.run(Thread.java:745)
Caused by: org.apache.maven.plugin.MojoExecutionException: wrap: org.apache.commons.exec.ExecuteException:
Process exited with an error: 1(Exit value: 1)
	at scala_maven.ScalaMojoSupport.execute(ScalaMojoSupport.java:408)
	at org.apache.maven.plugin.DefaultBuildPluginManager.executeMojo(DefaultBuildPluginManager.java:134)
	at org.apache.maven.lifecycle.internal.MojoExecutor.execute(MojoExecutor.java:207)
	... 31 more
Caused by: org.apache.commons.exec.ExecuteException: Process exited with an error: 1(Exit
value: 1)
	at org.apache.commons.exec.DefaultExecutor.executeInternal(DefaultExecutor.java:346)
	at org.apache.commons.exec.DefaultExecutor.execute(DefaultExecutor.java:149)
	at org.apache.commons.exec.DefaultExecutor.execute(DefaultExecutor.java:136)
	at scala_maven_executions.JavaMainCallerByFork.run(JavaMainCallerByFork.java:99)
	at scala_maven.ScalaCompilerSupport.compile(ScalaCompilerSupport.java:149)
	at scala_maven.ScalaCompilerSupport.doExecute(ScalaCompilerSupport.java:99)
	at scala_maven.ScalaMojoSupport.execute(ScalaMojoSupport.java:400)
	... 33 more
[ERROR] 
[ERROR] Re-run Maven using the -X switch to enable full debug logging.
[ERROR] 
[ERROR] For more information about the errors and possible solutions, please read the following
articles:
[ERROR] [Help 1] http://cwiki.apache.org/confluence/display/MAVEN/MojoExecutionException
[ERROR] 
[ERROR] After correcting the problems, you can resume the build with the command
[ERROR]   mvn <goals> -rf :activemq-leveldb-store
[JENKINS] Archiving <https://builds.apache.org/job/ActiveMQ-Java8/ws/activemq-unit-tests/pom.xml>
to org.apache.activemq/activemq-unit-tests/5.14.0-SNAPSHOT/activemq-unit-tests-5.14.0-SNAPSHOT.pom
Compressed 71.24 KB of artifacts by 89.8% relative to #773
[JENKINS] Archiving <https://builds.apache.org/job/ActiveMQ-Java8/ws/activemq-openwire-legacy/pom.xml>
to org.apache.activemq/activemq-openwire-legacy/5.14.0-SNAPSHOT/activemq-openwire-legacy-5.14.0-SNAPSHOT.pom
[JENKINS] Archiving <https://builds.apache.org/job/ActiveMQ-Java8/ws/activemq-openwire-legacy/target/activemq-openwire-legacy-5.14.0-SNAPSHOT.jar>
to org.apache.activemq/activemq-openwire-legacy/5.14.0-SNAPSHOT/activemq-openwire-legacy-5.14.0-SNAPSHOT.jar
[JENKINS] Archiving <https://builds.apache.org/job/ActiveMQ-Java8/ws/activemq-openwire-legacy/target/activemq-openwire-legacy-5.14.0-SNAPSHOT-sources.jar>
to org.apache.activemq/activemq-openwire-legacy/5.14.0-SNAPSHOT/activemq-openwire-legacy-5.14.0-SNAPSHOT-sources.jar
Compressed 1.34 MB of artifacts by 44.4% relative to #773
[JENKINS] Archiving <https://builds.apache.org/job/ActiveMQ-Java8/ws/activemq-web-console/pom.xml>
to org.apache.activemq/activemq-web-console/5.14.0-SNAPSHOT/activemq-web-console-5.14.0-SNAPSHOT.pom
[JENKINS] Archiving <https://builds.apache.org/job/ActiveMQ-Java8/ws/activemq-web-demo/pom.xml>
to org.apache.activemq/activemq-web-demo/5.14.0-SNAPSHOT/activemq-web-demo-5.14.0-SNAPSHOT.pom
[JENKINS] Archiving <https://builds.apache.org/job/ActiveMQ-Java8/ws/activemq-osgi/pom.xml>
to org.apache.activemq/activemq-osgi/5.14.0-SNAPSHOT/activemq-osgi-5.14.0-SNAPSHOT.pom
[JENKINS] Archiving <https://builds.apache.org/job/ActiveMQ-Java8/ws/activemq-tooling/activemq-maven-plugin/pom.xml>
to org.apache.activemq.tooling/activemq-maven-plugin/5.14.0-SNAPSHOT/activemq-maven-plugin-5.14.0-SNAPSHOT.pom
[JENKINS] Archiving <https://builds.apache.org/job/ActiveMQ-Java8/ws/activemq-openwire-generator/pom.xml>
to org.apache.activemq/activemq-openwire-generator/5.14.0-SNAPSHOT/activemq-openwire-generator-5.14.0-SNAPSHOT.pom
[JENKINS] Archiving <https://builds.apache.org/job/ActiveMQ-Java8/ws/activemq-openwire-generator/target/activemq-openwire-generator-5.14.0-SNAPSHOT.jar>
to org.apache.activemq/activemq-openwire-generator/5.14.0-SNAPSHOT/activemq-openwire-generator-5.14.0-SNAPSHOT.jar
[JENKINS] Archiving <https://builds.apache.org/job/ActiveMQ-Java8/ws/activemq-openwire-generator/target/activemq-openwire-generator-5.14.0-SNAPSHOT-sources.jar>
to org.apache.activemq/activemq-openwire-generator/5.14.0-SNAPSHOT/activemq-openwire-generator-5.14.0-SNAPSHOT-sources.jar
[JENKINS] Archiving <https://builds.apache.org/job/ActiveMQ-Java8/ws/activemq-jdbc-store/pom.xml>
to org.apache.activemq/activemq-jdbc-store/5.14.0-SNAPSHOT/activemq-jdbc-store-5.14.0-SNAPSHOT.pom
[JENKINS] Archiving <https://builds.apache.org/job/ActiveMQ-Java8/ws/activemq-jdbc-store/target/activemq-jdbc-store-5.14.0-SNAPSHOT.jar>
to org.apache.activemq/activemq-jdbc-store/5.14.0-SNAPSHOT/activemq-jdbc-store-5.14.0-SNAPSHOT.jar
[JENKINS] Archiving <https://builds.apache.org/job/ActiveMQ-Java8/ws/activemq-jdbc-store/target/activemq-jdbc-store-5.14.0-SNAPSHOT-sources.jar>
to org.apache.activemq/activemq-jdbc-store/5.14.0-SNAPSHOT/activemq-jdbc-store-5.14.0-SNAPSHOT-sources.jar
[JENKINS] Archiving <https://builds.apache.org/job/ActiveMQ-Java8/ws/activemq-rar/pom.xml>
to org.apache.activemq/activemq-rar/5.14.0-SNAPSHOT/activemq-rar-5.14.0-SNAPSHOT.pom
[JENKINS] Archiving <https://builds.apache.org/job/ActiveMQ-Java8/ws/activemq-tooling/activemq-memtest-maven-plugin/pom.xml>
to org.apache.activemq.tooling/activemq-memtest-maven-plugin/5.14.0-SNAPSHOT/activemq-memtest-maven-plugin-5.14.0-SNAPSHOT.pom
[JENKINS] Archiving <https://builds.apache.org/job/ActiveMQ-Java8/ws/activemq-tooling/activemq-memtest-maven-plugin/target/activemq-memtest-maven-plugin-5.14.0-SNAPSHOT.jar>
to org.apache.activemq.tooling/activemq-memtest-maven-plugin/5.14.0-SNAPSHOT/activemq-memtest-maven-plugin-5.14.0-SNAPSHOT.jar
[JENKINS] Archiving <https://builds.apache.org/job/ActiveMQ-Java8/ws/activemq-tooling/activemq-memtest-maven-plugin/target/activemq-memtest-maven-plugin-5.14.0-SNAPSHOT-sources.jar>
to org.apache.activemq.tooling/activemq-memtest-maven-plugin/5.14.0-SNAPSHOT/activemq-memtest-maven-plugin-5.14.0-SNAPSHOT-sources.jar
[JENKINS] Archiving <https://builds.apache.org/job/ActiveMQ-Java8/ws/activemq-tooling/activemq-perf-maven-plugin/pom.xml>
to org.apache.activemq.tooling/activemq-perf-maven-plugin/5.14.0-SNAPSHOT/activemq-perf-maven-plugin-5.14.0-SNAPSHOT.pom
[JENKINS] Archiving <https://builds.apache.org/job/ActiveMQ-Java8/ws/activemq-amqp/pom.xml>
to org.apache.activemq/activemq-amqp/5.14.0-SNAPSHOT/activemq-amqp-5.14.0-SNAPSHOT.pom
[JENKINS] Archiving <https://builds.apache.org/job/ActiveMQ-Java8/ws/activemq-itests-spring31/pom.xml>
to org.apache.activemq/activemq-itests-spring31/5.14.0-SNAPSHOT/activemq-itests-spring31-5.14.0-SNAPSHOT.pom
[JENKINS] Archiving <https://builds.apache.org/job/ActiveMQ-Java8/ws/assembly/pom.xml>
to org.apache.activemq/apache-activemq/5.14.0-SNAPSHOT/apache-activemq-5.14.0-SNAPSHOT.pom
[JENKINS] Archiving <https://builds.apache.org/job/ActiveMQ-Java8/ws/activemq-jms-pool/pom.xml>
to org.apache.activemq/activemq-jms-pool/5.14.0-SNAPSHOT/activemq-jms-pool-5.14.0-SNAPSHOT.pom
[JENKINS] Archiving <https://builds.apache.org/job/ActiveMQ-Java8/ws/activemq-jms-pool/target/activemq-jms-pool-5.14.0-SNAPSHOT.jar>
to org.apache.activemq/activemq-jms-pool/5.14.0-SNAPSHOT/activemq-jms-pool-5.14.0-SNAPSHOT.jar
[JENKINS] Archiving <https://builds.apache.org/job/ActiveMQ-Java8/ws/activemq-jms-pool/target/activemq-jms-pool-5.14.0-SNAPSHOT-sources.jar>
to org.apache.activemq/activemq-jms-pool/5.14.0-SNAPSHOT/activemq-jms-pool-5.14.0-SNAPSHOT-sources.jar
[JENKINS] Archiving <https://builds.apache.org/job/ActiveMQ-Java8/ws/activemq-log4j-appender/pom.xml>
to org.apache.activemq/activemq-log4j-appender/5.14.0-SNAPSHOT/activemq-log4j-appender-5.14.0-SNAPSHOT.pom
[JENKINS] Archiving <https://builds.apache.org/job/ActiveMQ-Java8/ws/activemq-log4j-appender/target/activemq-log4j-appender-5.14.0-SNAPSHOT.jar>
to org.apache.activemq/activemq-log4j-appender/5.14.0-SNAPSHOT/activemq-log4j-appender-5.14.0-SNAPSHOT.jar
[JENKINS] Archiving <https://builds.apache.org/job/ActiveMQ-Java8/ws/activemq-log4j-appender/target/activemq-log4j-appender-5.14.0-SNAPSHOT-sources.jar>
to org.apache.activemq/activemq-log4j-appender/5.14.0-SNAPSHOT/activemq-log4j-appender-5.14.0-SNAPSHOT-sources.jar
[JENKINS] Archiving <https://builds.apache.org/job/ActiveMQ-Java8/ws/activemq-tooling/activemq-junit/pom.xml>
to org.apache.activemq.tooling/activemq-junit/5.14.0-SNAPSHOT/activemq-junit-5.14.0-SNAPSHOT.pom
[JENKINS] Archiving <https://builds.apache.org/job/ActiveMQ-Java8/ws/activemq-runtime-config/pom.xml>
to org.apache.activemq/activemq-runtime-config/5.14.0-SNAPSHOT/activemq-runtime-config-5.14.0-SNAPSHOT.pom
[JENKINS] Archiving <https://builds.apache.org/job/ActiveMQ-Java8/ws/activemq-pool/pom.xml>
to org.apache.activemq/activemq-pool/5.14.0-SNAPSHOT/activemq-pool-5.14.0-SNAPSHOT.pom
[JENKINS] Archiving <https://builds.apache.org/job/ActiveMQ-Java8/ws/activemq-pool/target/activemq-pool-5.14.0-SNAPSHOT.jar>
to org.apache.activemq/activemq-pool/5.14.0-SNAPSHOT/activemq-pool-5.14.0-SNAPSHOT.jar
[JENKINS] Archiving <https://builds.apache.org/job/ActiveMQ-Java8/ws/activemq-pool/target/activemq-pool-5.14.0-SNAPSHOT-sources.jar>
to org.apache.activemq/activemq-pool/5.14.0-SNAPSHOT/activemq-pool-5.14.0-SNAPSHOT-sources.jar
[JENKINS] Archiving <https://builds.apache.org/job/ActiveMQ-Java8/ws/activemq-stomp/pom.xml>
to org.apache.activemq/activemq-stomp/5.14.0-SNAPSHOT/activemq-stomp-5.14.0-SNAPSHOT.pom
[JENKINS] Archiving <https://builds.apache.org/job/ActiveMQ-Java8/ws/activemq-stomp/target/activemq-stomp-5.14.0-SNAPSHOT.jar>
to org.apache.activemq/activemq-stomp/5.14.0-SNAPSHOT/activemq-stomp-5.14.0-SNAPSHOT.jar
[JENKINS] Archiving <https://builds.apache.org/job/ActiveMQ-Java8/ws/activemq-stomp/target/activemq-stomp-5.14.0-SNAPSHOT-sources.jar>
to org.apache.activemq/activemq-stomp/5.14.0-SNAPSHOT/activemq-stomp-5.14.0-SNAPSHOT-sources.jar
[JENKINS] Archiving <https://builds.apache.org/job/ActiveMQ-Java8/ws/activemq-run/dependency-reduced-pom.xml>
to org.apache.activemq/activemq-run/5.14.0-SNAPSHOT/activemq-run-5.14.0-SNAPSHOT.pom
[JENKINS] Archiving <https://builds.apache.org/job/ActiveMQ-Java8/ws/activemq-run/target/activemq-run-5.14.0-SNAPSHOT.jar>
to org.apache.activemq/activemq-run/5.14.0-SNAPSHOT/activemq-run-5.14.0-SNAPSHOT.jar
[JENKINS] Archiving <https://builds.apache.org/job/ActiveMQ-Java8/ws/activemq-run/target/activemq-run-5.14.0-SNAPSHOT-sources.jar>
to org.apache.activemq/activemq-run/5.14.0-SNAPSHOT/activemq-run-5.14.0-SNAPSHOT-sources.jar
[JENKINS] Archiving <https://builds.apache.org/job/ActiveMQ-Java8/ws/activemq-mqtt/pom.xml>
to org.apache.activemq/activemq-mqtt/5.14.0-SNAPSHOT/activemq-mqtt-5.14.0-SNAPSHOT.pom
[JENKINS] Archiving <https://builds.apache.org/job/ActiveMQ-Java8/ws/activemq-mqtt/target/activemq-mqtt-5.14.0-SNAPSHOT.jar>
to org.apache.activemq/activemq-mqtt/5.14.0-SNAPSHOT/activemq-mqtt-5.14.0-SNAPSHOT.jar
[JENKINS] Archiving <https://builds.apache.org/job/ActiveMQ-Java8/ws/activemq-mqtt/target/activemq-mqtt-5.14.0-SNAPSHOT-sources.jar>
to org.apache.activemq/activemq-mqtt/5.14.0-SNAPSHOT/activemq-mqtt-5.14.0-SNAPSHOT-sources.jar
[JENKINS] Archiving <https://builds.apache.org/job/ActiveMQ-Java8/ws/activemq-shiro/pom.xml>
to org.apache.activemq/activemq-shiro/5.14.0-SNAPSHOT/activemq-shiro-5.14.0-SNAPSHOT.pom
[JENKINS] Archiving <https://builds.apache.org/job/ActiveMQ-Java8/ws/activemq-console/pom.xml>
to org.apache.activemq/activemq-console/5.14.0-SNAPSHOT/activemq-console-5.14.0-SNAPSHOT.pom
[JENKINS] Archiving <https://builds.apache.org/job/ActiveMQ-Java8/ws/activemq-console/target/activemq-console-5.14.0-SNAPSHOT.jar>
to org.apache.activemq/activemq-console/5.14.0-SNAPSHOT/activemq-console-5.14.0-SNAPSHOT.jar
[JENKINS] Archiving <https://builds.apache.org/job/ActiveMQ-Java8/ws/activemq-console/target/activemq-console-5.14.0-SNAPSHOT-sources.jar>
to org.apache.activemq/activemq-console/5.14.0-SNAPSHOT/activemq-console-5.14.0-SNAPSHOT-sources.jar
Compressed 335.20 KB of artifacts by 19.1% relative to #773
[JENKINS] Archiving <https://builds.apache.org/job/ActiveMQ-Java8/ws/activemq-camel/pom.xml>
to org.apache.activemq/activemq-camel/5.14.0-SNAPSHOT/activemq-camel-5.14.0-SNAPSHOT.pom
[JENKINS] Archiving <https://builds.apache.org/job/ActiveMQ-Java8/ws/activemq-blueprint/pom.xml>
to org.apache.activemq/activemq-blueprint/5.14.0-SNAPSHOT/activemq-blueprint-5.14.0-SNAPSHOT.pom
[JENKINS] Archiving <https://builds.apache.org/job/ActiveMQ-Java8/ws/activemq-blueprint/target/activemq-blueprint-5.14.0-SNAPSHOT.jar>
to org.apache.activemq/activemq-blueprint/5.14.0-SNAPSHOT/activemq-blueprint-5.14.0-SNAPSHOT.jar
[JENKINS] Archiving <https://builds.apache.org/job/ActiveMQ-Java8/ws/activemq-blueprint/target/activemq-blueprint-5.14.0-SNAPSHOT-sources.jar>
to org.apache.activemq/activemq-blueprint/5.14.0-SNAPSHOT/activemq-blueprint-5.14.0-SNAPSHOT-sources.jar
[JENKINS] Archiving <https://builds.apache.org/job/ActiveMQ-Java8/ws/activemq-client/pom.xml>
to org.apache.activemq/activemq-client/5.14.0-SNAPSHOT/activemq-client-5.14.0-SNAPSHOT.pom
[JENKINS] Archiving <https://builds.apache.org/job/ActiveMQ-Java8/ws/activemq-client/target/activemq-client-5.14.0-SNAPSHOT.jar>
to org.apache.activemq/activemq-client/5.14.0-SNAPSHOT/activemq-client-5.14.0-SNAPSHOT.jar
[JENKINS] Archiving <https://builds.apache.org/job/ActiveMQ-Java8/ws/activemq-client/target/activemq-client-5.14.0-SNAPSHOT-sources.jar>
to org.apache.activemq/activemq-client/5.14.0-SNAPSHOT/activemq-client-5.14.0-SNAPSHOT-sources.jar
Compressed 2.56 MB of artifacts by 41.5% relative to #773
[JENKINS] Archiving <https://builds.apache.org/job/ActiveMQ-Java8/ws/pom.xml> to org.apache.activemq/activemq-parent/5.14.0-SNAPSHOT/activemq-parent-5.14.0-SNAPSHOT.pom
Compressed 59.36 KB of artifacts by 53.9% relative to #773
[JENKINS] Archiving <https://builds.apache.org/job/ActiveMQ-Java8/ws/activemq-karaf-itest/pom.xml>
to org.apache.activemq/activemq-karaf-itest/5.14.0-SNAPSHOT/activemq-karaf-itest-5.14.0-SNAPSHOT.pom
[JENKINS] Archiving <https://builds.apache.org/job/ActiveMQ-Java8/ws/activemq-broker/pom.xml>
to org.apache.activemq/activemq-broker/5.14.0-SNAPSHOT/activemq-broker-5.14.0-SNAPSHOT.pom
[JENKINS] Archiving <https://builds.apache.org/job/ActiveMQ-Java8/ws/activemq-broker/target/activemq-broker-5.14.0-SNAPSHOT.jar>
to org.apache.activemq/activemq-broker/5.14.0-SNAPSHOT/activemq-broker-5.14.0-SNAPSHOT.jar
[JENKINS] Archiving <https://builds.apache.org/job/ActiveMQ-Java8/ws/activemq-broker/target/activemq-broker-5.14.0-SNAPSHOT-tests.jar>
to org.apache.activemq/activemq-broker/5.14.0-SNAPSHOT/activemq-broker-5.14.0-SNAPSHOT-tests.jar
[JENKINS] Archiving <https://builds.apache.org/job/ActiveMQ-Java8/ws/activemq-broker/target/activemq-broker-5.14.0-SNAPSHOT-sources.jar>
to org.apache.activemq/activemq-broker/5.14.0-SNAPSHOT/activemq-broker-5.14.0-SNAPSHOT-sources.jar
Compressed 2.01 MB of artifacts by 29.6% relative to #773
[JENKINS] Archiving <https://builds.apache.org/job/ActiveMQ-Java8/ws/activemq-ra/pom.xml>
to org.apache.activemq/activemq-ra/5.14.0-SNAPSHOT/activemq-ra-5.14.0-SNAPSHOT.pom
[JENKINS] Archiving <https://builds.apache.org/job/ActiveMQ-Java8/ws/activemq-ra/target/activemq-ra-5.14.0-SNAPSHOT.jar>
to org.apache.activemq/activemq-ra/5.14.0-SNAPSHOT/activemq-ra-5.14.0-SNAPSHOT.jar
[JENKINS] Archiving <https://builds.apache.org/job/ActiveMQ-Java8/ws/activemq-ra/target/xbean/activemq-ra.xsd>
to org.apache.activemq/activemq-ra/5.14.0-SNAPSHOT/activemq-ra-5.14.0-SNAPSHOT.xsd
[JENKINS] Archiving <https://builds.apache.org/job/ActiveMQ-Java8/ws/activemq-ra/target/xbean/activemq-ra.xsd.html>
to org.apache.activemq/activemq-ra/5.14.0-SNAPSHOT/activemq-ra-5.14.0-SNAPSHOT-schema.html
[JENKINS] Archiving <https://builds.apache.org/job/ActiveMQ-Java8/ws/activemq-ra/target/xbean/activemq-ra.xsd.html>
to org.apache.activemq/activemq-ra/5.14.0-SNAPSHOT/activemq-ra-5.14.0-SNAPSHOT.xsd.html
[JENKINS] Archiving <https://builds.apache.org/job/ActiveMQ-Java8/ws/activemq-ra/target/activemq-ra-5.14.0-SNAPSHOT-sources.jar>
to org.apache.activemq/activemq-ra/5.14.0-SNAPSHOT/activemq-ra-5.14.0-SNAPSHOT-sources.jar
Compressed 193.20 KB of artifacts by 16.6% relative to #773
[JENKINS] Archiving <https://builds.apache.org/job/ActiveMQ-Java8/ws/activemq-spring/pom.xml>
to org.apache.activemq/activemq-spring/5.14.0-SNAPSHOT/activemq-spring-5.14.0-SNAPSHOT.pom
[JENKINS] Archiving <https://builds.apache.org/job/ActiveMQ-Java8/ws/activemq-all/pom.xml>
to org.apache.activemq/activemq-all/5.14.0-SNAPSHOT/activemq-all-5.14.0-SNAPSHOT.pom
[JENKINS] Archiving <https://builds.apache.org/job/ActiveMQ-Java8/ws/activemq-kahadb-store/pom.xml>
to org.apache.activemq/activemq-kahadb-store/5.14.0-SNAPSHOT/activemq-kahadb-store-5.14.0-SNAPSHOT.pom
[JENKINS] Archiving <https://builds.apache.org/job/ActiveMQ-Java8/ws/activemq-kahadb-store/target/activemq-kahadb-store-5.14.0-SNAPSHOT.jar>
to org.apache.activemq/activemq-kahadb-store/5.14.0-SNAPSHOT/activemq-kahadb-store-5.14.0-SNAPSHOT.jar
[JENKINS] Archiving <https://builds.apache.org/job/ActiveMQ-Java8/ws/activemq-kahadb-store/target/activemq-kahadb-store-5.14.0-SNAPSHOT-sources.jar>
to org.apache.activemq/activemq-kahadb-store/5.14.0-SNAPSHOT/activemq-kahadb-store-5.14.0-SNAPSHOT-sources.jar
Compressed 925.10 KB of artifacts by 10.4% relative to #773
[JENKINS] Archiving <https://builds.apache.org/job/ActiveMQ-Java8/ws/activemq-jaas/pom.xml>
to org.apache.activemq/activemq-jaas/5.14.0-SNAPSHOT/activemq-jaas-5.14.0-SNAPSHOT.pom
[JENKINS] Archiving <https://builds.apache.org/job/ActiveMQ-Java8/ws/activemq-jaas/target/activemq-jaas-5.14.0-SNAPSHOT.jar>
to org.apache.activemq/activemq-jaas/5.14.0-SNAPSHOT/activemq-jaas-5.14.0-SNAPSHOT.jar
[JENKINS] Archiving <https://builds.apache.org/job/ActiveMQ-Java8/ws/activemq-jaas/target/activemq-jaas-5.14.0-SNAPSHOT-sources.jar>
to org.apache.activemq/activemq-jaas/5.14.0-SNAPSHOT/activemq-jaas-5.14.0-SNAPSHOT-sources.jar
[JENKINS] Archiving <https://builds.apache.org/job/ActiveMQ-Java8/ws/activemq-tooling/pom.xml>
to org.apache.activemq.tooling/activemq-tooling/5.14.0-SNAPSHOT/activemq-tooling-5.14.0-SNAPSHOT.pom
[JENKINS] Archiving <https://builds.apache.org/job/ActiveMQ-Java8/ws/activemq-partition/pom.xml>
to org.apache.activemq/activemq-partition/5.14.0-SNAPSHOT/activemq-partition-5.14.0-SNAPSHOT.pom
[JENKINS] Archiving <https://builds.apache.org/job/ActiveMQ-Java8/ws/activemq-web/pom.xml>
to org.apache.activemq/activemq-web/5.14.0-SNAPSHOT/activemq-web-5.14.0-SNAPSHOT.pom
[JENKINS] Archiving <https://builds.apache.org/job/ActiveMQ-Java8/ws/activemq-leveldb-store/pom.xml>
to org.apache.activemq/activemq-leveldb-store/5.14.0-SNAPSHOT/activemq-leveldb-store-5.14.0-SNAPSHOT.pom
[JENKINS] Archiving <https://builds.apache.org/job/ActiveMQ-Java8/ws/activemq-karaf/pom.xml>
to org.apache.activemq/activemq-karaf/5.14.0-SNAPSHOT/activemq-karaf-5.14.0-SNAPSHOT.pom
[JENKINS] Archiving <https://builds.apache.org/job/ActiveMQ-Java8/ws/activemq-http/pom.xml>
to org.apache.activemq/activemq-http/5.14.0-SNAPSHOT/activemq-http-5.14.0-SNAPSHOT.pom
Sending e-mails to: commits@activemq.apache.org
[locks-and-latches] Releasing all the locks
[locks-and-latches] All the locks released
channel stopped

Mime
View raw message