activemq-commits mailing list archives

Site index · List index
Message view « Date » · « Thread »
Top « Date » · « Thread »
From Apache Jenkins Server <jenk...@builds.apache.org>
Subject Build failed in Jenkins: ActiveMQ-Java7-All-UnitTests #491
Date Tue, 26 Jul 2016 19:58:02 GMT
See <https://builds.apache.org/job/ActiveMQ-Java7-All-UnitTests/491/changes>

Changes:

[gtully] AMQ-6361 - fix additional test regression on topic sub expiry

[gtully] AMQ-6370 - speed up the test and wait a bit longer for sends in slow ci

[christopher.l.shannon] https://issues.apache.org/jira/browse/AMQ-6375

------------------------------------------
[...truncated 1148 lines...]
[INFO] --- maven-install-plugin:2.5.2:install (default-install) @ activemq-ra ---
[INFO] Installing <https://builds.apache.org/job/ActiveMQ-Java7-All-UnitTests/ws/activemq-ra/target/activemq-ra-5.14.0-SNAPSHOT.jar>
to /home/jenkins/jenkins-slave/maven-repositories/0/org/apache/activemq/activemq-ra/5.14.0-SNAPSHOT/activemq-ra-5.14.0-SNAPSHOT.jar
[INFO] Installing <https://builds.apache.org/job/ActiveMQ-Java7-All-UnitTests/ws/activemq-ra/pom.xml>
to /home/jenkins/jenkins-slave/maven-repositories/0/org/apache/activemq/activemq-ra/5.14.0-SNAPSHOT/activemq-ra-5.14.0-SNAPSHOT.pom
[INFO] Installing <https://builds.apache.org/job/ActiveMQ-Java7-All-UnitTests/ws/activemq-ra/target/xbean/activemq-ra.xsd>
to /home/jenkins/jenkins-slave/maven-repositories/0/org/apache/activemq/activemq-ra/5.14.0-SNAPSHOT/activemq-ra-5.14.0-SNAPSHOT.xsd
[INFO] Installing <https://builds.apache.org/job/ActiveMQ-Java7-All-UnitTests/ws/activemq-ra/target/xbean/activemq-ra.xsd.html>
to /home/jenkins/jenkins-slave/maven-repositories/0/org/apache/activemq/activemq-ra/5.14.0-SNAPSHOT/activemq-ra-5.14.0-SNAPSHOT-schema.html
[INFO] Installing <https://builds.apache.org/job/ActiveMQ-Java7-All-UnitTests/ws/activemq-ra/target/xbean/activemq-ra.xsd.html>
to /home/jenkins/jenkins-slave/maven-repositories/0/org/apache/activemq/activemq-ra/5.14.0-SNAPSHOT/activemq-ra-5.14.0-SNAPSHOT.xsd.html
[INFO]                                                                         
[INFO] ------------------------------------------------------------------------
[INFO] Skipping ActiveMQ :: Spring
[INFO] This project has been banned from the build due to previous failures.
[INFO] ------------------------------------------------------------------------
[INFO]                                                                         
[INFO] ------------------------------------------------------------------------
[INFO] Building ActiveMQ :: Console 5.14.0-SNAPSHOT
[INFO] ------------------------------------------------------------------------
[INFO] 
[INFO] --- maven-clean-plugin:2.5:clean (default-clean) @ activemq-console ---
[INFO] 
[INFO] --- maven-enforcer-plugin:1.3.1:enforce (default) @ activemq-console ---
[INFO] 
[INFO] --- maven-bundle-plugin:2.3.7:cleanVersions (cleanVersions) @ activemq-console ---
[INFO] 
[INFO] --- build-helper-maven-plugin:1.8:add-source (add-source) @ activemq-console ---
[INFO] Source directory: <https://builds.apache.org/job/ActiveMQ-Java7-All-UnitTests/ws/activemq-console/target/generated-sources/proto>
added.
[INFO] 
[INFO] --- hawtbuf-protoc:1.11:compile (default) @ activemq-console ---
[INFO] Compiling: <https://builds.apache.org/job/ActiveMQ-Java7-All-UnitTests/ws/activemq-console/src/main/proto/data.proto>
[INFO] 
[INFO] --- maven-remote-resources-plugin:1.5:process (default) @ activemq-console ---
[INFO] 
[INFO] --- maven-resources-plugin:2.7:resources (default-resources) @ activemq-console ---
[INFO] Using 'UTF-8' encoding to copy filtered resources.
[INFO] Copying 4 resources
[INFO] Copying 3 resources
[INFO] 
[INFO] --- maven-compiler-plugin:3.3:compile (default-compile) @ activemq-console ---
[INFO] Changes detected - recompiling the module!
[INFO] Compiling 59 source files to <https://builds.apache.org/job/ActiveMQ-Java7-All-UnitTests/ws/activemq-console/target/classes>
[INFO] <https://builds.apache.org/job/ActiveMQ-Java7-All-UnitTests/ws/activemq-console/src/main/java/org/apache/activemq/console/filter/AmqMessagesQueryFilter.java>:
Some input files use unchecked or unsafe operations.
[INFO] <https://builds.apache.org/job/ActiveMQ-Java7-All-UnitTests/ws/activemq-console/src/main/java/org/apache/activemq/console/filter/AmqMessagesQueryFilter.java>:
Recompile with -Xlint:unchecked for details.
[INFO] 
[INFO] --- maven-resources-plugin:2.7:testResources (default-testResources) @ activemq-console
---
[INFO] Using 'UTF-8' encoding to copy filtered resources.
[INFO] Copying 1 resource
[INFO] Copying 3 resources
[INFO] 
[INFO] --- maven-compiler-plugin:3.3:testCompile (default-testCompile) @ activemq-console
---
[INFO] Changes detected - recompiling the module!
[INFO] Compiling 5 source files to <https://builds.apache.org/job/ActiveMQ-Java7-All-UnitTests/ws/activemq-console/target/test-classes>
[INFO] 
[INFO] --- maven-surefire-plugin:2.16:test (default-test) @ activemq-console ---
[INFO] Surefire report directory: <https://builds.apache.org/job/ActiveMQ-Java7-All-UnitTests/ws/activemq-console/target/surefire-reports>

-------------------------------------------------------
 T E S T S
-------------------------------------------------------

-------------------------------------------------------
 T E S T S
-------------------------------------------------------
Running org.apache.activemq.console.QueryCommandTest
Tests run: 3, Failures: 0, Errors: 0, Skipped: 0, Time elapsed: 1.347 sec - in org.apache.activemq.console.QueryCommandTest
Running org.apache.activemq.console.filter.TestMapTransformFilter
Tests run: 1, Failures: 0, Errors: 0, Skipped: 0, Time elapsed: 0.079 sec - in org.apache.activemq.console.filter.TestMapTransformFilter
Running org.apache.activemq.console.PurgeCommandTest
Tests run: 2, Failures: 0, Errors: 0, Skipped: 0, Time elapsed: 1.356 sec - in org.apache.activemq.console.PurgeCommandTest

Results :

Tests run: 6, Failures: 0, Errors: 0, Skipped: 0

[JENKINS] Recording test results
[INFO] 
[INFO] --- maven-jar-plugin:2.4:jar (default-jar) @ activemq-console ---
[INFO] Building jar: <https://builds.apache.org/job/ActiveMQ-Java7-All-UnitTests/ws/activemq-console/target/activemq-console-5.14.0-SNAPSHOT.jar>
[INFO] 
[INFO] --- maven-site-plugin:3.4:attach-descriptor (attach-descriptor) @ activemq-console
---
[INFO] 
[INFO] --- ianal-maven-plugin:1.0-alpha-1:verify-legal-files (default) @ activemq-console
---
[INFO] Checking legal files in: activemq-console-5.14.0-SNAPSHOT.jar
[INFO] 
[INFO] --- maven-install-plugin:2.5.2:install (default-install) @ activemq-console ---
[INFO] Installing <https://builds.apache.org/job/ActiveMQ-Java7-All-UnitTests/ws/activemq-console/target/activemq-console-5.14.0-SNAPSHOT.jar>
to /home/jenkins/jenkins-slave/maven-repositories/0/org/apache/activemq/activemq-console/5.14.0-SNAPSHOT/activemq-console-5.14.0-SNAPSHOT.jar
[INFO] Installing <https://builds.apache.org/job/ActiveMQ-Java7-All-UnitTests/ws/activemq-console/pom.xml>
to /home/jenkins/jenkins-slave/maven-repositories/0/org/apache/activemq/activemq-console/5.14.0-SNAPSHOT/activemq-console-5.14.0-SNAPSHOT.pom
[INFO]                                                                         
[INFO] ------------------------------------------------------------------------
[INFO] Skipping ActiveMQ :: Partition Management
[INFO] This project has been banned from the build due to previous failures.
[INFO] ------------------------------------------------------------------------
[INFO]                                                                         
[INFO] ------------------------------------------------------------------------
[INFO] Skipping ActiveMQ :: Runtime Configuration
[INFO] This project has been banned from the build due to previous failures.
[INFO] ------------------------------------------------------------------------
[INFO]                                                                         
[INFO] ------------------------------------------------------------------------
[INFO] Building ActiveMQ :: Tooling 5.14.0-SNAPSHOT
[INFO] ------------------------------------------------------------------------
[INFO] 
[INFO] --- maven-clean-plugin:2.5:clean (default-clean) @ activemq-tooling ---
[INFO] 
[INFO] --- maven-enforcer-plugin:1.3.1:enforce (default) @ activemq-tooling ---
[INFO] 
[INFO] --- maven-bundle-plugin:2.3.7:cleanVersions (cleanVersions) @ activemq-tooling ---
[INFO] 
[INFO] --- maven-remote-resources-plugin:1.5:process (default) @ activemq-tooling ---
[INFO] 
[INFO] --- maven-site-plugin:3.4:attach-descriptor (attach-descriptor) @ activemq-tooling
---
[INFO] 
[INFO] --- ianal-maven-plugin:1.0-alpha-1:verify-legal-files (default) @ activemq-tooling
---
[INFO] 
[INFO] --- maven-install-plugin:2.5.2:install (default-install) @ activemq-tooling ---
[INFO] Installing <https://builds.apache.org/job/ActiveMQ-Java7-All-UnitTests/ws/activemq-tooling/pom.xml>
to /home/jenkins/jenkins-slave/maven-repositories/0/org/apache/activemq/tooling/activemq-tooling/5.14.0-SNAPSHOT/activemq-tooling-5.14.0-SNAPSHOT.pom
[INFO]                                                                         
[INFO] ------------------------------------------------------------------------
[INFO] Skipping ActiveMQ :: JUnit Rule
[INFO] This project has been banned from the build due to previous failures.
[INFO] ------------------------------------------------------------------------
[INFO]                                                                         
[INFO] ------------------------------------------------------------------------
[INFO] Skipping ActiveMQ :: Unit Tests
[INFO] This project has been banned from the build due to previous failures.
[INFO] ------------------------------------------------------------------------
[INFO] ------------------------------------------------------------------------
[INFO] Reactor Summary:
[INFO] 
[INFO] ActiveMQ .......................................... SUCCESS [  5.233 s]
[INFO] ActiveMQ :: Client ................................ SUCCESS [03:19 min]
[INFO] ActiveMQ :: Openwire Legacy Support ............... SUCCESS [  3.980 s]
[INFO] ActiveMQ :: JAAS .................................. SUCCESS [ 18.325 s]
[INFO] ActiveMQ :: Broker ................................ SUCCESS [01:31 min]
[INFO] ActiveMQ :: KahaDB Store .......................... SUCCESS [02:26 min]
[INFO] ActiveMQ :: STOMP Protocol ........................ SUCCESS [13:24 min]
[INFO] ActiveMQ :: MQTT Protocol ......................... SUCCESS [22:41 min]
[INFO] ActiveMQ :: JDBC Store ............................ SUCCESS [  3.647 s]
[INFO] ActiveMQ :: LevelDB Store ......................... FAILURE [ 18.651 s]
[INFO] ActiveMQ :: Generic JMS Pool ...................... SUCCESS [ 43.278 s]
[INFO] ActiveMQ :: Pool .................................. SUCCESS [  4.863 s]
[INFO] ActiveMQ :: RA .................................... SUCCESS [03:17 min]
[INFO] ActiveMQ :: Spring ................................ SKIPPED
[INFO] ActiveMQ :: Console ............................... SUCCESS [  6.752 s]
[INFO] ActiveMQ :: Partition Management .................. SKIPPED
[INFO] ActiveMQ :: Runtime Configuration ................. SKIPPED
[INFO] ActiveMQ :: Tooling ............................... SUCCESS [  0.786 s]
[INFO] ActiveMQ :: JUnit Rule ............................ SKIPPED
[INFO] ActiveMQ :: Unit Tests ............................ SKIPPED
[INFO] ------------------------------------------------------------------------
[INFO] BUILD FAILURE
[INFO] ------------------------------------------------------------------------
[INFO] Total time: 49:05 min
[INFO] Finished at: 2016-07-26T19:57:50+00:00
[INFO] Final Memory: 77M/1194M
[INFO] ------------------------------------------------------------------------
[ERROR] Failed to execute goal net.alchim31.maven:scala-maven-plugin:3.1.0:compile (default)
on project activemq-leveldb-store: wrap: org.apache.commons.exec.ExecuteException: Process
exited with an error: 1(Exit value: 1) -> [Help 1]
org.apache.maven.lifecycle.LifecycleExecutionException: Failed to execute goal net.alchim31.maven:scala-maven-plugin:3.1.0:compile
(default) on project activemq-leveldb-store: wrap: org.apache.commons.exec.ExecuteException:
Process exited with an error: 1(Exit value: 1)
	at org.apache.maven.lifecycle.internal.MojoExecutor.execute(MojoExecutor.java:216)
	at org.apache.maven.lifecycle.internal.MojoExecutor.execute(MojoExecutor.java:153)
	at org.apache.maven.lifecycle.internal.MojoExecutor.execute(MojoExecutor.java:145)
	at org.apache.maven.lifecycle.internal.LifecycleModuleBuilder.buildProject(LifecycleModuleBuilder.java:108)
	at org.apache.maven.lifecycle.internal.LifecycleModuleBuilder.buildProject(LifecycleModuleBuilder.java:76)
	at org.apache.maven.lifecycle.internal.builder.singlethreaded.SingleThreadedBuilder.build(SingleThreadedBuilder.java:51)
	at org.apache.maven.lifecycle.internal.LifecycleStarter.execute(LifecycleStarter.java:116)
	at org.apache.maven.DefaultMaven.doExecute(DefaultMaven.java:361)
	at org.apache.maven.DefaultMaven.execute(DefaultMaven.java:155)
	at org.jvnet.hudson.maven3.launcher.Maven32Launcher.main(Maven32Launcher.java:132)
	at sun.reflect.NativeMethodAccessorImpl.invoke0(Native Method)
	at sun.reflect.NativeMethodAccessorImpl.invoke(NativeMethodAccessorImpl.java:57)
	at sun.reflect.DelegatingMethodAccessorImpl.invoke(DelegatingMethodAccessorImpl.java:43)
	at java.lang.reflect.Method.invoke(Method.java:606)
	at org.codehaus.plexus.classworlds.launcher.Launcher.launchStandard(Launcher.java:330)
	at org.codehaus.plexus.classworlds.launcher.Launcher.launch(Launcher.java:238)
	at jenkins.maven3.agent.Maven32Main.launch(Maven32Main.java:186)
	at sun.reflect.NativeMethodAccessorImpl.invoke0(Native Method)
	at sun.reflect.NativeMethodAccessorImpl.invoke(NativeMethodAccessorImpl.java:57)
	at sun.reflect.DelegatingMethodAccessorImpl.invoke(DelegatingMethodAccessorImpl.java:43)
	at java.lang.reflect.Method.invoke(Method.java:606)
	at hudson.maven.Maven3Builder.call(Maven3Builder.java:136)
	at hudson.maven.Maven3Builder.call(Maven3Builder.java:71)
	at hudson.remoting.UserRequest.perform(UserRequest.java:120)
	at hudson.remoting.UserRequest.perform(UserRequest.java:48)
	at hudson.remoting.Request$2.run(Request.java:326)
	at hudson.remoting.InterceptingExecutorService$1.call(InterceptingExecutorService.java:68)
	at java.util.concurrent.FutureTask.run(FutureTask.java:262)
	at java.util.concurrent.ThreadPoolExecutor.runWorker(ThreadPoolExecutor.java:1145)
	at java.util.concurrent.ThreadPoolExecutor$Worker.run(ThreadPoolExecutor.java:615)
	at java.lang.Thread.run(Thread.java:745)
Caused by: org.apache.maven.plugin.MojoExecutionException: wrap: org.apache.commons.exec.ExecuteException:
Process exited with an error: 1(Exit value: 1)
	at scala_maven.ScalaMojoSupport.execute(ScalaMojoSupport.java:408)
	at org.apache.maven.plugin.DefaultBuildPluginManager.executeMojo(DefaultBuildPluginManager.java:133)
	at org.apache.maven.lifecycle.internal.MojoExecutor.execute(MojoExecutor.java:208)
	... 30 more
Caused by: org.apache.commons.exec.ExecuteException: Process exited with an error: 1(Exit
value: 1)
	at org.apache.commons.exec.DefaultExecutor.executeInternal(DefaultExecutor.java:346)
	at org.apache.commons.exec.DefaultExecutor.execute(DefaultExecutor.java:149)
	at org.apache.commons.exec.DefaultExecutor.execute(DefaultExecutor.java:136)
	at scala_maven_executions.JavaMainCallerByFork.run(JavaMainCallerByFork.java:99)
	at scala_maven.ScalaCompilerSupport.compile(ScalaCompilerSupport.java:149)
	at scala_maven.ScalaCompilerSupport.doExecute(ScalaCompilerSupport.java:99)
	at scala_maven.ScalaMojoSupport.execute(ScalaMojoSupport.java:400)
	... 32 more
[ERROR] 
[ERROR] Re-run Maven using the -X switch to enable full debug logging.
[ERROR] 
[ERROR] For more information about the errors and possible solutions, please read the following
articles:
[ERROR] [Help 1] http://cwiki.apache.org/confluence/display/MAVEN/MojoExecutionException
[ERROR] 
[ERROR] After correcting the problems, you can resume the build with the command
[ERROR]   mvn <goals> -rf :activemq-leveldb-store
[JENKINS] Archiving <https://builds.apache.org/job/ActiveMQ-Java7-All-UnitTests/ws/activemq-unit-tests/pom.xml>
to org.apache.activemq/activemq-unit-tests/5.14.0-SNAPSHOT/activemq-unit-tests-5.14.0-SNAPSHOT.pom
Compressed 71.24 KB of artifacts by 44.9% relative to #490
[JENKINS] Archiving <https://builds.apache.org/job/ActiveMQ-Java7-All-UnitTests/ws/activemq-openwire-legacy/pom.xml>
to org.apache.activemq/activemq-openwire-legacy/5.14.0-SNAPSHOT/activemq-openwire-legacy-5.14.0-SNAPSHOT.pom
[JENKINS] Archiving <https://builds.apache.org/job/ActiveMQ-Java7-All-UnitTests/ws/activemq-openwire-legacy/target/activemq-openwire-legacy-5.14.0-SNAPSHOT.jar>
to org.apache.activemq/activemq-openwire-legacy/5.14.0-SNAPSHOT/activemq-openwire-legacy-5.14.0-SNAPSHOT.jar
[JENKINS] Archiving <https://builds.apache.org/job/ActiveMQ-Java7-All-UnitTests/ws/activemq-jdbc-store/pom.xml>
to org.apache.activemq/activemq-jdbc-store/5.14.0-SNAPSHOT/activemq-jdbc-store-5.14.0-SNAPSHOT.pom
[JENKINS] Archiving <https://builds.apache.org/job/ActiveMQ-Java7-All-UnitTests/ws/activemq-jdbc-store/target/activemq-jdbc-store-5.14.0-SNAPSHOT.jar>
to org.apache.activemq/activemq-jdbc-store/5.14.0-SNAPSHOT/activemq-jdbc-store-5.14.0-SNAPSHOT.jar
[JENKINS] Archiving <https://builds.apache.org/job/ActiveMQ-Java7-All-UnitTests/ws/activemq-jms-pool/pom.xml>
to org.apache.activemq/activemq-jms-pool/5.14.0-SNAPSHOT/activemq-jms-pool-5.14.0-SNAPSHOT.pom
[JENKINS] Archiving <https://builds.apache.org/job/ActiveMQ-Java7-All-UnitTests/ws/activemq-jms-pool/target/activemq-jms-pool-5.14.0-SNAPSHOT.jar>
to org.apache.activemq/activemq-jms-pool/5.14.0-SNAPSHOT/activemq-jms-pool-5.14.0-SNAPSHOT.jar
[JENKINS] Archiving <https://builds.apache.org/job/ActiveMQ-Java7-All-UnitTests/ws/activemq-tooling/activemq-junit/pom.xml>
to org.apache.activemq.tooling/activemq-junit/5.14.0-SNAPSHOT/activemq-junit-5.14.0-SNAPSHOT.pom
[JENKINS] Archiving <https://builds.apache.org/job/ActiveMQ-Java7-All-UnitTests/ws/activemq-runtime-config/pom.xml>
to org.apache.activemq/activemq-runtime-config/5.14.0-SNAPSHOT/activemq-runtime-config-5.14.0-SNAPSHOT.pom
[JENKINS] Archiving <https://builds.apache.org/job/ActiveMQ-Java7-All-UnitTests/ws/activemq-pool/pom.xml>
to org.apache.activemq/activemq-pool/5.14.0-SNAPSHOT/activemq-pool-5.14.0-SNAPSHOT.pom
[JENKINS] Archiving <https://builds.apache.org/job/ActiveMQ-Java7-All-UnitTests/ws/activemq-pool/target/activemq-pool-5.14.0-SNAPSHOT.jar>
to org.apache.activemq/activemq-pool/5.14.0-SNAPSHOT/activemq-pool-5.14.0-SNAPSHOT.jar
[JENKINS] Archiving <https://builds.apache.org/job/ActiveMQ-Java7-All-UnitTests/ws/activemq-stomp/pom.xml>
to org.apache.activemq/activemq-stomp/5.14.0-SNAPSHOT/activemq-stomp-5.14.0-SNAPSHOT.pom
[JENKINS] Archiving <https://builds.apache.org/job/ActiveMQ-Java7-All-UnitTests/ws/activemq-stomp/target/activemq-stomp-5.14.0-SNAPSHOT.jar>
to org.apache.activemq/activemq-stomp/5.14.0-SNAPSHOT/activemq-stomp-5.14.0-SNAPSHOT.jar
[JENKINS] Archiving <https://builds.apache.org/job/ActiveMQ-Java7-All-UnitTests/ws/activemq-mqtt/pom.xml>
to org.apache.activemq/activemq-mqtt/5.14.0-SNAPSHOT/activemq-mqtt-5.14.0-SNAPSHOT.pom
[JENKINS] Archiving <https://builds.apache.org/job/ActiveMQ-Java7-All-UnitTests/ws/activemq-mqtt/target/activemq-mqtt-5.14.0-SNAPSHOT.jar>
to org.apache.activemq/activemq-mqtt/5.14.0-SNAPSHOT/activemq-mqtt-5.14.0-SNAPSHOT.jar
[JENKINS] Archiving <https://builds.apache.org/job/ActiveMQ-Java7-All-UnitTests/ws/activemq-console/pom.xml>
to org.apache.activemq/activemq-console/5.14.0-SNAPSHOT/activemq-console-5.14.0-SNAPSHOT.pom
[JENKINS] Archiving <https://builds.apache.org/job/ActiveMQ-Java7-All-UnitTests/ws/activemq-console/target/activemq-console-5.14.0-SNAPSHOT.jar>
to org.apache.activemq/activemq-console/5.14.0-SNAPSHOT/activemq-console-5.14.0-SNAPSHOT.jar
[JENKINS] Archiving <https://builds.apache.org/job/ActiveMQ-Java7-All-UnitTests/ws/activemq-client/pom.xml>
to org.apache.activemq/activemq-client/5.14.0-SNAPSHOT/activemq-client-5.14.0-SNAPSHOT.pom
[JENKINS] Archiving <https://builds.apache.org/job/ActiveMQ-Java7-All-UnitTests/ws/activemq-client/target/activemq-client-5.14.0-SNAPSHOT.jar>
to org.apache.activemq/activemq-client/5.14.0-SNAPSHOT/activemq-client-5.14.0-SNAPSHOT.jar
[JENKINS] Archiving <https://builds.apache.org/job/ActiveMQ-Java7-All-UnitTests/ws/pom.xml>
to org.apache.activemq/activemq-parent/5.14.0-SNAPSHOT/activemq-parent-5.14.0-SNAPSHOT.pom
Compressed 59.36 KB of artifacts by 53.9% relative to #490
[JENKINS] Archiving <https://builds.apache.org/job/ActiveMQ-Java7-All-UnitTests/ws/activemq-broker/pom.xml>
to org.apache.activemq/activemq-broker/5.14.0-SNAPSHOT/activemq-broker-5.14.0-SNAPSHOT.pom
[JENKINS] Archiving <https://builds.apache.org/job/ActiveMQ-Java7-All-UnitTests/ws/activemq-broker/target/activemq-broker-5.14.0-SNAPSHOT.jar>
to org.apache.activemq/activemq-broker/5.14.0-SNAPSHOT/activemq-broker-5.14.0-SNAPSHOT.jar
[JENKINS] Archiving <https://builds.apache.org/job/ActiveMQ-Java7-All-UnitTests/ws/activemq-broker/target/activemq-broker-5.14.0-SNAPSHOT-tests.jar>
to org.apache.activemq/activemq-broker/5.14.0-SNAPSHOT/activemq-broker-5.14.0-SNAPSHOT-tests.jar
[JENKINS] Archiving <https://builds.apache.org/job/ActiveMQ-Java7-All-UnitTests/ws/activemq-ra/pom.xml>
to org.apache.activemq/activemq-ra/5.14.0-SNAPSHOT/activemq-ra-5.14.0-SNAPSHOT.pom
[JENKINS] Archiving <https://builds.apache.org/job/ActiveMQ-Java7-All-UnitTests/ws/activemq-ra/target/activemq-ra-5.14.0-SNAPSHOT.jar>
to org.apache.activemq/activemq-ra/5.14.0-SNAPSHOT/activemq-ra-5.14.0-SNAPSHOT.jar
[JENKINS] Archiving <https://builds.apache.org/job/ActiveMQ-Java7-All-UnitTests/ws/activemq-ra/target/xbean/activemq-ra.xsd>
to org.apache.activemq/activemq-ra/5.14.0-SNAPSHOT/activemq-ra-5.14.0-SNAPSHOT.xsd
[JENKINS] Archiving <https://builds.apache.org/job/ActiveMQ-Java7-All-UnitTests/ws/activemq-ra/target/xbean/activemq-ra.xsd.html>
to org.apache.activemq/activemq-ra/5.14.0-SNAPSHOT/activemq-ra-5.14.0-SNAPSHOT-schema.html
[JENKINS] Archiving <https://builds.apache.org/job/ActiveMQ-Java7-All-UnitTests/ws/activemq-ra/target/xbean/activemq-ra.xsd.html>
to org.apache.activemq/activemq-ra/5.14.0-SNAPSHOT/activemq-ra-5.14.0-SNAPSHOT.xsd.html
[JENKINS] Archiving <https://builds.apache.org/job/ActiveMQ-Java7-All-UnitTests/ws/activemq-spring/pom.xml>
to org.apache.activemq/activemq-spring/5.14.0-SNAPSHOT/activemq-spring-5.14.0-SNAPSHOT.pom
[JENKINS] Archiving <https://builds.apache.org/job/ActiveMQ-Java7-All-UnitTests/ws/activemq-kahadb-store/pom.xml>
to org.apache.activemq/activemq-kahadb-store/5.14.0-SNAPSHOT/activemq-kahadb-store-5.14.0-SNAPSHOT.pom
[JENKINS] Archiving <https://builds.apache.org/job/ActiveMQ-Java7-All-UnitTests/ws/activemq-kahadb-store/target/activemq-kahadb-store-5.14.0-SNAPSHOT.jar>
to org.apache.activemq/activemq-kahadb-store/5.14.0-SNAPSHOT/activemq-kahadb-store-5.14.0-SNAPSHOT.jar
[JENKINS] Archiving <https://builds.apache.org/job/ActiveMQ-Java7-All-UnitTests/ws/activemq-jaas/pom.xml>
to org.apache.activemq/activemq-jaas/5.14.0-SNAPSHOT/activemq-jaas-5.14.0-SNAPSHOT.pom
[JENKINS] Archiving <https://builds.apache.org/job/ActiveMQ-Java7-All-UnitTests/ws/activemq-jaas/target/activemq-jaas-5.14.0-SNAPSHOT.jar>
to org.apache.activemq/activemq-jaas/5.14.0-SNAPSHOT/activemq-jaas-5.14.0-SNAPSHOT.jar
[JENKINS] Archiving <https://builds.apache.org/job/ActiveMQ-Java7-All-UnitTests/ws/activemq-tooling/pom.xml>
to org.apache.activemq.tooling/activemq-tooling/5.14.0-SNAPSHOT/activemq-tooling-5.14.0-SNAPSHOT.pom
[JENKINS] Archiving <https://builds.apache.org/job/ActiveMQ-Java7-All-UnitTests/ws/activemq-partition/pom.xml>
to org.apache.activemq/activemq-partition/5.14.0-SNAPSHOT/activemq-partition-5.14.0-SNAPSHOT.pom
[JENKINS] Archiving <https://builds.apache.org/job/ActiveMQ-Java7-All-UnitTests/ws/activemq-leveldb-store/pom.xml>
to org.apache.activemq/activemq-leveldb-store/5.14.0-SNAPSHOT/activemq-leveldb-store-5.14.0-SNAPSHOT.pom
[locks-and-latches] Releasing all the locks
[locks-and-latches] All the locks released
channel stopped

Mime
View raw message