activemq-commits mailing list archives

Site index · List index
Message view « Date » · « Thread »
Top « Date » · « Thread »
From Apache Jenkins Server <jenk...@builds.apache.org>
Subject Build failed in Jenkins: ActiveMQ-Artemis-Master #483
Date Mon, 06 Jun 2016 20:06:24 GMT
See <https://builds.apache.org/job/ActiveMQ-Artemis-Master/483/changes>

Changes:

[clebertsuconic] Revert "ARTEMIS-539"

[clebertsuconic] ARTEMIS-539 Proper fix on default address for core protocol

------------------------------------------
[...truncated 13697 lines...]
#test testCreateConnectionFactoryThrowsException
[main] 20:05:27,351 INFO  [org.apache.activemq.artemis.core.server] #*#*# Finished test: testCreateConnectionFactoryThrowsException()...
[main] 20:05:27,351 INFO  [org.apache.activemq.artemis.core.server] #*#*# Starting test: testCreateConnectionFactoryMultipleConnectorsOverrideAndParams()...
#test testCreateConnectionFactoryMultipleConnectorsOverrideAndParams
[main] 20:05:27,355 INFO  [org.apache.activemq.artemis.core.server] #*#*# Finished test: testCreateConnectionFactoryMultipleConnectorsOverrideAndParams()...
[main] 20:05:27,356 INFO  [org.apache.activemq.artemis.core.server] #*#*# Starting test: test2DefaultConnectionFactorySame()...
#test test2DefaultConnectionFactorySame
[main] 20:05:27,359 INFO  [org.apache.activemq.artemis.core.server] #*#*# Finished test: test2DefaultConnectionFactorySame()...
Tests run: 15, Failures: 0, Errors: 0, Skipped: 0, Time elapsed: 2.382 sec - in org.apache.activemq.artemis.tests.unit.ra.ResourceAdapterTest
Running org.apache.activemq.artemis.tests.unit.util.ActiveMQBufferInputStreamTest
[main] 20:05:27,363 INFO  [org.apache.activemq.artemis.core.server] #*#*# Starting test: testReadBytes()...
#test testReadBytes
[main] 20:05:27,371 INFO  [org.apache.activemq.artemis.core.server] #*#*# Finished test: testReadBytes()...
Tests run: 1, Failures: 0, Errors: 0, Skipped: 0, Time elapsed: 0.011 sec - in org.apache.activemq.artemis.tests.unit.util.ActiveMQBufferInputStreamTest
Running org.apache.activemq.artemis.tests.unit.util.LinkedListTest
[main] 20:05:27,374 INFO  [org.apache.activemq.artemis.core.server] #*#*# Starting test: testAddHead()...
#test testAddHead
[main] 20:05:27,377 INFO  [org.apache.activemq.artemis.core.server] #*#*# Finished test: testAddHead()...
[main] 20:05:27,378 INFO  [org.apache.activemq.artemis.core.server] #*#*# Starting test: testAddTail()...
#test testAddTail
[main] 20:05:27,381 INFO  [org.apache.activemq.artemis.core.server] #*#*# Finished test: testAddTail()...
[main] 20:05:27,382 INFO  [org.apache.activemq.artemis.core.server] #*#*# Starting test: testAddHeadAndTail()...
#test testAddHeadAndTail
[main] 20:05:27,385 INFO  [org.apache.activemq.artemis.core.server] #*#*# Finished test: testAddHeadAndTail()...
[main] 20:05:27,386 INFO  [org.apache.activemq.artemis.core.server] #*#*# Starting test: testCreateIteratorAfterAddElements()...
#test testCreateIteratorAfterAddElements
[main] 20:05:27,389 INFO  [org.apache.activemq.artemis.core.server] #*#*# Finished test: testCreateIteratorAfterAddElements()...
[main] 20:05:27,390 INFO  [org.apache.activemq.artemis.core.server] #*#*# Starting test: testClear()...
#test testClear
[main] 20:05:27,399 INFO  [org.apache.activemq.artemis.core.server] #*#*# Finished test: testClear()...
[main] 20:05:27,400 INFO  [org.apache.activemq.artemis.core.server] #*#*# Starting test: testPoll()...
#test testPoll
[main] 20:05:27,405 INFO  [org.apache.activemq.artemis.core.server] #*#*# Finished test: testPoll()...
[main] 20:05:27,406 INFO  [org.apache.activemq.artemis.core.server] #*#*# Starting test: testRemoveHead1()...
#test testRemoveHead1
[main] 20:05:27,414 INFO  [org.apache.activemq.artemis.core.server] #*#*# Finished test: testRemoveHead1()...
[main] 20:05:27,415 INFO  [org.apache.activemq.artemis.core.server] #*#*# Starting test: testRemoveHead2()...
#test testRemoveHead2
[main] 20:05:27,418 INFO  [org.apache.activemq.artemis.core.server] #*#*# Finished test: testRemoveHead2()...
[main] 20:05:27,419 INFO  [org.apache.activemq.artemis.core.server] #*#*# Starting test: testRemoveHead3()...
#test testRemoveHead3
[main] 20:05:27,424 INFO  [org.apache.activemq.artemis.core.server] #*#*# Finished test: testRemoveHead3()...
[main] 20:05:27,424 INFO  [org.apache.activemq.artemis.core.server] #*#*# Starting test: testRemoveTail1()...
#test testRemoveTail1
[main] 20:05:27,428 INFO  [org.apache.activemq.artemis.core.server] #*#*# Finished test: testRemoveTail1()...
[main] 20:05:27,428 INFO  [org.apache.activemq.artemis.core.server] #*#*# Starting test: testRemoveTail2()...
#test testRemoveTail2
[main] 20:05:27,432 INFO  [org.apache.activemq.artemis.core.server] #*#*# Finished test: testRemoveTail2()...
[main] 20:05:27,433 INFO  [org.apache.activemq.artemis.core.server] #*#*# Starting test: testRemoveTail3()...
#test testRemoveTail3
[main] 20:05:27,436 INFO  [org.apache.activemq.artemis.core.server] #*#*# Finished test: testRemoveTail3()...
[main] 20:05:27,437 INFO  [org.apache.activemq.artemis.core.server] #*#*# Starting test: testRemoveInTurn()...
#test testRemoveInTurn
[main] 20:05:27,440 INFO  [org.apache.activemq.artemis.core.server] #*#*# Finished test: testRemoveInTurn()...
[main] 20:05:27,441 INFO  [org.apache.activemq.artemis.core.server] #*#*# Starting test: testRemoveMiddle()...
#test testRemoveMiddle
[main] 20:05:27,444 INFO  [org.apache.activemq.artemis.core.server] #*#*# Finished test: testRemoveMiddle()...
[main] 20:05:27,445 INFO  [org.apache.activemq.artemis.core.server] #*#*# Starting test: testAddHeadAndRemove()...
#test testAddHeadAndRemove
Jumping 500
[main] 20:05:27,450 INFO  [org.apache.activemq.artemis.core.server] #test forceGC
[main] 20:05:27,570 INFO  [org.apache.activemq.artemis.core.server] #test forceGC Done 
[main] 20:05:27,574 INFO  [org.apache.activemq.artemis.core.server] #*#*# Finished test: testAddHeadAndRemove()...
[main] 20:05:27,575 INFO  [org.apache.activemq.artemis.core.server] #*#*# Starting test: testMultipleIterators1()...
#test testMultipleIterators1
[main] 20:05:27,581 INFO  [org.apache.activemq.artemis.core.server] #*#*# Finished test: testMultipleIterators1()...
[main] 20:05:27,581 INFO  [org.apache.activemq.artemis.core.server] #*#*# Starting test: testMultipleIterators2()...
#test testMultipleIterators2
[main] 20:05:27,585 INFO  [org.apache.activemq.artemis.core.server] #*#*# Finished test: testMultipleIterators2()...
[main] 20:05:27,586 INFO  [org.apache.activemq.artemis.core.server] #*#*# Starting test: testResizing()...
#test testResizing
[main] 20:05:27,596 INFO  [org.apache.activemq.artemis.core.server] #*#*# Finished test: testResizing()...
[main] 20:05:27,596 INFO  [org.apache.activemq.artemis.core.server] #*#*# Starting test: testRepeatAndRemove()...
#test testRepeatAndRemove
[main] 20:05:27,600 INFO  [org.apache.activemq.artemis.core.server] #*#*# Finished test: testRepeatAndRemove()...
[main] 20:05:27,601 INFO  [org.apache.activemq.artemis.core.server] #*#*# Starting test: testIterateNoElements()...
#test testIterateNoElements
[main] 20:05:27,605 INFO  [org.apache.activemq.artemis.core.server] #*#*# Finished test: testIterateNoElements()...
[main] 20:05:27,605 INFO  [org.apache.activemq.artemis.core.server] #*#*# Starting test: testAddAndRemove()...
#test testAddAndRemove
[main] 20:05:27,614 INFO  [org.apache.activemq.artemis.core.server] #test forceGC
[main] 20:05:27,772 INFO  [org.apache.activemq.artemis.core.server] #test forceGC Done 
[main] 20:05:27,773 INFO  [org.apache.activemq.artemis.core.server] #test forceGC
[main] 20:05:27,840 INFO  [org.apache.activemq.artemis.core.server] #test forceGC Done 
[main] 20:05:28,237 INFO  [org.apache.activemq.artemis.core.server] #test forceGC
[main] 20:05:30,994 INFO  [org.apache.activemq.artemis.core.server] #test forceGC Done 
[main] 20:05:30,994 INFO  [org.apache.activemq.artemis.core.server] #test forceGC
[main] 20:05:31,228 INFO  [org.apache.activemq.artemis.core.server] #test forceGC Done 
[main] 20:05:31,228 INFO  [org.apache.activemq.artemis.core.server] #test forceGC
[main] 20:05:31,387 INFO  [org.apache.activemq.artemis.core.server] #test forceGC Done 
[main] 20:05:31,387 INFO  [org.apache.activemq.artemis.core.server] #test forceGC
[main] 20:05:31,541 INFO  [org.apache.activemq.artemis.core.server] #test forceGC Done 
[main] 20:05:33,115 INFO  [org.apache.activemq.artemis.core.server] #test forceGC
[main] 20:05:33,521 INFO  [org.apache.activemq.artemis.core.server] #test forceGC Done 
[main] 20:05:34,200 INFO  [org.apache.activemq.artemis.core.server] #test forceGC
[main] 20:05:34,319 INFO  [org.apache.activemq.artemis.core.server] #test forceGC Done 
[main] 20:05:34,319 INFO  [org.apache.activemq.artemis.core.server] #test forceGC
[main] 20:05:34,389 INFO  [org.apache.activemq.artemis.core.server] #test forceGC Done 
[main] 20:05:35,290 INFO  [org.apache.activemq.artemis.core.server] #test forceGC
[main] 20:05:35,431 INFO  [org.apache.activemq.artemis.core.server] #test forceGC Done 
[main] 20:05:36,333 INFO  [org.apache.activemq.artemis.core.server] #test forceGC
[main] 20:05:36,490 INFO  [org.apache.activemq.artemis.core.server] #test forceGC Done 
[main] 20:05:36,491 INFO  [org.apache.activemq.artemis.core.server] #test forceGC
[main] 20:05:36,552 INFO  [org.apache.activemq.artemis.core.server] #test forceGC Done 
[main] 20:05:36,555 INFO  [org.apache.activemq.artemis.core.server] #*#*# Finished test: testAddAndRemove()...
[main] 20:05:36,555 INFO  [org.apache.activemq.artemis.core.server] #*#*# Starting test: testRemoveHeadAndTail1()...
#test testRemoveHeadAndTail1
[main] 20:05:36,560 INFO  [org.apache.activemq.artemis.core.server] #*#*# Finished test: testRemoveHeadAndTail1()...
[main] 20:05:36,561 INFO  [org.apache.activemq.artemis.core.server] #*#*# Starting test: testRemoveHeadAndTail2()...
#test testRemoveHeadAndTail2
[main] 20:05:36,566 INFO  [org.apache.activemq.artemis.core.server] #*#*# Finished test: testRemoveHeadAndTail2()...
[main] 20:05:36,567 INFO  [org.apache.activemq.artemis.core.server] #*#*# Starting test: testRemoveHeadAndTail3()...
#test testRemoveHeadAndTail3
[main] 20:05:36,572 INFO  [org.apache.activemq.artemis.core.server] #*#*# Finished test: testRemoveHeadAndTail3()...
[main] 20:05:36,573 INFO  [org.apache.activemq.artemis.core.server] #*#*# Starting test: testRepeat()...
#test testRepeat
[main] 20:05:36,579 INFO  [org.apache.activemq.artemis.core.server] #*#*# Finished test: testRepeat()...
[main] 20:05:36,583 INFO  [org.apache.activemq.artemis.core.server] #*#*# Starting test: testCreateIteratorBeforeAddElements()...
#test testCreateIteratorBeforeAddElements
[main] 20:05:36,587 INFO  [org.apache.activemq.artemis.core.server] #*#*# Finished test: testCreateIteratorBeforeAddElements()...
[main] 20:05:36,588 INFO  [org.apache.activemq.artemis.core.server] #*#*# Starting test: testRemoveAll()...
#test testRemoveAll
[main] 20:05:36,592 INFO  [org.apache.activemq.artemis.core.server] #*#*# Finished test: testRemoveAll()...
[main] 20:05:36,593 INFO  [org.apache.activemq.artemis.core.server] #*#*# Starting test: testRemoveOdd()...
#test testRemoveOdd
[main] 20:05:36,596 INFO  [org.apache.activemq.artemis.core.server] #*#*# Finished test: testRemoveOdd()...
[main] 20:05:36,597 INFO  [org.apache.activemq.artemis.core.server] #*#*# Starting test: testIterateThenAddMoreAndIterateAgain()...
#test testIterateThenAddMoreAndIterateAgain
[main] 20:05:36,602 INFO  [org.apache.activemq.artemis.core.server] #*#*# Finished test: testIterateThenAddMoreAndIterateAgain()...
Tests run: 29, Failures: 0, Errors: 0, Skipped: 0, Time elapsed: 9.229 sec - in org.apache.activemq.artemis.tests.unit.util.LinkedListTest
Running org.apache.activemq.artemis.tests.unit.util.MemorySizeTest
[main] 20:05:45,220 WARN  [org.apache.activemq.artemis.core.client] AMQ212047: Warning: JVM
allocated more data what would make results invalid 2,075,131,904:1,950,875,648
[main] 20:05:45,221 INFO  [org.apache.activemq.artemis.tests.unit] Server message size is
1264
[main] 20:05:53,703 WARN  [org.apache.activemq.artemis.core.client] AMQ212047: Warning: JVM
allocated more data what would make results invalid 1,771,044,864:1,607,991,296
[main] 20:05:53,703 INFO  [org.apache.activemq.artemis.tests.unit] Message reference size
is 64
Tests run: 1, Failures: 0, Errors: 0, Skipped: 0, Time elapsed: 17.102 sec - in org.apache.activemq.artemis.tests.unit.util.MemorySizeTest
Running org.apache.activemq.artemis.tests.unit.util.ObjectInputStreamWithClassLoaderTest
[main] 20:05:53,705 INFO  [org.apache.activemq.artemis.core.server] #*#*# Starting test: testClassLoaderIsolationWithProxy()...
#test testClassLoaderIsolationWithProxy
Deserialized Object org.apache.activemq.artemis.tests.unit.util.ObjectInputStreamWithClassLoaderTest$AnObjectImpl@633a2e99
[main] 20:05:53,757 INFO  [org.apache.activemq.artemis.core.server] #*#*# Finished test: testClassLoaderIsolationWithProxy()...
[main] 20:05:53,758 INFO  [org.apache.activemq.artemis.core.server] #*#*# Starting test: testClassLoaderIsolation()...
#test testClassLoaderIsolation
[main] 20:05:53,773 INFO  [org.apache.activemq.artemis.core.server] #*#*# Finished test: testClassLoaderIsolation()...
Tests run: 2, Failures: 0, Errors: 0, Skipped: 0, Time elapsed: 0.067 sec - in org.apache.activemq.artemis.tests.unit.util.ObjectInputStreamWithClassLoaderTest
Running org.apache.activemq.artemis.tests.unit.util.ReusableLatchTest
[main] 20:05:53,776 INFO  [org.apache.activemq.artemis.core.server] #*#*# Starting test: testLatchWithParameterizedDown()...
#test testLatchWithParameterizedDown
[main] 20:05:53,780 INFO  [org.apache.activemq.artemis.core.server] #*#*# Finished test: testLatchWithParameterizedDown()...
[main] 20:05:53,781 INFO  [org.apache.activemq.artemis.core.server] #*#*# Starting test: testLatchOnSingleThread()...
#test testLatchOnSingleThread
[main] 20:05:53,787 INFO  [org.apache.activemq.artemis.core.server] #*#*# Finished test: testLatchOnSingleThread()...
[main] 20:05:53,787 INFO  [org.apache.activemq.artemis.core.server] #*#*# Starting test: testReuseLatch()...
#test testReuseLatch
[main] 20:05:53,798 INFO  [org.apache.activemq.artemis.core.server] #*#*# Finished test: testReuseLatch()...
[main] 20:05:53,799 INFO  [org.apache.activemq.artemis.core.server] #*#*# Starting test: testLatchOnMultiThread()...
#test testLatchOnMultiThread
[main] 20:05:54,013 INFO  [org.apache.activemq.artemis.core.server] #*#*# Finished test: testLatchOnMultiThread()...
Tests run: 4, Failures: 0, Errors: 0, Skipped: 0, Time elapsed: 0.239 sec - in org.apache.activemq.artemis.tests.unit.util.ReusableLatchTest
Running org.apache.activemq.artemis.tests.unit.util.SoftValueMapTest
[main] 20:05:54,016 INFO  [org.apache.activemq.artemis.core.server] #*#*# Starting test: testEvictionsLeastUsed()...
#test testEvictionsLeastUsed
[main] 20:05:54,018 INFO  [org.apache.activemq.artemis.core.server] #test forceGC
[main] 20:05:54,125 INFO  [org.apache.activemq.artemis.core.server] #test forceGC Done 
SoftCache.size 200
Soft cache has 200 elements
[main] 20:05:54,130 INFO  [org.apache.activemq.artemis.core.server] #*#*# Finished test: testEvictionsLeastUsed()...
[main] 20:05:54,131 INFO  [org.apache.activemq.artemis.core.server] #*#*# Starting test: testEvictions()...
#test testEvictions
[main] 20:05:54,133 INFO  [org.apache.activemq.artemis.core.server] #test forceGC
[main] 20:05:54,205 INFO  [org.apache.activemq.artemis.core.server] #test forceGC Done 
Killed

Results :

Tests run: 590, Failures: 0, Errors: 0, Skipped: 0

[INFO] ------------------------------------------------------------------------
[INFO] Reactor Summary:
[INFO] 
[INFO] ActiveMQ Artemis Parent ............................ SUCCESS [ 10.056 s]
[INFO] ActiveMQ Artemis Commons ........................... SUCCESS [ 11.306 s]
[INFO] ActiveMQ Artemis Core Client ....................... SUCCESS [ 11.071 s]
[INFO] ActiveMQ Artemis Selector Implementation ........... SUCCESS [  4.525 s]
[INFO] ActiveMQ Artemis JMS Client ........................ SUCCESS [  4.791 s]
[INFO] ActiveMQ Artemis Native POM ........................ SUCCESS [  5.454 s]
[INFO] ActiveMQ Artemis Journal ........................... SUCCESS [  4.311 s]
[INFO] ActiveMQ Artemis JDBC Store ........................ SUCCESS [  7.709 s]
[INFO] ActiveMQ Artemis Server ............................ SUCCESS [ 55.274 s]
[INFO] ActiveMQ Artemis Protocols ......................... SUCCESS [  0.870 s]
[INFO] ActiveMQ Artemis Proton Protocol ................... SUCCESS [  6.591 s]
[INFO] ActiveMQ Artemis AMQP Protocol ..................... SUCCESS [  4.363 s]
[INFO] ActiveMQ Artemis STOMP Protocol .................... SUCCESS [  2.706 s]
[INFO] ActiveMQ Artemis OpenWire Protocol ................. SUCCESS [  1.617 s]
[INFO] ActiveMQ Artemis HQClient Protocol ................. SUCCESS [  0.821 s]
[INFO] ActiveMQ Artemis HornetQ Protocol .................. SUCCESS [  1.441 s]
[INFO] ActiveMQ Artemis MQTT Protocol ..................... SUCCESS [  3.133 s]
[INFO] ActiveMQ Artemis DTO ............................... SUCCESS [  4.622 s]
[INFO] ActiveMQ Artemis Boot .............................. SUCCESS [  0.601 s]
[INFO] ActiveMQ Artemis Service Extensions ................ SUCCESS [  3.077 s]
[INFO] ActiveMQ Artemis JMS Server ........................ SUCCESS [  4.286 s]
[INFO] ActiveMQ Artemis CLI ............................... SUCCESS [ 25.413 s]
[INFO] ActiveMQ Artemis Web ............................... SUCCESS [  6.569 s]
[INFO] ActiveMQ Artemis Web ............................... SUCCESS [  2.199 s]
[INFO] ActiveMQ Artemis RAR POM ........................... SUCCESS [  3.894 s]
[INFO] ActiveMQ Artemis REST Interface Implementation ..... SUCCESS [01:13 min]
[INFO] ActiveMQ Artemis Maven Plugin ...................... SUCCESS [  5.533 s]
[INFO] ActiveMQ Artemis Server OSGi ....................... SUCCESS [  3.799 s]
[INFO] ActiveMQ Artemis Spring Integration ................ SUCCESS [  2.399 s]
[INFO] ActiveMQ Artemis Aerogear Integration .............. SUCCESS [  2.773 s]
[INFO] ActiveMQ Artemis Vert.x Integration ................ SUCCESS [  2.053 s]
[INFO] Apache ActiveMQ Artemis Distribution ............... SUCCESS [  2.201 s]
[INFO] ActiveMQ Artemis Tests POM ......................... SUCCESS [  5.104 s]
[INFO] ActiveMQ Artemis Unit Tests ........................ FAILURE [01:32 min]
[INFO] ActiveMQ Artemis Joram Tests ....................... SKIPPED
[INFO] ActiveMQ Artemis timing Tests ...................... SKIPPED
[INFO] ActiveMQ Artemis JMS Tests ......................... SKIPPED
[INFO] ActiveMQ Artemis Features .......................... SKIPPED
[INFO] ActiveMQ Artemis Integration Tests ................. SKIPPED
[INFO] ActiveMQ Artemis soak Tests ........................ SKIPPED
[INFO] ActiveMQ Artemis stress Tests ...................... SKIPPED
[INFO] ActiveMQ Artemis performance Tests ................. SKIPPED
[INFO] ActiveMQ Artemis Extra Tests ....................... SKIPPED
[INFO] ------------------------------------------------------------------------
[INFO] BUILD FAILURE
[INFO] ------------------------------------------------------------------------
[INFO] Total time: 06:20 min
[INFO] Finished at: 2016-06-06T20:06:07+00:00
[INFO] Final Memory: 145M/1618M
[INFO] ------------------------------------------------------------------------
[ERROR] Failed to execute goal org.apache.maven.plugins:maven-surefire-plugin:2.18.1:test
(default-test) on project unit-tests: Execution default-test of goal org.apache.maven.plugins:maven-surefire-plugin:2.18.1:test
failed: The forked VM terminated without properly saying goodbye. VM crash or System.exit
called?
[ERROR] Command was /bin/sh -c cd <https://builds.apache.org/job/ActiveMQ-Artemis-Master/ws/tests/unit-tests>
&& /home/jenkins/jenkins-slave/tools/hudson.model.JDK/latest1.8/jre/bin/java -Djava.util.logging.manager=org.jboss.logmanager.LogManager
-Dlogging.configuration=<https://builds.apache.org/job/ActiveMQ-Artemis-Master/ws/tests/unit-tests/../../tests/config/logging.properties>
-Djava.library.path=<https://builds.apache.org/job/ActiveMQ-Artemis-Master/ws/tests/unit-tests/../../artemis-native/bin>
-Djgroups.bind_addr=localhost -Dorg.apache.activemq.artemis.api.core.UDPBroadcastEndpointFactory.localBindAddress=localhost
-Djava.net.preferIPv4Stack=true -jar <https://builds.apache.org/job/ActiveMQ-Artemis-Master/ws/tests/unit-tests/target/surefire/surefirebooter6290099539787622430.jar>
<https://builds.apache.org/job/ActiveMQ-Artemis-Master/ws/tests/unit-tests/target/surefire/surefire456572845005970834tmp>
<https://builds.apache.org/job/ActiveMQ-Artemis-Master/ws/tests/unit-tests/target/surefire/surefire_152967544164585866188tmp>
[ERROR] -> [Help 1]
[ERROR] 
[ERROR] To see the full stack trace of the errors, re-run Maven with the -e switch.
[ERROR] Re-run Maven using the -X switch to enable full debug logging.
[ERROR] 
[ERROR] For more information about the errors and possible solutions, please read the following
articles:
[ERROR] [Help 1] http://cwiki.apache.org/confluence/display/MAVEN/PluginExecutionException
[ERROR] 
[ERROR] After correcting the problems, you can resume the build with the command
[ERROR]   mvn <goals> -rf :unit-tests
Build step 'Invoke top-level Maven targets' marked build as failure
Performing Post build task...
Could not match :Too many files with unapproved license  : False
Logical operation result is FALSE
Skipping script  : cat ratReport.txt
END OF POST BUILD TASK 	: 0
Recording test results

Mime
View raw message