activemq-commits mailing list archives

Site index · List index
Message view « Date » · « Thread »
Top « Date » · « Thread »
From Apache Jenkins Server <jenk...@builds.apache.org>
Subject Build failed in Jenkins: ActiveMQ-Artemis-Master #363
Date Thu, 18 Feb 2016 18:26:40 GMT
See <https://builds.apache.org/job/ActiveMQ-Artemis-Master/363/changes>

Changes:

[jbertram] ARTEMIS-391 log WARN on cxn limit

------------------------------------------
[...truncated 13860 lines...]
	at org.junit.runners.ParentRunner$1.schedule(ParentRunner.java:63) [junit-4.11.jar:]
	at org.junit.runners.ParentRunner.runChildren(ParentRunner.java:236) [junit-4.11.jar:]
	at org.junit.runners.ParentRunner.access$000(ParentRunner.java:53) [junit-4.11.jar:]
	at org.junit.runners.ParentRunner$2.evaluate(ParentRunner.java:229) [junit-4.11.jar:]
	at org.junit.runners.ParentRunner.run(ParentRunner.java:309) [junit-4.11.jar:]
	at org.apache.maven.surefire.junit4.JUnit4Provider.execute(JUnit4Provider.java:283) [surefire-junit4-2.18.1.jar:2.18.1]
	at org.apache.maven.surefire.junit4.JUnit4Provider.executeWithRerun(JUnit4Provider.java:173)
[surefire-junit4-2.18.1.jar:2.18.1]
	at org.apache.maven.surefire.junit4.JUnit4Provider.executeTestSet(JUnit4Provider.java:153)
[surefire-junit4-2.18.1.jar:2.18.1]
	at org.apache.maven.surefire.junit4.JUnit4Provider.invoke(JUnit4Provider.java:128) [surefire-junit4-2.18.1.jar:2.18.1]
	at org.apache.maven.surefire.booter.ForkedBooter.invokeProviderInSameClassLoader(ForkedBooter.java:203)
[surefire-booter-2.18.1.jar:2.18.1]
	at org.apache.maven.surefire.booter.ForkedBooter.runSuitesInProcess(ForkedBooter.java:155)
[surefire-booter-2.18.1.jar:2.18.1]
	at org.apache.maven.surefire.booter.ForkedBooter.main(ForkedBooter.java:103) [surefire-booter-2.18.1.jar:2.18.1]

18:26:27,444 INFO  [org.apache.activemq.artemis.ra] AMQ151001: Attempting to reconnect org.apache.activemq.artemis.ra.inflow.ActiveMQActivationSpec(ra=org.apache.activemq.artemis.ra.ActiveMQResourceAdapter@6c7baf00
destination=test destinationType=javax.jms.Topic ack=Auto-acknowledge durable=false clientID=null
user=user password=**** maxSession=1)
18:26:27,445 INFO  [org.apache.activemq.artemis.ra] AMQ151004: Instantiating javax.jms.Topic
"test" directly since UseJNDI=false.
18:26:27,480 ERROR [org.apache.activemq.artemis.core.server] AMQ224018: Failed to create session:
ActiveMQSecurityException[errorType=SECURITY_EXCEPTION message=AMQ119031: Unable to validate
user]
	at org.apache.activemq.artemis.core.security.impl.SecurityStoreImpl.authenticate(SecurityStoreImpl.java:145)
[:]
	at org.apache.activemq.artemis.core.server.impl.ActiveMQServerImpl.createSession(ActiveMQServerImpl.java:1031)
[:]
	at org.apache.activemq.artemis.core.protocol.core.impl.ActiveMQPacketHandler.handleCreateSession(ActiveMQPacketHandler.java:151)
[:]
	at org.apache.activemq.artemis.core.protocol.core.impl.ActiveMQPacketHandler.handlePacket(ActiveMQPacketHandler.java:77)
[:]
	at org.apache.activemq.artemis.core.protocol.core.impl.ChannelImpl.handlePacket(ChannelImpl.java:598)
[:]
	at org.apache.activemq.artemis.core.protocol.core.impl.RemotingConnectionImpl.doBufferReceived(RemotingConnectionImpl.java:368)
[:]
	at org.apache.activemq.artemis.core.protocol.core.impl.RemotingConnectionImpl.bufferReceived(RemotingConnectionImpl.java:350)
[:]
	at org.apache.activemq.artemis.core.remoting.server.impl.RemotingServiceImpl$DelegatingBufferHandler.bufferReceived(RemotingServiceImpl.java:627)
[:]
	at org.apache.activemq.artemis.core.remoting.impl.invm.InVMConnection$1.run(InVMConnection.java:183)
[:]
	at org.apache.activemq.artemis.utils.OrderedExecutorFactory$OrderedExecutor$ExecutorTask.run(OrderedExecutorFactory.java:100)
[:]
	at java.util.concurrent.ThreadPoolExecutor.runWorker(ThreadPoolExecutor.java:1142) [rt.jar:1.8.0_66]
	at java.util.concurrent.ThreadPoolExecutor$Worker.run(ThreadPoolExecutor.java:617) [rt.jar:1.8.0_66]
	at java.lang.Thread.run(Thread.java:745) [rt.jar:1.8.0_66]

18:26:27,510 ERROR [org.apache.activemq.artemis.ra] AMQ154003: Unable to reconnect org.apache.activemq.artemis.ra.inflow.ActiveMQActivationSpec(ra=org.apache.activemq.artemis.ra.ActiveMQResourceAdapter@6c7baf00
destination=test destinationType=javax.jms.Topic ack=Auto-acknowledge durable=false clientID=null
user=user password=**** maxSession=1): ActiveMQSecurityException[errorType=SECURITY_EXCEPTION
message=AMQ119031: Unable to validate user]
	at org.apache.activemq.artemis.core.protocol.core.impl.ChannelImpl.sendBlocking(ChannelImpl.java:376)
[:]
	at org.apache.activemq.artemis.core.protocol.core.impl.ActiveMQClientProtocolManager.createSessionContext(ActiveMQClientProtocolManager.java:291)
[:]
	at org.apache.activemq.artemis.core.protocol.core.impl.ActiveMQClientProtocolManager.createSessionContext(ActiveMQClientProtocolManager.java:239)
[:]
	at org.apache.activemq.artemis.core.client.impl.ClientSessionFactoryImpl.createSessionChannel(ClientSessionFactoryImpl.java:1303)
[:]
	at org.apache.activemq.artemis.core.client.impl.ClientSessionFactoryImpl.createSessionInternal(ClientSessionFactoryImpl.java:669)
[:]
	at org.apache.activemq.artemis.core.client.impl.ClientSessionFactoryImpl.createSession(ClientSessionFactoryImpl.java:302)
[:]
	at org.apache.activemq.artemis.ra.ActiveMQResourceAdapter.createSession(ActiveMQResourceAdapter.java:1534)
[:]
	at org.apache.activemq.artemis.ra.inflow.ActiveMQActivation.setupSession(ActiveMQActivation.java:490)
[:]
	at org.apache.activemq.artemis.ra.inflow.ActiveMQActivation.setup(ActiveMQActivation.java:316)
[:]
	at org.apache.activemq.artemis.ra.inflow.ActiveMQActivation.reconnect(ActiveMQActivation.java:679)
[:]
	at org.apache.activemq.artemis.ra.inflow.ActiveMQActivation$SetupActivation.run(ActiveMQActivation.java:724)
[:]
	at org.apache.activemq.artemis.tests.unit.ra.BootstrapContext$1.scheduleWork(BootstrapContext.java:64)
[:]
	at org.apache.activemq.artemis.ra.inflow.ActiveMQActivation.start(ActiveMQActivation.java:253)
[:]
	at org.apache.activemq.artemis.tests.unit.ra.ResourceAdapterTest.testForConnectionLeakDuringActivationWhenSessionCreationFails(ResourceAdapterTest.java:513)
[:]
	at sun.reflect.NativeMethodAccessorImpl.invoke0(Native Method) [rt.jar:1.8.0_66]
	at sun.reflect.NativeMethodAccessorImpl.invoke(NativeMethodAccessorImpl.java:62) [rt.jar:1.8.0_66]
	at sun.reflect.DelegatingMethodAccessorImpl.invoke(DelegatingMethodAccessorImpl.java:43)
[rt.jar:1.8.0_66]
	at java.lang.reflect.Method.invoke(Method.java:497) [rt.jar:1.8.0_66]
	at org.junit.runners.model.FrameworkMethod$1.runReflectiveCall(FrameworkMethod.java:47) [junit-4.11.jar:]
	at org.junit.internal.runners.model.ReflectiveCallable.run(ReflectiveCallable.java:12) [junit-4.11.jar:]
	at org.junit.runners.model.FrameworkMethod.invokeExplosively(FrameworkMethod.java:44) [junit-4.11.jar:]
	at org.junit.internal.runners.statements.InvokeMethod.evaluate(InvokeMethod.java:17) [junit-4.11.jar:]
	at org.junit.internal.runners.statements.RunBefores.evaluate(RunBefores.java:26) [junit-4.11.jar:]
	at org.junit.internal.runners.statements.RunAfters.evaluate(RunAfters.java:27) [junit-4.11.jar:]
	at org.junit.rules.ExternalResource$1.evaluate(ExternalResource.java:48) [junit-4.11.jar:]
	at org.junit.rules.TestWatcher$1.evaluate(TestWatcher.java:55) [junit-4.11.jar:]
	at org.junit.rules.ExternalResource$1.evaluate(ExternalResource.java:48) [junit-4.11.jar:]
	at org.junit.rules.ExternalResource$1.evaluate(ExternalResource.java:48) [junit-4.11.jar:]
	at org.junit.rules.TestWatcher$1.evaluate(TestWatcher.java:55) [junit-4.11.jar:]
	at org.junit.rules.RunRules.evaluate(RunRules.java:20) [junit-4.11.jar:]
	at org.junit.runners.ParentRunner.runLeaf(ParentRunner.java:271) [junit-4.11.jar:]
	at org.junit.runners.BlockJUnit4ClassRunner.runChild(BlockJUnit4ClassRunner.java:70) [junit-4.11.jar:]
	at org.junit.runners.BlockJUnit4ClassRunner.runChild(BlockJUnit4ClassRunner.java:50) [junit-4.11.jar:]
	at org.junit.runners.ParentRunner$3.run(ParentRunner.java:238) [junit-4.11.jar:]
	at org.junit.runners.ParentRunner$1.schedule(ParentRunner.java:63) [junit-4.11.jar:]
	at org.junit.runners.ParentRunner.runChildren(ParentRunner.java:236) [junit-4.11.jar:]
	at org.junit.runners.ParentRunner.access$000(ParentRunner.java:53) [junit-4.11.jar:]
	at org.junit.runners.ParentRunner$2.evaluate(ParentRunner.java:229) [junit-4.11.jar:]
	at org.junit.runners.ParentRunner.run(ParentRunner.java:309) [junit-4.11.jar:]
	at org.apache.maven.surefire.junit4.JUnit4Provider.execute(JUnit4Provider.java:283) [surefire-junit4-2.18.1.jar:2.18.1]
	at org.apache.maven.surefire.junit4.JUnit4Provider.executeWithRerun(JUnit4Provider.java:173)
[surefire-junit4-2.18.1.jar:2.18.1]
	at org.apache.maven.surefire.junit4.JUnit4Provider.executeTestSet(JUnit4Provider.java:153)
[surefire-junit4-2.18.1.jar:2.18.1]
	at org.apache.maven.surefire.junit4.JUnit4Provider.invoke(JUnit4Provider.java:128) [surefire-junit4-2.18.1.jar:2.18.1]
	at org.apache.maven.surefire.booter.ForkedBooter.invokeProviderInSameClassLoader(ForkedBooter.java:203)
[surefire-booter-2.18.1.jar:2.18.1]
	at org.apache.maven.surefire.booter.ForkedBooter.runSuitesInProcess(ForkedBooter.java:155)
[surefire-booter-2.18.1.jar:2.18.1]
	at org.apache.maven.surefire.booter.ForkedBooter.main(ForkedBooter.java:103) [surefire-booter-2.18.1.jar:2.18.1]

18:26:27,514 INFO  [org.apache.activemq.artemis.ra] AMQ151003: resource adaptor stopped
18:26:27,521 INFO  [org.apache.activemq.artemis.core.server] AMQ221002: Apache ActiveMQ Artemis
Message Broker version 1.3.0-SNAPSHOT [1e6394ef-d66d-11e5-af46-020007a90005] stopped, uptime
2.092 seconds
18:26:27,525 INFO  [org.apache.activemq.artemis.core.server] #*#*# Finished test: testForConnectionLeakDuringActivationWhenSessionCreationFails()...
18:26:27,526 INFO  [org.apache.activemq.artemis.core.server] #*#*# Starting test: testCreateConnectionFactoryThrowsException()...
#test testCreateConnectionFactoryThrowsException
18:26:27,530 INFO  [org.apache.activemq.artemis.core.server] #*#*# Finished test: testCreateConnectionFactoryThrowsException()...
18:26:27,531 INFO  [org.apache.activemq.artemis.core.server] #*#*# Starting test: testCreateConnectionFactoryMultipleConnectorsOverrideAndParams()...
#test testCreateConnectionFactoryMultipleConnectorsOverrideAndParams
18:26:27,536 INFO  [org.apache.activemq.artemis.core.server] #*#*# Finished test: testCreateConnectionFactoryMultipleConnectorsOverrideAndParams()...
18:26:27,537 INFO  [org.apache.activemq.artemis.core.server] #*#*# Starting test: test2DefaultConnectionFactorySame()...
#test test2DefaultConnectionFactorySame
18:26:27,541 INFO  [org.apache.activemq.artemis.core.server] #*#*# Finished test: test2DefaultConnectionFactorySame()...
Tests run: 15, Failures: 0, Errors: 0, Skipped: 0, Time elapsed: 2.333 sec - in org.apache.activemq.artemis.tests.unit.ra.ResourceAdapterTest
Running org.apache.activemq.artemis.tests.unit.util.ActiveMQBufferInputStreamTest
18:26:27,544 INFO  [org.apache.activemq.artemis.core.server] #*#*# Starting test: testReadBytes()...
#test testReadBytes
18:26:27,551 INFO  [org.apache.activemq.artemis.core.server] #*#*# Finished test: testReadBytes()...
Tests run: 1, Failures: 0, Errors: 0, Skipped: 0, Time elapsed: 0.008 sec - in org.apache.activemq.artemis.tests.unit.util.ActiveMQBufferInputStreamTest
Running org.apache.activemq.artemis.tests.unit.util.LinkedListTest
18:26:27,554 INFO  [org.apache.activemq.artemis.core.server] #*#*# Starting test: testAddHead()...
#test testAddHead
18:26:27,559 INFO  [org.apache.activemq.artemis.core.server] #*#*# Finished test: testAddHead()...
18:26:27,562 INFO  [org.apache.activemq.artemis.core.server] #*#*# Starting test: testAddTail()...
#test testAddTail
18:26:27,567 INFO  [org.apache.activemq.artemis.core.server] #*#*# Finished test: testAddTail()...
18:26:27,568 INFO  [org.apache.activemq.artemis.core.server] #*#*# Starting test: testAddHeadAndTail()...
#test testAddHeadAndTail
18:26:27,572 INFO  [org.apache.activemq.artemis.core.server] #*#*# Finished test: testAddHeadAndTail()...
18:26:27,573 INFO  [org.apache.activemq.artemis.core.server] #*#*# Starting test: testCreateIteratorAfterAddElements()...
#test testCreateIteratorAfterAddElements
18:26:27,577 INFO  [org.apache.activemq.artemis.core.server] #*#*# Finished test: testCreateIteratorAfterAddElements()...
18:26:27,578 INFO  [org.apache.activemq.artemis.core.server] #*#*# Starting test: testClear()...
#test testClear
18:26:27,583 INFO  [org.apache.activemq.artemis.core.server] #*#*# Finished test: testClear()...
18:26:27,584 INFO  [org.apache.activemq.artemis.core.server] #*#*# Starting test: testPoll()...
#test testPoll
18:26:27,588 INFO  [org.apache.activemq.artemis.core.server] #*#*# Finished test: testPoll()...
18:26:27,589 INFO  [org.apache.activemq.artemis.core.server] #*#*# Starting test: testRemoveHead1()...
#test testRemoveHead1
18:26:27,594 INFO  [org.apache.activemq.artemis.core.server] #*#*# Finished test: testRemoveHead1()...
18:26:27,595 INFO  [org.apache.activemq.artemis.core.server] #*#*# Starting test: testRemoveHead2()...
#test testRemoveHead2
18:26:27,603 INFO  [org.apache.activemq.artemis.core.server] #*#*# Finished test: testRemoveHead2()...
18:26:27,604 INFO  [org.apache.activemq.artemis.core.server] #*#*# Starting test: testRemoveHead3()...
#test testRemoveHead3
18:26:27,610 INFO  [org.apache.activemq.artemis.core.server] #*#*# Finished test: testRemoveHead3()...
18:26:27,611 INFO  [org.apache.activemq.artemis.core.server] #*#*# Starting test: testRemoveTail1()...
#test testRemoveTail1
18:26:27,618 INFO  [org.apache.activemq.artemis.core.server] #*#*# Finished test: testRemoveTail1()...
18:26:27,618 INFO  [org.apache.activemq.artemis.core.server] #*#*# Starting test: testRemoveTail2()...
#test testRemoveTail2
18:26:27,622 INFO  [org.apache.activemq.artemis.core.server] #*#*# Finished test: testRemoveTail2()...
18:26:27,622 INFO  [org.apache.activemq.artemis.core.server] #*#*# Starting test: testRemoveTail3()...
#test testRemoveTail3
18:26:27,626 INFO  [org.apache.activemq.artemis.core.server] #*#*# Finished test: testRemoveTail3()...
18:26:27,627 INFO  [org.apache.activemq.artemis.core.server] #*#*# Starting test: testRemoveInTurn()...
#test testRemoveInTurn
18:26:27,633 INFO  [org.apache.activemq.artemis.core.server] #*#*# Finished test: testRemoveInTurn()...
18:26:27,634 INFO  [org.apache.activemq.artemis.core.server] #*#*# Starting test: testRemoveMiddle()...
#test testRemoveMiddle
18:26:27,638 INFO  [org.apache.activemq.artemis.core.server] #*#*# Finished test: testRemoveMiddle()...
18:26:27,639 INFO  [org.apache.activemq.artemis.core.server] #*#*# Starting test: testAddHeadAndRemove()...
#test testAddHeadAndRemove
Jumping 500
18:26:27,644 INFO  [org.apache.activemq.artemis.core.server] #test forceGC
18:26:27,765 INFO  [org.apache.activemq.artemis.core.server] #test forceGC Done 
18:26:27,767 INFO  [org.apache.activemq.artemis.core.server] #*#*# Finished test: testAddHeadAndRemove()...
18:26:27,768 INFO  [org.apache.activemq.artemis.core.server] #*#*# Starting test: testMultipleIterators1()...
#test testMultipleIterators1
18:26:27,771 INFO  [org.apache.activemq.artemis.core.server] #*#*# Finished test: testMultipleIterators1()...
18:26:27,771 INFO  [org.apache.activemq.artemis.core.server] #*#*# Starting test: testMultipleIterators2()...
#test testMultipleIterators2
18:26:27,774 INFO  [org.apache.activemq.artemis.core.server] #*#*# Finished test: testMultipleIterators2()...
18:26:27,774 INFO  [org.apache.activemq.artemis.core.server] #*#*# Starting test: testResizing()...
#test testResizing
18:26:27,790 INFO  [org.apache.activemq.artemis.core.server] #*#*# Finished test: testResizing()...
18:26:27,791 INFO  [org.apache.activemq.artemis.core.server] #*#*# Starting test: testRepeatAndRemove()...
#test testRepeatAndRemove
18:26:27,796 INFO  [org.apache.activemq.artemis.core.server] #*#*# Finished test: testRepeatAndRemove()...
18:26:27,797 INFO  [org.apache.activemq.artemis.core.server] #*#*# Starting test: testIterateNoElements()...
#test testIterateNoElements
18:26:27,801 INFO  [org.apache.activemq.artemis.core.server] #*#*# Finished test: testIterateNoElements()...
18:26:27,802 INFO  [org.apache.activemq.artemis.core.server] #*#*# Starting test: testAddAndRemove()...
#test testAddAndRemove
18:26:27,814 INFO  [org.apache.activemq.artemis.core.server] #test forceGC
18:26:27,920 INFO  [org.apache.activemq.artemis.core.server] #test forceGC Done 
18:26:27,920 INFO  [org.apache.activemq.artemis.core.server] #test forceGC
18:26:28,042 INFO  [org.apache.activemq.artemis.core.server] #test forceGC Done 
SUREFIRE-859: Java HotSpot(TM) 64-Bit Server VM warning: INFO: os::commit_memory(0x00000000a9c00000,
314048512, 0) failed; error='Cannot allocate memory' (errno=12)
#
# There is insufficient memory for the Java Runtime Environment to continue.
# Native memory allocation (mmap) failed to map 314048512 bytes for committing reserved memory.
# An error report file with more information is saved as:
# <https://builds.apache.org/job/ActiveMQ-Artemis-Master/ws/tests/unit-tests/hs_err_pid28619.log>

Results :

Tests run: 552, Failures: 0, Errors: 0, Skipped: 0

[INFO] ------------------------------------------------------------------------
[INFO] Reactor Summary:
[INFO] 
[INFO] ActiveMQ Artemis Parent ............................ SUCCESS [  6.680 s]
[INFO] ActiveMQ Artemis Commons ........................... SUCCESS [ 11.202 s]
[INFO] ActiveMQ Artemis Core Client ....................... SUCCESS [ 13.508 s]
[INFO] ActiveMQ Artemis Selector Implementation ........... SUCCESS [  4.156 s]
[INFO] ActiveMQ Artemis JMS Client ........................ SUCCESS [  4.938 s]
[INFO] ActiveMQ Artemis Native POM ........................ SUCCESS [  5.271 s]
[INFO] ActiveMQ Artemis Journal ........................... SUCCESS [  3.648 s]
[INFO] ActiveMQ Artemis JDBC Store ........................ SUCCESS [  1.549 s]
[INFO] ActiveMQ Artemis Server ............................ SUCCESS [ 46.143 s]
[INFO] ActiveMQ Artemis Protocols ......................... SUCCESS [  1.027 s]
[INFO] ActiveMQ Artemis Proton Protocol ................... SUCCESS [  5.151 s]
[INFO] ActiveMQ Artemis AMQP Protocol ..................... SUCCESS [  2.827 s]
[INFO] ActiveMQ Artemis STOMP Protocol .................... SUCCESS [  2.346 s]
[INFO] ActiveMQ Artemis OpenWire Protocol ................. SUCCESS [  2.521 s]
[INFO] ActiveMQ Artemis HQClient Protocol ................. SUCCESS [  1.276 s]
[INFO] ActiveMQ Artemis HornetQ Protocol .................. SUCCESS [  1.174 s]
[INFO] ActiveMQ Artemis MQTT Protocol ..................... SUCCESS [  2.000 s]
[INFO] ActiveMQ Artemis DTO ............................... SUCCESS [  5.403 s]
[INFO] ActiveMQ Artemis Boot .............................. SUCCESS [  0.640 s]
[INFO] ActiveMQ Artemis Service Extensions ................ SUCCESS [  2.907 s]
[INFO] ActiveMQ Artemis JMS Server ........................ SUCCESS [  2.970 s]
[INFO] ActiveMQ Artemis CLI ............................... SUCCESS [ 20.330 s]
[INFO] ActiveMQ Artemis Web ............................... SUCCESS [  3.654 s]
[INFO] ActiveMQ Artemis Web ............................... SUCCESS [  2.202 s]
[INFO] ActiveMQ Artemis RAR POM ........................... SUCCESS [  3.088 s]
[INFO] ActiveMQ Artemis REST Interface Implementation ..... SUCCESS [01:15 min]
[INFO] ActiveMQ Artemis Maven Plugin ...................... SUCCESS [  7.408 s]
[INFO] ActiveMQ Artemis Server OSGi ....................... SUCCESS [  2.166 s]
[INFO] ActiveMQ Artemis Spring Integration ................ SUCCESS [  1.425 s]
[INFO] ActiveMQ Artemis Aerogear Integration .............. SUCCESS [  1.699 s]
[INFO] ActiveMQ Artemis Vert.x Integration ................ SUCCESS [  1.984 s]
[INFO] Apache ActiveMQ Artemis Distribution ............... SUCCESS [  2.322 s]
[INFO] ActiveMQ Artemis Tests POM ......................... SUCCESS [  6.004 s]
[INFO] ActiveMQ Artemis Unit Tests ........................ FAILURE [ 54.126 s]
[INFO] ActiveMQ Artemis Joram Tests ....................... SKIPPED
[INFO] ActiveMQ Artemis timing Tests ...................... SKIPPED
[INFO] ActiveMQ Artemis JMS Tests ......................... SKIPPED
[INFO] ActiveMQ Artemis Integration Tests ................. SKIPPED
[INFO] ActiveMQ Artemis soak Tests ........................ SKIPPED
[INFO] ActiveMQ Artemis stress Tests ...................... SKIPPED
[INFO] ActiveMQ Artemis performance Tests ................. SKIPPED
[INFO] ActiveMQ Artemis Extra Tests ....................... SKIPPED
[INFO] ActiveMQ Artemis Features .......................... SKIPPED
[INFO] ------------------------------------------------------------------------
[INFO] BUILD FAILURE
[INFO] ------------------------------------------------------------------------
[INFO] Total time: 05:11 min
[INFO] Finished at: 2016-02-18T18:26:30+00:00
[INFO] Final Memory: 127M/723M
[INFO] ------------------------------------------------------------------------
[ERROR] Failed to execute goal org.apache.maven.plugins:maven-surefire-plugin:2.18.1:test
(default-test) on project unit-tests: Execution default-test of goal org.apache.maven.plugins:maven-surefire-plugin:2.18.1:test
failed: The forked VM terminated without properly saying goodbye. VM crash or System.exit
called?
[ERROR] Command was /bin/sh -c cd <https://builds.apache.org/job/ActiveMQ-Artemis-Master/ws/tests/unit-tests>
&& /home/jenkins/jenkins-slave/tools/hudson.model.JDK/latest1.8/jre/bin/java -Djava.util.logging.manager=org.jboss.logmanager.LogManager
-Dlogging.configuration=<https://builds.apache.org/job/ActiveMQ-Artemis-Master/ws/tests/unit-tests/../../tests/config/logging.properties>
-Djava.library.path=<https://builds.apache.org/job/ActiveMQ-Artemis-Master/ws/tests/unit-tests/../../artemis-native/bin>
-Djgroups.bind_addr=localhost -Dorg.apache.activemq.artemis.api.core.UDPBroadcastEndpointFactory.localBindAddress=localhost
-Djava.net.preferIPv4Stack=true -jar <https://builds.apache.org/job/ActiveMQ-Artemis-Master/ws/tests/unit-tests/target/surefire/surefirebooter1671644641465192279.jar>
<https://builds.apache.org/job/ActiveMQ-Artemis-Master/ws/tests/unit-tests/target/surefire/surefire4245688933056323465tmp>
<https://builds.apache.org/job/ActiveMQ-Artemis-Master/ws/tests/unit-tests/target/surefire/surefire_141422690414535755104tmp>
[ERROR] -> [Help 1]
[ERROR] 
[ERROR] To see the full stack trace of the errors, re-run Maven with the -e switch.
[ERROR] Re-run Maven using the -X switch to enable full debug logging.
[ERROR] 
[ERROR] For more information about the errors and possible solutions, please read the following
articles:
[ERROR] [Help 1] http://cwiki.apache.org/confluence/display/MAVEN/PluginExecutionException
[ERROR] 
[ERROR] After correcting the problems, you can resume the build with the command
[ERROR]   mvn <goals> -rf :unit-tests
Build step 'Invoke top-level Maven targets' marked build as failure
Performing Post build task...
Could not match :Too many files with unapproved license  : False
Logical operation result is FALSE
Skipping script  : cat ratReport.txt
END OF POST BUILD TASK 	: 0
Recording test results

Mime
View raw message