activemq-commits mailing list archives

Site index · List index
Message view « Date » · « Thread »
Top « Date » · « Thread »
From Apache Jenkins Server <jenk...@builds.apache.org>
Subject Build failed in Jenkins: ActiveMQ-Java7-All-UnitTests #277
Date Fri, 13 Nov 2015 11:24:37 GMT
See <https://builds.apache.org/job/ActiveMQ-Java7-All-UnitTests/277/changes>

Changes:

[tabish121] https://issues.apache.org/jira/browse/AMQ-5957

------------------------------------------
[...truncated 2591 lines...]
Tests run: 1, Failures: 0, Errors: 0, Skipped: 0, Time elapsed: 0.17 sec - in org.apache.activemq.filter.DestinationPathTest
Running org.apache.activemq.filter.DummyPolicyTest
Tests run: 1, Failures: 0, Errors: 0, Skipped: 0, Time elapsed: 0.535 sec - in org.apache.activemq.filter.DummyPolicyTest
Running org.apache.activemq.jmx.JmxAuditLogTest
Tests run: 1, Failures: 0, Errors: 0, Skipped: 0, Time elapsed: 2.201 sec - in org.apache.activemq.jmx.JmxAuditLogTest
Running org.apache.activemq.jmx.JmxCreateNCTest
Tests run: 1, Failures: 0, Errors: 0, Skipped: 0, Time elapsed: 1.072 sec - in org.apache.activemq.jmx.JmxCreateNCTest
Running org.apache.activemq.jmx.OpenTypeSupportTest
Tests run: 2, Failures: 0, Errors: 0, Skipped: 0, Time elapsed: 1.227 sec - in org.apache.activemq.jmx.OpenTypeSupportTest
Running org.apache.activemq.jmx.TotalMessageCountTest
Tests run: 1, Failures: 0, Errors: 0, Skipped: 0, Time elapsed: 2.654 sec - in org.apache.activemq.jmx.TotalMessageCountTest
Running org.apache.activemq.jndi.ActiveMQInitialContextFactoryTest
Tests run: 3, Failures: 0, Errors: 0, Skipped: 0, Time elapsed: 0.267 sec - in org.apache.activemq.jndi.ActiveMQInitialContextFactoryTest
Running org.apache.activemq.jndi.ActiveMQWASInitialContextFactoryTest
Tests run: 1, Failures: 0, Errors: 0, Skipped: 0, Time elapsed: 0.216 sec - in org.apache.activemq.jndi.ActiveMQWASInitialContextFactoryTest
Running org.apache.activemq.jndi.CustomConnectionFactoryNameTest
Tests run: 4, Failures: 0, Errors: 0, Skipped: 0, Time elapsed: 0.247 sec - in org.apache.activemq.jndi.CustomConnectionFactoryNameTest
Running org.apache.activemq.jndi.DestinationNameWithSlashTest
Tests run: 1, Failures: 0, Errors: 0, Skipped: 0, Time elapsed: 0.217 sec - in org.apache.activemq.jndi.DestinationNameWithSlashTest
Running org.apache.activemq.jndi.InitialContextTest
Tests run: 4, Failures: 0, Errors: 0, Skipped: 0, Time elapsed: 0.244 sec - in org.apache.activemq.jndi.InitialContextTest
Running org.apache.activemq.jndi.ObjectFactoryTest
Tests run: 2, Failures: 0, Errors: 0, Skipped: 0, Time elapsed: 0.277 sec - in org.apache.activemq.jndi.ObjectFactoryTest
Running org.apache.activemq.jndi.XAConnectionFactoryTest
Tests run: 4, Failures: 0, Errors: 0, Skipped: 0, Time elapsed: 0.28 sec - in org.apache.activemq.jndi.XAConnectionFactoryTest
Running org.apache.activemq.joramtests.JoramJmsTest
Tests run: 196, Failures: 0, Errors: 0, Skipped: 0, Time elapsed: 11.333 sec - in org.apache.activemq.joramtests.JoramJmsTest
Running org.apache.activemq.leveldb.LevelDBStoreBrokerTest
Tests run: 127, Failures: 0, Errors: 0, Skipped: 0, Time elapsed: 21.251 sec - in org.apache.activemq.leveldb.LevelDBStoreBrokerTest
Running org.apache.activemq.management.BoundaryStatisticTest
Tests run: 1, Failures: 0, Errors: 0, Skipped: 0, Time elapsed: 0.164 sec - in org.apache.activemq.management.BoundaryStatisticTest
Running org.apache.activemq.management.BoundedRangeStatisticTest
Tests run: 1, Failures: 0, Errors: 0, Skipped: 0, Time elapsed: 0.665 sec - in org.apache.activemq.management.BoundedRangeStatisticTest
Running org.apache.activemq.management.CountStatisticTest
Tests run: 1, Failures: 0, Errors: 0, Skipped: 0, Time elapsed: 0.656 sec - in org.apache.activemq.management.CountStatisticTest
Running org.apache.activemq.management.RangeStatisticTest
Tests run: 1, Failures: 0, Errors: 0, Skipped: 0, Time elapsed: 0.66 sec - in org.apache.activemq.management.RangeStatisticTest
Running org.apache.activemq.management.TimeStatisticTest
Tests run: 1, Failures: 0, Errors: 0, Skipped: 0, Time elapsed: 0.669 sec - in org.apache.activemq.management.TimeStatisticTest
Running org.apache.activemq.memory.MemoryPropertyTest
Tests run: 1, Failures: 0, Errors: 0, Skipped: 0, Time elapsed: 1.707 sec - in org.apache.activemq.memory.MemoryPropertyTest
Running org.apache.activemq.memory.buffer.OrderBasedMemoryBufferTest
Tests run: 1, Failures: 0, Errors: 0, Skipped: 0, Time elapsed: 0.201 sec - in org.apache.activemq.memory.buffer.OrderBasedMemoryBufferTest
Running org.apache.activemq.memory.buffer.SizeBasedMessageBufferTest
Tests run: 1, Failures: 0, Errors: 0, Skipped: 0, Time elapsed: 0.179 sec - in org.apache.activemq.memory.buffer.SizeBasedMessageBufferTest
Running org.apache.activemq.network.CheckDuplicateMessagesOnDuplexTest
Tests run: 1, Failures: 0, Errors: 0, Skipped: 0, Time elapsed: 9.679 sec - in org.apache.activemq.network.CheckDuplicateMessagesOnDuplexTest
Running org.apache.activemq.network.CompressionOverNetworkTest
Tests run: 6, Failures: 0, Errors: 0, Skipped: 0, Time elapsed: 16.016 sec - in org.apache.activemq.network.CompressionOverNetworkTest
Running org.apache.activemq.network.DemandForwardingBridgeFilterTest
Tests run: 5, Failures: 0, Errors: 0, Skipped: 0, Time elapsed: 61.083 sec - in org.apache.activemq.network.DemandForwardingBridgeFilterTest
Running org.apache.activemq.network.DemandForwardingBridgeTest
Tests run: 6, Failures: 0, Errors: 0, Skipped: 0, Time elapsed: 4.976 sec - in org.apache.activemq.network.DemandForwardingBridgeTest
Running org.apache.activemq.network.DuplexNetworkMBeanTest
Tests run: 2, Failures: 0, Errors: 0, Skipped: 0, Time elapsed: 8.081 sec - in org.apache.activemq.network.DuplexNetworkMBeanTest
Running org.apache.activemq.network.DuplexNetworkTest
Tests run: 7, Failures: 0, Errors: 0, Skipped: 0, Time elapsed: 32.03 sec - in org.apache.activemq.network.DuplexNetworkTest
Running org.apache.activemq.network.DynamicallyIncludedDestinationsDuplexNetworkTest
Tests run: 7, Failures: 0, Errors: 0, Skipped: 0, Time elapsed: 22.997 sec - in org.apache.activemq.network.DynamicallyIncludedDestinationsDuplexNetworkTest
Running org.apache.activemq.network.FailoverStaticNetworkTest
Tests run: 8, Failures: 0, Errors: 0, Skipped: 0, Time elapsed: 46.075 sec - in org.apache.activemq.network.FailoverStaticNetworkTest
Running org.apache.activemq.network.ForwardingBridgeTest
Tests run: 8, Failures: 0, Errors: 0, Skipped: 0, Time elapsed: 16.968 sec - in org.apache.activemq.network.ForwardingBridgeTest
Running org.apache.activemq.network.MQTTNetworkOfBrokersFailoverTest
Tests run: 1, Failures: 0, Errors: 0, Skipped: 0, Time elapsed: 2.289 sec - in org.apache.activemq.network.MQTTNetworkOfBrokersFailoverTest
Running org.apache.activemq.network.NetworkBrokerDetachTest
Tests run: 2, Failures: 0, Errors: 0, Skipped: 0, Time elapsed: 13.182 sec - in org.apache.activemq.network.NetworkBrokerDetachTest
Running org.apache.activemq.network.NetworkConnectionsTest
Tests run: 3, Failures: 0, Errors: 0, Skipped: 0, Time elapsed: 2.03 sec - in org.apache.activemq.network.NetworkConnectionsTest
Running org.apache.activemq.network.NetworkDestinationFilterTest
Tests run: 1, Failures: 0, Errors: 0, Skipped: 0, Time elapsed: 0.171 sec - in org.apache.activemq.network.NetworkDestinationFilterTest
Running org.apache.activemq.network.NetworkLoadTest
Tests run: 1, Failures: 0, Errors: 0, Skipped: 0, Time elapsed: 62.953 sec - in org.apache.activemq.network.NetworkLoadTest
Running org.apache.activemq.network.NetworkLoopBackTest
Tests run: 1, Failures: 0, Errors: 0, Skipped: 0, Time elapsed: 0.988 sec - in org.apache.activemq.network.NetworkLoopBackTest
Running org.apache.activemq.network.NetworkReconnectTest
Tests run: 1, Failures: 0, Errors: 0, Skipped: 0, Time elapsed: 3.209 sec - in org.apache.activemq.network.NetworkReconnectTest
Running org.apache.activemq.network.NetworkRemovesSubscriptionsTest
Tests run: 5, Failures: 0, Errors: 0, Skipped: 0, Time elapsed: 17.501 sec - in org.apache.activemq.network.NetworkRemovesSubscriptionsTest
Running org.apache.activemq.network.NetworkRestartPlainTest
Tests run: 2, Failures: 0, Errors: 0, Skipped: 0, Time elapsed: 26.846 sec - in org.apache.activemq.network.NetworkRestartPlainTest
Running org.apache.activemq.network.NetworkRestartTest
Tests run: 2, Failures: 0, Errors: 0, Skipped: 0, Time elapsed: 27.346 sec - in org.apache.activemq.network.NetworkRestartTest
Running org.apache.activemq.network.NetworkRouteTest
Tests run: 3, Failures: 0, Errors: 0, Skipped: 0, Time elapsed: 0.846 sec - in org.apache.activemq.network.NetworkRouteTest
Running org.apache.activemq.network.SimpleNetworkTest
Tests run: 5, Failures: 0, Errors: 0, Skipped: 0, Time elapsed: 24.94 sec - in org.apache.activemq.network.SimpleNetworkTest
Running org.apache.activemq.network.VirtualConsumerDemandTest

Results :

Failed tests: 
  DbRestartJDBCQueueMasterSlaveTest>CombinationTestSupport.runBare:113->CombinationTestSupport.runBare:107->JmsSendReceiveTestSupport.testSendReceive:103->JmsSendReceiveTestSupport.assertMessagesAreReceived:126->JmsSendReceiveTestSupport.assertMessagesReceivedAreValid:148
Not enough messages received expected:<500> but was:<499>

Tests run: 2499, Failures: 1, Errors: 0, Skipped: 9

[JENKINS] Recording test results
[INFO] ------------------------------------------------------------------------
[INFO] Reactor Summary:
[INFO] 
[INFO] ActiveMQ .......................................... SUCCESS [3.004s]
[INFO] ActiveMQ :: Client ................................ SUCCESS [1:33.134s]
[INFO] ActiveMQ :: Openwire Legacy Support ............... SUCCESS [2.517s]
[INFO] ActiveMQ :: JAAS .................................. SUCCESS [30.428s]
[INFO] ActiveMQ :: Broker ................................ SUCCESS [1:20.623s]
[INFO] ActiveMQ :: KahaDB Store .......................... SUCCESS [2:09.115s]
[INFO] ActiveMQ :: STOMP Protocol ........................ SUCCESS [12:52.739s]
[INFO] ActiveMQ :: MQTT Protocol ......................... SUCCESS [20:23.796s]
[INFO] ActiveMQ :: JDBC Store ............................ SUCCESS [1.205s]
[INFO] ActiveMQ :: LevelDB Store ......................... SUCCESS [4:13.686s]
[INFO] ActiveMQ :: Generic JMS Pool ...................... SUCCESS [46.121s]
[INFO] ActiveMQ :: Pool .................................. SUCCESS [2.883s]
[INFO] ActiveMQ :: RA .................................... SUCCESS [2:32.907s]
[INFO] ActiveMQ :: Spring ................................ SUCCESS [1:05.775s]
[INFO] ActiveMQ :: AMQP .................................. SUCCESS [9:03.518s]
[INFO] ActiveMQ :: Console ............................... SUCCESS [4.511s]
[INFO] ActiveMQ :: Partition Management .................. SUCCESS [19.361s]
[INFO] ActiveMQ :: Runtime Configuration ................. SUCCESS [7:24.867s]
[INFO] ActiveMQ :: Unit Tests ............................ FAILURE [2:58:34.390s]
[INFO] ------------------------------------------------------------------------
[INFO] BUILD FAILURE
[INFO] ------------------------------------------------------------------------
[INFO] Total time: 4:03:16.440s
[INFO] Finished at: Fri Nov 13 11:24:28 UTC 2015
[INFO] Final Memory: 106M/1014M
[INFO] ------------------------------------------------------------------------
Waiting for Jenkins to finish collecting data
[ERROR] Failed to execute goal org.apache.maven.plugins:maven-surefire-plugin:2.16:test (default-test)
on project activemq-unit-tests: ExecutionException; nested exception is java.util.concurrent.ExecutionException:
java.lang.RuntimeException: The forked VM terminated without saying properly goodbye. VM crash
or System.exit called ?
[ERROR] Command was/bin/sh -c cd <https://builds.apache.org/job/ActiveMQ-Java7-All-UnitTests/ws/activemq-unit-tests>
&& /home/jenkins/tools/java/jdk1.7.0_25-32/jre/bin/java -Xmx512m -jar <https://builds.apache.org/job/ActiveMQ-Java7-All-UnitTests/ws/activemq-unit-tests/target/surefire/surefirebooter1079358222640313946.jar>
<https://builds.apache.org/job/ActiveMQ-Java7-All-UnitTests/ws/activemq-unit-tests/target/surefire/surefire7921608484953072819tmp>
<https://builds.apache.org/job/ActiveMQ-Java7-All-UnitTests/ws/activemq-unit-tests/target/surefire/surefire_4509104735566869242609tmp>
[ERROR] -> [Help 1]
org.apache.maven.lifecycle.LifecycleExecutionException: Failed to execute goal org.apache.maven.plugins:maven-surefire-plugin:2.16:test
(default-test) on project activemq-unit-tests: ExecutionException; nested exception is java.util.concurrent.ExecutionException:
java.lang.RuntimeException: The forked VM terminated without saying properly goodbye. VM crash
or System.exit called ?
Command was/bin/sh -c cd <https://builds.apache.org/job/ActiveMQ-Java7-All-UnitTests/ws/activemq-unit-tests>
&& /home/jenkins/tools/java/jdk1.7.0_25-32/jre/bin/java -Xmx512m -jar <https://builds.apache.org/job/ActiveMQ-Java7-All-UnitTests/ws/activemq-unit-tests/target/surefire/surefirebooter1079358222640313946.jar>
<https://builds.apache.org/job/ActiveMQ-Java7-All-UnitTests/ws/activemq-unit-tests/target/surefire/surefire7921608484953072819tmp>
<https://builds.apache.org/job/ActiveMQ-Java7-All-UnitTests/ws/activemq-unit-tests/target/surefire/surefire_4509104735566869242609tmp>
	at org.apache.maven.lifecycle.internal.MojoExecutor.execute(MojoExecutor.java:213)
	at org.apache.maven.lifecycle.internal.MojoExecutor.execute(MojoExecutor.java:153)
	at org.apache.maven.lifecycle.internal.MojoExecutor.execute(MojoExecutor.java:145)
	at org.apache.maven.lifecycle.internal.LifecycleModuleBuilder.buildProject(LifecycleModuleBuilder.java:84)
	at org.apache.maven.lifecycle.internal.LifecycleModuleBuilder.buildProject(LifecycleModuleBuilder.java:59)
	at org.apache.maven.lifecycle.internal.LifecycleStarter.singleThreadedBuild(LifecycleStarter.java:183)
	at org.apache.maven.lifecycle.internal.LifecycleStarter.execute(LifecycleStarter.java:161)
	at org.apache.maven.DefaultMaven.doExecute(DefaultMaven.java:320)
	at org.apache.maven.DefaultMaven.execute(DefaultMaven.java:156)
	at org.jvnet.hudson.maven3.launcher.Maven3Launcher.main(Maven3Launcher.java:117)
	at sun.reflect.NativeMethodAccessorImpl.invoke0(Native Method)
	at sun.reflect.NativeMethodAccessorImpl.invoke(NativeMethodAccessorImpl.java:57)
	at sun.reflect.DelegatingMethodAccessorImpl.invoke(DelegatingMethodAccessorImpl.java:43)
	at java.lang.reflect.Method.invoke(Method.java:606)
	at org.codehaus.plexus.classworlds.launcher.Launcher.launchStandard(Launcher.java:329)
	at org.codehaus.plexus.classworlds.launcher.Launcher.launch(Launcher.java:239)
	at org.jvnet.hudson.maven3.agent.Maven3Main.launch(Maven3Main.java:181)
	at sun.reflect.NativeMethodAccessorImpl.invoke0(Native Method)
	at sun.reflect.NativeMethodAccessorImpl.invoke(NativeMethodAccessorImpl.java:57)
	at sun.reflect.DelegatingMethodAccessorImpl.invoke(DelegatingMethodAccessorImpl.java:43)
	at java.lang.reflect.Method.invoke(Method.java:606)
	at hudson.maven.Maven3Builder.call(Maven3Builder.java:136)
	at hudson.maven.Maven3Builder.call(Maven3Builder.java:71)
	at hudson.remoting.UserRequest.perform(UserRequest.java:121)
	at hudson.remoting.UserRequest.perform(UserRequest.java:49)
	at hudson.remoting.Request$2.run(Request.java:326)
	at hudson.remoting.InterceptingExecutorService$1.call(InterceptingExecutorService.java:68)
	at java.util.concurrent.FutureTask$Sync.innerRun(FutureTask.java:334)
	at java.util.concurrent.FutureTask.run(FutureTask.java:166)
	at java.util.concurrent.ThreadPoolExecutor.runWorker(ThreadPoolExecutor.java:1145)
	at java.util.concurrent.ThreadPoolExecutor$Worker.run(ThreadPoolExecutor.java:615)
	at java.lang.Thread.run(Thread.java:724)
Caused by: org.apache.maven.plugin.MojoFailureException: ExecutionException; nested exception
is java.util.concurrent.ExecutionException: java.lang.RuntimeException: The forked VM terminated
without saying properly goodbye. VM crash or System.exit called ?
Command was/bin/sh -c cd <https://builds.apache.org/job/ActiveMQ-Java7-All-UnitTests/ws/activemq-unit-tests>
&& /home/jenkins/tools/java/jdk1.7.0_25-32/jre/bin/java -Xmx512m -jar <https://builds.apache.org/job/ActiveMQ-Java7-All-UnitTests/ws/activemq-unit-tests/target/surefire/surefirebooter1079358222640313946.jar>
<https://builds.apache.org/job/ActiveMQ-Java7-All-UnitTests/ws/activemq-unit-tests/target/surefire/surefire7921608484953072819tmp>
<https://builds.apache.org/job/ActiveMQ-Java7-All-UnitTests/ws/activemq-unit-tests/target/surefire/surefire_4509104735566869242609tmp>
	at org.apache.maven.plugin.surefire.SurefirePlugin.assertNoException(SurefirePlugin.java:198)
	at org.apache.maven.plugin.surefire.SurefirePlugin.handleSummary(SurefirePlugin.java:188)
	at org.apache.maven.plugin.surefire.AbstractSurefireMojo.executeAfterPreconditionsChecked(AbstractSurefireMojo.java:852)
	at org.apache.maven.plugin.surefire.AbstractSurefireMojo.execute(AbstractSurefireMojo.java:720)
	at org.apache.maven.plugin.DefaultBuildPluginManager.executeMojo(DefaultBuildPluginManager.java:101)
	at org.apache.maven.lifecycle.internal.MojoExecutor.execute(MojoExecutor.java:209)
	... 31 more
Caused by: org.apache.maven.surefire.booter.SurefireBooterForkException: ExecutionException;
nested exception is java.util.concurrent.ExecutionException: java.lang.RuntimeException: The
forked VM terminated without saying properly goodbye. VM crash or System.exit called ?
Command was/bin/sh -c cd <https://builds.apache.org/job/ActiveMQ-Java7-All-UnitTests/ws/activemq-unit-tests>
&& /home/jenkins/tools/java/jdk1.7.0_25-32/jre/bin/java -Xmx512m -jar <https://builds.apache.org/job/ActiveMQ-Java7-All-UnitTests/ws/activemq-unit-tests/target/surefire/surefirebooter1079358222640313946.jar>
<https://builds.apache.org/job/ActiveMQ-Java7-All-UnitTests/ws/activemq-unit-tests/target/surefire/surefire7921608484953072819tmp>
<https://builds.apache.org/job/ActiveMQ-Java7-All-UnitTests/ws/activemq-unit-tests/target/surefire/surefire_4509104735566869242609tmp>
	at org.apache.maven.plugin.surefire.booterclient.ForkStarter.runSuitesForkPerTestSet(ForkStarter.java:316)
	at org.apache.maven.plugin.surefire.booterclient.ForkStarter.run(ForkStarter.java:169)
	at org.apache.maven.plugin.surefire.AbstractSurefireMojo.executeProvider(AbstractSurefireMojo.java:958)
	at org.apache.maven.plugin.surefire.AbstractSurefireMojo.executeAfterPreconditionsChecked(AbstractSurefireMojo.java:822)
	... 34 more
Caused by: java.util.concurrent.ExecutionException: java.lang.RuntimeException: The forked
VM terminated without saying properly goodbye. VM crash or System.exit called ?
Command was/bin/sh -c cd <https://builds.apache.org/job/ActiveMQ-Java7-All-UnitTests/ws/activemq-unit-tests>
&& /home/jenkins/tools/java/jdk1.7.0_25-32/jre/bin/java -Xmx512m -jar <https://builds.apache.org/job/ActiveMQ-Java7-All-UnitTests/ws/activemq-unit-tests/target/surefire/surefirebooter1079358222640313946.jar>
<https://builds.apache.org/job/ActiveMQ-Java7-All-UnitTests/ws/activemq-unit-tests/target/surefire/surefire7921608484953072819tmp>
<https://builds.apache.org/job/ActiveMQ-Java7-All-UnitTests/ws/activemq-unit-tests/target/surefire/surefire_4509104735566869242609tmp>
	at java.util.concurrent.FutureTask$Sync.innerGet(FutureTask.java:252)
	at java.util.concurrent.FutureTask.get(FutureTask.java:111)
	at org.apache.maven.plugin.surefire.booterclient.ForkStarter.runSuitesForkPerTestSet(ForkStarter.java:300)
	... 37 more
Caused by: java.lang.RuntimeException: The forked VM terminated without saying properly goodbye.
VM crash or System.exit called ?
Command was/bin/sh -c cd <https://builds.apache.org/job/ActiveMQ-Java7-All-UnitTests/ws/activemq-unit-tests>
&& /home/jenkins/tools/java/jdk1.7.0_25-32/jre/bin/java -Xmx512m -jar <https://builds.apache.org/job/ActiveMQ-Java7-All-UnitTests/ws/activemq-unit-tests/target/surefire/surefirebooter1079358222640313946.jar>
<https://builds.apache.org/job/ActiveMQ-Java7-All-UnitTests/ws/activemq-unit-tests/target/surefire/surefire7921608484953072819tmp>
<https://builds.apache.org/job/ActiveMQ-Java7-All-UnitTests/ws/activemq-unit-tests/target/surefire/surefire_4509104735566869242609tmp>
	at org.apache.maven.plugin.surefire.booterclient.ForkStarter.fork(ForkStarter.java:485)
	at org.apache.maven.plugin.surefire.booterclient.ForkStarter.fork(ForkStarter.java:352)
	at org.apache.maven.plugin.surefire.booterclient.ForkStarter.access$300(ForkStarter.java:85)
	at org.apache.maven.plugin.surefire.booterclient.ForkStarter$2.call(ForkStarter.java:288)
	at org.apache.maven.plugin.surefire.booterclient.ForkStarter$2.call(ForkStarter.java:283)
	... 5 more
[ERROR] 
[ERROR] Re-run Maven using the -X switch to enable full debug logging.
[ERROR] 
[ERROR] For more information about the errors and possible solutions, please read the following
articles:
[ERROR] [Help 1] http://cwiki.apache.org/confluence/display/MAVEN/MojoFailureException
[ERROR] 
[ERROR] After correcting the problems, you can resume the build with the command
[ERROR]   mvn <goals> -rf :activemq-unit-tests
[JENKINS] Archiving <https://builds.apache.org/job/ActiveMQ-Java7-All-UnitTests/ws/activemq-unit-tests/pom.xml>
to org.apache.activemq/activemq-unit-tests/5.13-SNAPSHOT/activemq-unit-tests-5.13-SNAPSHOT.pom
Compressed 71.26 KB of artifacts by 89.8% relative to #274
[JENKINS] Archiving <https://builds.apache.org/job/ActiveMQ-Java7-All-UnitTests/ws/activemq-openwire-legacy/pom.xml>
to org.apache.activemq/activemq-openwire-legacy/5.13-SNAPSHOT/activemq-openwire-legacy-5.13-SNAPSHOT.pom
[JENKINS] Archiving <https://builds.apache.org/job/ActiveMQ-Java7-All-UnitTests/ws/activemq-openwire-legacy/target/activemq-openwire-legacy-5.13-SNAPSHOT.jar>
to org.apache.activemq/activemq-openwire-legacy/5.13-SNAPSHOT/activemq-openwire-legacy-5.13-SNAPSHOT.jar
[JENKINS] Archiving <https://builds.apache.org/job/ActiveMQ-Java7-All-UnitTests/ws/activemq-jdbc-store/pom.xml>
to org.apache.activemq/activemq-jdbc-store/5.13-SNAPSHOT/activemq-jdbc-store-5.13-SNAPSHOT.pom
[JENKINS] Archiving <https://builds.apache.org/job/ActiveMQ-Java7-All-UnitTests/ws/activemq-jdbc-store/target/activemq-jdbc-store-5.13-SNAPSHOT.jar>
to org.apache.activemq/activemq-jdbc-store/5.13-SNAPSHOT/activemq-jdbc-store-5.13-SNAPSHOT.jar
[JENKINS] Archiving <https://builds.apache.org/job/ActiveMQ-Java7-All-UnitTests/ws/activemq-amqp/pom.xml>
to org.apache.activemq/activemq-amqp/5.13-SNAPSHOT/activemq-amqp-5.13-SNAPSHOT.pom
[JENKINS] Archiving <https://builds.apache.org/job/ActiveMQ-Java7-All-UnitTests/ws/activemq-amqp/target/activemq-amqp-5.13-SNAPSHOT.jar>
to org.apache.activemq/activemq-amqp/5.13-SNAPSHOT/activemq-amqp-5.13-SNAPSHOT.jar
[JENKINS] Archiving <https://builds.apache.org/job/ActiveMQ-Java7-All-UnitTests/ws/activemq-jms-pool/pom.xml>
to org.apache.activemq/activemq-jms-pool/5.13-SNAPSHOT/activemq-jms-pool-5.13-SNAPSHOT.pom
[JENKINS] Archiving <https://builds.apache.org/job/ActiveMQ-Java7-All-UnitTests/ws/activemq-jms-pool/target/activemq-jms-pool-5.13-SNAPSHOT.jar>
to org.apache.activemq/activemq-jms-pool/5.13-SNAPSHOT/activemq-jms-pool-5.13-SNAPSHOT.jar
[JENKINS] Archiving <https://builds.apache.org/job/ActiveMQ-Java7-All-UnitTests/ws/activemq-runtime-config/pom.xml>
to org.apache.activemq/activemq-runtime-config/5.13-SNAPSHOT/activemq-runtime-config-5.13-SNAPSHOT.pom
[JENKINS] Archiving <https://builds.apache.org/job/ActiveMQ-Java7-All-UnitTests/ws/activemq-runtime-config/target/activemq-runtime-config-5.13-SNAPSHOT.jar>
to org.apache.activemq/activemq-runtime-config/5.13-SNAPSHOT/activemq-runtime-config-5.13-SNAPSHOT.jar
[JENKINS] Archiving <https://builds.apache.org/job/ActiveMQ-Java7-All-UnitTests/ws/activemq-pool/pom.xml>
to org.apache.activemq/activemq-pool/5.13-SNAPSHOT/activemq-pool-5.13-SNAPSHOT.pom
[JENKINS] Archiving <https://builds.apache.org/job/ActiveMQ-Java7-All-UnitTests/ws/activemq-pool/target/activemq-pool-5.13-SNAPSHOT.jar>
to org.apache.activemq/activemq-pool/5.13-SNAPSHOT/activemq-pool-5.13-SNAPSHOT.jar
[JENKINS] Archiving <https://builds.apache.org/job/ActiveMQ-Java7-All-UnitTests/ws/activemq-stomp/pom.xml>
to org.apache.activemq/activemq-stomp/5.13-SNAPSHOT/activemq-stomp-5.13-SNAPSHOT.pom
[JENKINS] Archiving <https://builds.apache.org/job/ActiveMQ-Java7-All-UnitTests/ws/activemq-stomp/target/activemq-stomp-5.13-SNAPSHOT.jar>
to org.apache.activemq/activemq-stomp/5.13-SNAPSHOT/activemq-stomp-5.13-SNAPSHOT.jar
[JENKINS] Archiving <https://builds.apache.org/job/ActiveMQ-Java7-All-UnitTests/ws/activemq-mqtt/pom.xml>
to org.apache.activemq/activemq-mqtt/5.13-SNAPSHOT/activemq-mqtt-5.13-SNAPSHOT.pom
[JENKINS] Archiving <https://builds.apache.org/job/ActiveMQ-Java7-All-UnitTests/ws/activemq-mqtt/target/activemq-mqtt-5.13-SNAPSHOT.jar>
to org.apache.activemq/activemq-mqtt/5.13-SNAPSHOT/activemq-mqtt-5.13-SNAPSHOT.jar
[JENKINS] Archiving <https://builds.apache.org/job/ActiveMQ-Java7-All-UnitTests/ws/activemq-console/pom.xml>
to org.apache.activemq/activemq-console/5.13-SNAPSHOT/activemq-console-5.13-SNAPSHOT.pom
[JENKINS] Archiving <https://builds.apache.org/job/ActiveMQ-Java7-All-UnitTests/ws/activemq-console/target/activemq-console-5.13-SNAPSHOT.jar>
to org.apache.activemq/activemq-console/5.13-SNAPSHOT/activemq-console-5.13-SNAPSHOT.jar
[JENKINS] Archiving <https://builds.apache.org/job/ActiveMQ-Java7-All-UnitTests/ws/activemq-client/pom.xml>
to org.apache.activemq/activemq-client/5.13-SNAPSHOT/activemq-client-5.13-SNAPSHOT.pom
[JENKINS] Archiving <https://builds.apache.org/job/ActiveMQ-Java7-All-UnitTests/ws/activemq-client/target/activemq-client-5.13-SNAPSHOT.jar>
to org.apache.activemq/activemq-client/5.13-SNAPSHOT/activemq-client-5.13-SNAPSHOT.jar
[JENKINS] Archiving <https://builds.apache.org/job/ActiveMQ-Java7-All-UnitTests/ws/pom.xml>
to org.apache.activemq/activemq-parent/5.13-SNAPSHOT/activemq-parent-5.13-SNAPSHOT.pom
[JENKINS] Archiving <https://builds.apache.org/job/ActiveMQ-Java7-All-UnitTests/ws/activemq-broker/pom.xml>
to org.apache.activemq/activemq-broker/5.13-SNAPSHOT/activemq-broker-5.13-SNAPSHOT.pom
[JENKINS] Archiving <https://builds.apache.org/job/ActiveMQ-Java7-All-UnitTests/ws/activemq-broker/target/activemq-broker-5.13-SNAPSHOT.jar>
to org.apache.activemq/activemq-broker/5.13-SNAPSHOT/activemq-broker-5.13-SNAPSHOT.jar
[JENKINS] Archiving <https://builds.apache.org/job/ActiveMQ-Java7-All-UnitTests/ws/activemq-broker/target/activemq-broker-5.13-SNAPSHOT-tests.jar>
to org.apache.activemq/activemq-broker/5.13-SNAPSHOT/activemq-broker-5.13-SNAPSHOT-tests.jar
[JENKINS] Archiving <https://builds.apache.org/job/ActiveMQ-Java7-All-UnitTests/ws/activemq-ra/pom.xml>
to org.apache.activemq/activemq-ra/5.13-SNAPSHOT/activemq-ra-5.13-SNAPSHOT.pom
[JENKINS] Archiving <https://builds.apache.org/job/ActiveMQ-Java7-All-UnitTests/ws/activemq-ra/target/activemq-ra-5.13-SNAPSHOT.jar>
to org.apache.activemq/activemq-ra/5.13-SNAPSHOT/activemq-ra-5.13-SNAPSHOT.jar
[JENKINS] Archiving <https://builds.apache.org/job/ActiveMQ-Java7-All-UnitTests/ws/activemq-ra/target/xbean/activemq-ra.xsd>
to org.apache.activemq/activemq-ra/5.13-SNAPSHOT/activemq-ra-5.13-SNAPSHOT.xsd
[JENKINS] Archiving <https://builds.apache.org/job/ActiveMQ-Java7-All-UnitTests/ws/activemq-ra/target/xbean/activemq-ra.xsd.html>
to org.apache.activemq/activemq-ra/5.13-SNAPSHOT/activemq-ra-5.13-SNAPSHOT-schema.html
[JENKINS] Archiving <https://builds.apache.org/job/ActiveMQ-Java7-All-UnitTests/ws/activemq-ra/target/xbean/activemq-ra.xsd.html>
to org.apache.activemq/activemq-ra/5.13-SNAPSHOT/activemq-ra-5.13-SNAPSHOT.xsd.html
[JENKINS] Archiving <https://builds.apache.org/job/ActiveMQ-Java7-All-UnitTests/ws/activemq-spring/pom.xml>
to org.apache.activemq/activemq-spring/5.13-SNAPSHOT/activemq-spring-5.13-SNAPSHOT.pom
[JENKINS] Archiving <https://builds.apache.org/job/ActiveMQ-Java7-All-UnitTests/ws/activemq-spring/target/activemq-spring-5.13-SNAPSHOT.jar>
to org.apache.activemq/activemq-spring/5.13-SNAPSHOT/activemq-spring-5.13-SNAPSHOT.jar
[JENKINS] Archiving <https://builds.apache.org/job/ActiveMQ-Java7-All-UnitTests/ws/activemq-spring/target/classes/activemq.xsd>
to org.apache.activemq/activemq-spring/5.13-SNAPSHOT/activemq-spring-5.13-SNAPSHOT.xsd
[JENKINS] Archiving <https://builds.apache.org/job/ActiveMQ-Java7-All-UnitTests/ws/activemq-spring/target/classes/activemq.xsd.html>
to org.apache.activemq/activemq-spring/5.13-SNAPSHOT/activemq-spring-5.13-SNAPSHOT-schema.html
Compressed 884.87 KB of artifacts by 79.6% relative to #276
[JENKINS] Archiving <https://builds.apache.org/job/ActiveMQ-Java7-All-UnitTests/ws/activemq-kahadb-store/pom.xml>
to org.apache.activemq/activemq-kahadb-store/5.13-SNAPSHOT/activemq-kahadb-store-5.13-SNAPSHOT.pom
[JENKINS] Archiving <https://builds.apache.org/job/ActiveMQ-Java7-All-UnitTests/ws/activemq-kahadb-store/target/activemq-kahadb-store-5.13-SNAPSHOT.jar>
to org.apache.activemq/activemq-kahadb-store/5.13-SNAPSHOT/activemq-kahadb-store-5.13-SNAPSHOT.jar
[JENKINS] Archiving <https://builds.apache.org/job/ActiveMQ-Java7-All-UnitTests/ws/activemq-jaas/pom.xml>
to org.apache.activemq/activemq-jaas/5.13-SNAPSHOT/activemq-jaas-5.13-SNAPSHOT.pom
[JENKINS] Archiving <https://builds.apache.org/job/ActiveMQ-Java7-All-UnitTests/ws/activemq-jaas/target/activemq-jaas-5.13-SNAPSHOT.jar>
to org.apache.activemq/activemq-jaas/5.13-SNAPSHOT/activemq-jaas-5.13-SNAPSHOT.jar
[JENKINS] Archiving <https://builds.apache.org/job/ActiveMQ-Java7-All-UnitTests/ws/activemq-partition/pom.xml>
to org.apache.activemq/activemq-partition/5.13-SNAPSHOT/activemq-partition-5.13-SNAPSHOT.pom
[JENKINS] Archiving <https://builds.apache.org/job/ActiveMQ-Java7-All-UnitTests/ws/activemq-partition/target/activemq-partition-5.13-SNAPSHOT.jar>
to org.apache.activemq/activemq-partition/5.13-SNAPSHOT/activemq-partition-5.13-SNAPSHOT.jar
[JENKINS] Archiving <https://builds.apache.org/job/ActiveMQ-Java7-All-UnitTests/ws/activemq-leveldb-store/pom.xml>
to org.apache.activemq/activemq-leveldb-store/5.13-SNAPSHOT/activemq-leveldb-store-5.13-SNAPSHOT.pom
[JENKINS] Archiving <https://builds.apache.org/job/ActiveMQ-Java7-All-UnitTests/ws/activemq-leveldb-store/target/activemq-leveldb-store-5.13-SNAPSHOT.jar>
to org.apache.activemq/activemq-leveldb-store/5.13-SNAPSHOT/activemq-leveldb-store-5.13-SNAPSHOT.jar
channel stopped
[locks-and-latches] Releasing all the locks
[locks-and-latches] All the locks released

Mime
View raw message