activemq-commits mailing list archives

Site index · List index
Message view « Date » · « Thread »
Top « Date » · « Thread »
From Apache Jenkins Server <jenk...@builds.apache.org>
Subject Build failed in Jenkins: ActiveMQ-Java7-All-UnitTests #270
Date Sat, 07 Nov 2015 03:53:40 GMT
See <https://builds.apache.org/job/ActiveMQ-Java7-All-UnitTests/270/changes>

Changes:

[tabish121] NO-JIRA Fix test with commented out assertion.

------------------------------------------
[...truncated 2717 lines...]
	at org.apache.derby.impl.services.monitor.FileMonitor.startModule(Unknown Source)
	at org.apache.derby.iapi.services.monitor.Monitor.bootServiceModule(Unknown Source)
	at org.apache.derby.impl.store.raw.RawStore.boot(Unknown Source)
	at org.apache.derby.impl.services.monitor.BaseMonitor.boot(Unknown Source)
	at org.apache.derby.impl.services.monitor.TopService.bootModule(Unknown Source)
	at org.apache.derby.impl.services.monitor.BaseMonitor.startModule(Unknown Source)
	at org.apache.derby.impl.services.monitor.FileMonitor.startModule(Unknown Source)
	at org.apache.derby.iapi.services.monitor.Monitor.bootServiceModule(Unknown Source)
	at org.apache.derby.impl.store.access.RAMAccessManager.boot(Unknown Source)
	at org.apache.derby.impl.services.monitor.BaseMonitor.boot(Unknown Source)
	at org.apache.derby.impl.services.monitor.TopService.bootModule(Unknown Source)
	at org.apache.derby.impl.services.monitor.BaseMonitor.startModule(Unknown Source)
	at org.apache.derby.impl.services.monitor.FileMonitor.startModule(Unknown Source)
	at org.apache.derby.iapi.services.monitor.Monitor.bootServiceModule(Unknown Source)
	at org.apache.derby.impl.db.BasicDatabase.bootStore(Unknown Source)
	at org.apache.derby.impl.db.BasicDatabase.boot(Unknown Source)
	at org.apache.derby.impl.services.monitor.BaseMonitor.boot(Unknown Source)
	at org.apache.derby.impl.services.monitor.TopService.bootModule(Unknown Source)
	at org.apache.derby.impl.services.monitor.BaseMonitor.bootService(Unknown Source)
	at org.apache.derby.impl.services.monitor.BaseMonitor.startProviderService(Unknown Source)
	at org.apache.derby.impl.services.monitor.BaseMonitor.findProviderAndStartService(Unknown
Source)
	at org.apache.derby.impl.services.monitor.BaseMonitor.startPersistentService(Unknown Source)
	at org.apache.derby.iapi.services.monitor.Monitor.startPersistentService(Unknown Source)
	at org.apache.derby.impl.jdbc.EmbedConnection.bootDatabase(Unknown Source)
	at org.apache.derby.impl.jdbc.EmbedConnection.<init>(Unknown Source)
	at org.apache.derby.jdbc.InternalDriver.getNewEmbedConnection(Unknown Source)
	at org.apache.derby.jdbc.InternalDriver.connect(Unknown Source)
	at org.apache.derby.jdbc.BasicEmbeddedDataSource40.getConnection(Unknown Source)
	at org.apache.derby.jdbc.BasicEmbeddedDataSource40.getConnection(Unknown Source)
	at org.apache.activemq.store.jdbc.TransactionContext.getConnection(TransactionContext.java:59)
	at org.apache.activemq.store.jdbc.JDBCPersistenceAdapter.loadAdapter(JDBCPersistenceAdapter.java:449)
	at org.apache.activemq.store.jdbc.JDBCPersistenceAdapter.createAdapter(JDBCPersistenceAdapter.java:432)
	at org.apache.activemq.store.jdbc.JDBCPersistenceAdapter.getAdapter(JDBCPersistenceAdapter.java:381)
	at org.apache.activemq.store.jdbc.JDBCPersistenceAdapter.deleteAllMessages(JDBCPersistenceAdapter.java:553)
	at org.apache.activemq.broker.BrokerService.deleteAllMessages(BrokerService.java:1557)
	at org.apache.activemq.broker.BrokerService.doStartPersistenceAdapter(BrokerService.java:653)
	at org.apache.activemq.broker.BrokerService.startPersistenceAdapter(BrokerService.java:644)
	at org.apache.activemq.broker.BrokerService.start(BrokerService.java:608)
	at org.apache.activemq.bugs.AMQ5863CompositePublishTest.startBroker(AMQ5863CompositePublishTest.java:76)

Running org.apache.activemq.bugs.AMQ5893Test
Tests run: 2, Failures: 0, Errors: 0, Skipped: 0, Time elapsed: 1.427 sec - in org.apache.activemq.bugs.AMQ5893Test
Running org.apache.activemq.bugs.AMQ5914Test
Tests run: 1, Failures: 0, Errors: 0, Skipped: 0, Time elapsed: 1.884 sec - in org.apache.activemq.bugs.AMQ5914Test
Running org.apache.activemq.bugs.AMQ5921Test
Tests run: 1, Failures: 0, Errors: 0, Skipped: 0, Time elapsed: 1.024 sec - in org.apache.activemq.bugs.AMQ5921Test
Running org.apache.activemq.bugs.ActiveMQSlowConsumerManualTest
Tests run: 4, Failures: 0, Errors: 0, Skipped: 0, Time elapsed: 8.277 sec - in org.apache.activemq.bugs.ActiveMQSlowConsumerManualTest
Running org.apache.activemq.bugs.ConnectionPerMessageTest
Tests run: 1, Failures: 0, Errors: 0, Skipped: 0, Time elapsed: 7.419 sec - in org.apache.activemq.bugs.ConnectionPerMessageTest
Running org.apache.activemq.bugs.CraigsBugTest
Tests run: 1, Failures: 0, Errors: 0, Skipped: 0, Time elapsed: 4.334 sec - in org.apache.activemq.bugs.CraigsBugTest
Running org.apache.activemq.bugs.DoubleExpireTest
Tests run: 1, Failures: 0, Errors: 0, Skipped: 0, Time elapsed: 61.103 sec - in org.apache.activemq.bugs.DoubleExpireTest
Running org.apache.activemq.bugs.DurableConsumerTest
Tests run: 6, Failures: 0, Errors: 0, Skipped: 0, Time elapsed: 163.449 sec - in org.apache.activemq.bugs.DurableConsumerTest
Running org.apache.activemq.bugs.JMSDurableTopicNoLocalTest
Tests run: 1, Failures: 0, Errors: 0, Skipped: 0, Time elapsed: 8.098 sec - in org.apache.activemq.bugs.JMSDurableTopicNoLocalTest
Running org.apache.activemq.bugs.JmsDurableTopicSlowReceiveTest
Tests run: 2, Failures: 0, Errors: 0, Skipped: 0, Time elapsed: 113.451 sec - in org.apache.activemq.bugs.JmsDurableTopicSlowReceiveTest
Running org.apache.activemq.bugs.JmsTimeoutTest
Tests run: 2, Failures: 0, Errors: 0, Skipped: 0, Time elapsed: 17.647 sec - in org.apache.activemq.bugs.JmsTimeoutTest
Running org.apache.activemq.bugs.MemoryUsageBlockResumeTest
Tests run: 1, Failures: 0, Errors: 0, Skipped: 0, Time elapsed: 44.84 sec - in org.apache.activemq.bugs.MemoryUsageBlockResumeTest
Running org.apache.activemq.bugs.MemoryUsageBrokerTest
Tests run: 1, Failures: 0, Errors: 0, Skipped: 0, Time elapsed: 66.481 sec - in org.apache.activemq.bugs.MemoryUsageBrokerTest
Running org.apache.activemq.bugs.MemoryUsageCleanupTest
Tests run: 1, Failures: 0, Errors: 0, Skipped: 0, Time elapsed: 212.543 sec - in org.apache.activemq.bugs.MemoryUsageCleanupTest
Running org.apache.activemq.bugs.MessageExpirationReaperTest
Tests run: 2, Failures: 0, Errors: 0, Skipped: 0, Time elapsed: 10.509 sec - in org.apache.activemq.bugs.MessageExpirationReaperTest
Running org.apache.activemq.bugs.MissingDataFileTest
Tests run: 1, Failures: 0, Errors: 0, Skipped: 0, Time elapsed: 361.947 sec - in org.apache.activemq.bugs.MissingDataFileTest
Running org.apache.activemq.bugs.OptimizeAcknowledgeWithExpiredMsgsTest
Tests run: 3, Failures: 0, Errors: 0, Skipped: 0, Time elapsed: 2.971 sec - in org.apache.activemq.bugs.OptimizeAcknowledgeWithExpiredMsgsTest
Running org.apache.activemq.bugs.QueueWorkerPrefetchTest
Tests run: 1, Failures: 0, Errors: 0, Skipped: 0, Time elapsed: 1.112 sec - in org.apache.activemq.bugs.QueueWorkerPrefetchTest
Running org.apache.activemq.bugs.RedeliveryPluginHeaderTest
Tests run: 1, Failures: 0, Errors: 0, Skipped: 0, Time elapsed: 9.628 sec - in org.apache.activemq.bugs.RedeliveryPluginHeaderTest
Running org.apache.activemq.bugs.SlowConsumerTest

Results :

Failed tests: 
  AMQ3141Test.testNoMissingMessagesOnShortScheduleDelay:109 expect all messages received but
2 are missing

Tests in error: 
  AMQ2870Test.testSize:120->sendMessage:169 ? TestTimedOut test timed out after ...
  AMQ5266Test.startBroker:140 ? IO Failed to start database 'derbydb' with class...
  AMQ5266Test.startBroker:140 ? IO Failed to start database 'derbydb' with class...
  AMQ5266Test.startBroker:140 ? IO Failed to start database 'derbydb' with class...
  AMQ5266Test.startBroker:140 ? IO Failed to start database 'derbydb' with class...
  AMQ5266Test.startBroker:140 ? IO Failed to start database 'derbydb' with class...
  AMQ5567Test>CombinationTestSupport.runBare:107->BrokerTestSupport.setUp:86 ? IO
  AMQ5567Test>CombinationTestSupport.runBare:107->BrokerTestSupport.setUp:86 ? IO
  AMQ5863CompositePublishTest.startBroker:76 ? IO Failed to start database 'derb...

Tests run: 1813, Failures: 1, Errors: 3, Skipped: 7

[JENKINS] Recording test results
[INFO] ------------------------------------------------------------------------
[INFO] Reactor Summary:
[INFO] 
[INFO] ActiveMQ .......................................... SUCCESS [3.380s]
[INFO] ActiveMQ :: Client ................................ SUCCESS [1:28.200s]
[INFO] ActiveMQ :: Openwire Legacy Support ............... SUCCESS [7.226s]
[INFO] ActiveMQ :: JAAS .................................. SUCCESS [41.152s]
[INFO] ActiveMQ :: Broker ................................ SUCCESS [1:26.370s]
[INFO] ActiveMQ :: KahaDB Store .......................... SUCCESS [5:13.050s]
[INFO] ActiveMQ :: STOMP Protocol ........................ SUCCESS [12:53.227s]
[INFO] ActiveMQ :: MQTT Protocol ......................... SUCCESS [19:53.148s]
[INFO] ActiveMQ :: JDBC Store ............................ SUCCESS [1.708s]
[INFO] ActiveMQ :: LevelDB Store ......................... SUCCESS [12:01.002s]
[INFO] ActiveMQ :: Generic JMS Pool ...................... SUCCESS [41.515s]
[INFO] ActiveMQ :: Pool .................................. SUCCESS [3.586s]
[INFO] ActiveMQ :: RA .................................... SUCCESS [2:35.845s]
[INFO] ActiveMQ :: Spring ................................ SUCCESS [1:14.915s]
[INFO] ActiveMQ :: AMQP .................................. SUCCESS [9:30.831s]
[INFO] ActiveMQ :: Console ............................... SUCCESS [4.966s]
[INFO] ActiveMQ :: Partition Management .................. SUCCESS [18.673s]
[INFO] ActiveMQ :: Unit Tests ............................ FAILURE [4:48:56.999s]
[INFO] ------------------------------------------------------------------------
[INFO] BUILD FAILURE
[INFO] ------------------------------------------------------------------------
[INFO] Total time: 5:57:29.267s
[INFO] Finished at: Sat Nov 07 03:53:37 UTC 2015
[INFO] Final Memory: 103M/1012M
[INFO] ------------------------------------------------------------------------
Waiting for Jenkins to finish collecting data
[ERROR] Failed to execute goal org.apache.maven.plugins:maven-surefire-plugin:2.16:test (default-test)
on project activemq-unit-tests: ExecutionException; nested exception is java.util.concurrent.ExecutionException:
java.lang.RuntimeException: The forked VM terminated without saying properly goodbye. VM crash
or System.exit called ?
[ERROR] Command was/bin/sh -c cd <https://builds.apache.org/job/ActiveMQ-Java7-All-UnitTests/ws/activemq-unit-tests>
&& /x1/jenkins/tools/java/jdk1.7.0_25-32/jre/bin/java -Xmx512m -jar <https://builds.apache.org/job/ActiveMQ-Java7-All-UnitTests/ws/activemq-unit-tests/target/surefire/surefirebooter8445420260634496147.jar>
<https://builds.apache.org/job/ActiveMQ-Java7-All-UnitTests/ws/activemq-unit-tests/target/surefire/surefire6569426497307188121tmp>
<https://builds.apache.org/job/ActiveMQ-Java7-All-UnitTests/ws/activemq-unit-tests/target/surefire/surefire_4355658407592958420132tmp>
[ERROR] -> [Help 1]
org.apache.maven.lifecycle.LifecycleExecutionException: Failed to execute goal org.apache.maven.plugins:maven-surefire-plugin:2.16:test
(default-test) on project activemq-unit-tests: ExecutionException; nested exception is java.util.concurrent.ExecutionException:
java.lang.RuntimeException: The forked VM terminated without saying properly goodbye. VM crash
or System.exit called ?
Command was/bin/sh -c cd <https://builds.apache.org/job/ActiveMQ-Java7-All-UnitTests/ws/activemq-unit-tests>
&& /x1/jenkins/tools/java/jdk1.7.0_25-32/jre/bin/java -Xmx512m -jar <https://builds.apache.org/job/ActiveMQ-Java7-All-UnitTests/ws/activemq-unit-tests/target/surefire/surefirebooter8445420260634496147.jar>
<https://builds.apache.org/job/ActiveMQ-Java7-All-UnitTests/ws/activemq-unit-tests/target/surefire/surefire6569426497307188121tmp>
<https://builds.apache.org/job/ActiveMQ-Java7-All-UnitTests/ws/activemq-unit-tests/target/surefire/surefire_4355658407592958420132tmp>
	at org.apache.maven.lifecycle.internal.MojoExecutor.execute(MojoExecutor.java:213)
	at org.apache.maven.lifecycle.internal.MojoExecutor.execute(MojoExecutor.java:153)
	at org.apache.maven.lifecycle.internal.MojoExecutor.execute(MojoExecutor.java:145)
	at org.apache.maven.lifecycle.internal.LifecycleModuleBuilder.buildProject(LifecycleModuleBuilder.java:84)
	at org.apache.maven.lifecycle.internal.LifecycleModuleBuilder.buildProject(LifecycleModuleBuilder.java:59)
	at org.apache.maven.lifecycle.internal.LifecycleStarter.singleThreadedBuild(LifecycleStarter.java:183)
	at org.apache.maven.lifecycle.internal.LifecycleStarter.execute(LifecycleStarter.java:161)
	at org.apache.maven.DefaultMaven.doExecute(DefaultMaven.java:320)
	at org.apache.maven.DefaultMaven.execute(DefaultMaven.java:156)
	at org.jvnet.hudson.maven3.launcher.Maven3Launcher.main(Maven3Launcher.java:117)
	at sun.reflect.NativeMethodAccessorImpl.invoke0(Native Method)
	at sun.reflect.NativeMethodAccessorImpl.invoke(NativeMethodAccessorImpl.java:57)
	at sun.reflect.DelegatingMethodAccessorImpl.invoke(DelegatingMethodAccessorImpl.java:43)
	at java.lang.reflect.Method.invoke(Method.java:606)
	at org.codehaus.plexus.classworlds.launcher.Launcher.launchStandard(Launcher.java:329)
	at org.codehaus.plexus.classworlds.launcher.Launcher.launch(Launcher.java:239)
	at org.jvnet.hudson.maven3.agent.Maven3Main.launch(Maven3Main.java:181)
	at sun.reflect.NativeMethodAccessorImpl.invoke0(Native Method)
	at sun.reflect.NativeMethodAccessorImpl.invoke(NativeMethodAccessorImpl.java:57)
	at sun.reflect.DelegatingMethodAccessorImpl.invoke(DelegatingMethodAccessorImpl.java:43)
	at java.lang.reflect.Method.invoke(Method.java:606)
	at hudson.maven.Maven3Builder.call(Maven3Builder.java:136)
	at hudson.maven.Maven3Builder.call(Maven3Builder.java:71)
	at hudson.remoting.UserRequest.perform(UserRequest.java:121)
	at hudson.remoting.UserRequest.perform(UserRequest.java:49)
	at hudson.remoting.Request$2.run(Request.java:326)
	at hudson.remoting.InterceptingExecutorService$1.call(InterceptingExecutorService.java:68)
	at java.util.concurrent.FutureTask$Sync.innerRun(FutureTask.java:334)
	at java.util.concurrent.FutureTask.run(FutureTask.java:166)
	at java.util.concurrent.ThreadPoolExecutor.runWorker(ThreadPoolExecutor.java:1145)
	at java.util.concurrent.ThreadPoolExecutor$Worker.run(ThreadPoolExecutor.java:615)
	at java.lang.Thread.run(Thread.java:724)
Caused by: org.apache.maven.plugin.MojoFailureException: ExecutionException; nested exception
is java.util.concurrent.ExecutionException: java.lang.RuntimeException: The forked VM terminated
without saying properly goodbye. VM crash or System.exit called ?
Command was/bin/sh -c cd <https://builds.apache.org/job/ActiveMQ-Java7-All-UnitTests/ws/activemq-unit-tests>
&& /x1/jenkins/tools/java/jdk1.7.0_25-32/jre/bin/java -Xmx512m -jar <https://builds.apache.org/job/ActiveMQ-Java7-All-UnitTests/ws/activemq-unit-tests/target/surefire/surefirebooter8445420260634496147.jar>
<https://builds.apache.org/job/ActiveMQ-Java7-All-UnitTests/ws/activemq-unit-tests/target/surefire/surefire6569426497307188121tmp>
<https://builds.apache.org/job/ActiveMQ-Java7-All-UnitTests/ws/activemq-unit-tests/target/surefire/surefire_4355658407592958420132tmp>
	at org.apache.maven.plugin.surefire.SurefirePlugin.assertNoException(SurefirePlugin.java:198)
	at org.apache.maven.plugin.surefire.SurefirePlugin.handleSummary(SurefirePlugin.java:188)
	at org.apache.maven.plugin.surefire.AbstractSurefireMojo.executeAfterPreconditionsChecked(AbstractSurefireMojo.java:852)
	at org.apache.maven.plugin.surefire.AbstractSurefireMojo.execute(AbstractSurefireMojo.java:720)
	at org.apache.maven.plugin.DefaultBuildPluginManager.executeMojo(DefaultBuildPluginManager.java:101)
	at org.apache.maven.lifecycle.internal.MojoExecutor.execute(MojoExecutor.java:209)
	... 31 more
Caused by: org.apache.maven.surefire.booter.SurefireBooterForkException: ExecutionException;
nested exception is java.util.concurrent.ExecutionException: java.lang.RuntimeException: The
forked VM terminated without saying properly goodbye. VM crash or System.exit called ?
Command was/bin/sh -c cd <https://builds.apache.org/job/ActiveMQ-Java7-All-UnitTests/ws/activemq-unit-tests>
&& /x1/jenkins/tools/java/jdk1.7.0_25-32/jre/bin/java -Xmx512m -jar <https://builds.apache.org/job/ActiveMQ-Java7-All-UnitTests/ws/activemq-unit-tests/target/surefire/surefirebooter8445420260634496147.jar>
<https://builds.apache.org/job/ActiveMQ-Java7-All-UnitTests/ws/activemq-unit-tests/target/surefire/surefire6569426497307188121tmp>
<https://builds.apache.org/job/ActiveMQ-Java7-All-UnitTests/ws/activemq-unit-tests/target/surefire/surefire_4355658407592958420132tmp>
	at org.apache.maven.plugin.surefire.booterclient.ForkStarter.runSuitesForkPerTestSet(ForkStarter.java:316)
	at org.apache.maven.plugin.surefire.booterclient.ForkStarter.run(ForkStarter.java:169)
	at org.apache.maven.plugin.surefire.AbstractSurefireMojo.executeProvider(AbstractSurefireMojo.java:958)
	at org.apache.maven.plugin.surefire.AbstractSurefireMojo.executeAfterPreconditionsChecked(AbstractSurefireMojo.java:822)
	... 34 more
Caused by: java.util.concurrent.ExecutionException: java.lang.RuntimeException: The forked
VM terminated without saying properly goodbye. VM crash or System.exit called ?
Command was/bin/sh -c cd <https://builds.apache.org/job/ActiveMQ-Java7-All-UnitTests/ws/activemq-unit-tests>
&& /x1/jenkins/tools/java/jdk1.7.0_25-32/jre/bin/java -Xmx512m -jar <https://builds.apache.org/job/ActiveMQ-Java7-All-UnitTests/ws/activemq-unit-tests/target/surefire/surefirebooter8445420260634496147.jar>
<https://builds.apache.org/job/ActiveMQ-Java7-All-UnitTests/ws/activemq-unit-tests/target/surefire/surefire6569426497307188121tmp>
<https://builds.apache.org/job/ActiveMQ-Java7-All-UnitTests/ws/activemq-unit-tests/target/surefire/surefire_4355658407592958420132tmp>
	at java.util.concurrent.FutureTask$Sync.innerGet(FutureTask.java:252)
	at java.util.concurrent.FutureTask.get(FutureTask.java:111)
	at org.apache.maven.plugin.surefire.booterclient.ForkStarter.runSuitesForkPerTestSet(ForkStarter.java:300)
	... 37 more
Caused by: java.lang.RuntimeException: The forked VM terminated without saying properly goodbye.
VM crash or System.exit called ?
Command was/bin/sh -c cd <https://builds.apache.org/job/ActiveMQ-Java7-All-UnitTests/ws/activemq-unit-tests>
&& /x1/jenkins/tools/java/jdk1.7.0_25-32/jre/bin/java -Xmx512m -jar <https://builds.apache.org/job/ActiveMQ-Java7-All-UnitTests/ws/activemq-unit-tests/target/surefire/surefirebooter8445420260634496147.jar>
<https://builds.apache.org/job/ActiveMQ-Java7-All-UnitTests/ws/activemq-unit-tests/target/surefire/surefire6569426497307188121tmp>
<https://builds.apache.org/job/ActiveMQ-Java7-All-UnitTests/ws/activemq-unit-tests/target/surefire/surefire_4355658407592958420132tmp>
	at org.apache.maven.plugin.surefire.booterclient.ForkStarter.fork(ForkStarter.java:485)
	at org.apache.maven.plugin.surefire.booterclient.ForkStarter.fork(ForkStarter.java:352)
	at org.apache.maven.plugin.surefire.booterclient.ForkStarter.access$300(ForkStarter.java:85)
	at org.apache.maven.plugin.surefire.booterclient.ForkStarter$2.call(ForkStarter.java:288)
	at org.apache.maven.plugin.surefire.booterclient.ForkStarter$2.call(ForkStarter.java:283)
	... 5 more
[ERROR] 
[ERROR] Re-run Maven using the -X switch to enable full debug logging.
[ERROR] 
[ERROR] For more information about the errors and possible solutions, please read the following
articles:
[ERROR] [Help 1] http://cwiki.apache.org/confluence/display/MAVEN/MojoFailureException
[ERROR] 
[ERROR] After correcting the problems, you can resume the build with the command
[ERROR]   mvn <goals> -rf :activemq-unit-tests
[JENKINS] Archiving <https://builds.apache.org/job/ActiveMQ-Java7-All-UnitTests/ws/activemq-unit-tests/pom.xml>
to org.apache.activemq/activemq-unit-tests/5.13-SNAPSHOT/activemq-unit-tests-5.13-SNAPSHOT.pom
Compressed 71.13 KB of artifacts by 45.0% relative to #264
[JENKINS] Archiving <https://builds.apache.org/job/ActiveMQ-Java7-All-UnitTests/ws/activemq-openwire-legacy/pom.xml>
to org.apache.activemq/activemq-openwire-legacy/5.13-SNAPSHOT/activemq-openwire-legacy-5.13-SNAPSHOT.pom
[JENKINS] Archiving <https://builds.apache.org/job/ActiveMQ-Java7-All-UnitTests/ws/activemq-openwire-legacy/target/activemq-openwire-legacy-5.13-SNAPSHOT.jar>
to org.apache.activemq/activemq-openwire-legacy/5.13-SNAPSHOT/activemq-openwire-legacy-5.13-SNAPSHOT.jar
[JENKINS] Archiving <https://builds.apache.org/job/ActiveMQ-Java7-All-UnitTests/ws/activemq-jdbc-store/pom.xml>
to org.apache.activemq/activemq-jdbc-store/5.13-SNAPSHOT/activemq-jdbc-store-5.13-SNAPSHOT.pom
[JENKINS] Archiving <https://builds.apache.org/job/ActiveMQ-Java7-All-UnitTests/ws/activemq-jdbc-store/target/activemq-jdbc-store-5.13-SNAPSHOT.jar>
to org.apache.activemq/activemq-jdbc-store/5.13-SNAPSHOT/activemq-jdbc-store-5.13-SNAPSHOT.jar
[JENKINS] Archiving <https://builds.apache.org/job/ActiveMQ-Java7-All-UnitTests/ws/activemq-amqp/pom.xml>
to org.apache.activemq/activemq-amqp/5.13-SNAPSHOT/activemq-amqp-5.13-SNAPSHOT.pom
[JENKINS] Archiving <https://builds.apache.org/job/ActiveMQ-Java7-All-UnitTests/ws/activemq-amqp/target/activemq-amqp-5.13-SNAPSHOT.jar>
to org.apache.activemq/activemq-amqp/5.13-SNAPSHOT/activemq-amqp-5.13-SNAPSHOT.jar
[JENKINS] Archiving <https://builds.apache.org/job/ActiveMQ-Java7-All-UnitTests/ws/activemq-jms-pool/pom.xml>
to org.apache.activemq/activemq-jms-pool/5.13-SNAPSHOT/activemq-jms-pool-5.13-SNAPSHOT.pom
[JENKINS] Archiving <https://builds.apache.org/job/ActiveMQ-Java7-All-UnitTests/ws/activemq-jms-pool/target/activemq-jms-pool-5.13-SNAPSHOT.jar>
to org.apache.activemq/activemq-jms-pool/5.13-SNAPSHOT/activemq-jms-pool-5.13-SNAPSHOT.jar
[JENKINS] Archiving <https://builds.apache.org/job/ActiveMQ-Java7-All-UnitTests/ws/activemq-pool/pom.xml>
to org.apache.activemq/activemq-pool/5.13-SNAPSHOT/activemq-pool-5.13-SNAPSHOT.pom
[JENKINS] Archiving <https://builds.apache.org/job/ActiveMQ-Java7-All-UnitTests/ws/activemq-pool/target/activemq-pool-5.13-SNAPSHOT.jar>
to org.apache.activemq/activemq-pool/5.13-SNAPSHOT/activemq-pool-5.13-SNAPSHOT.jar
[JENKINS] Archiving <https://builds.apache.org/job/ActiveMQ-Java7-All-UnitTests/ws/activemq-stomp/pom.xml>
to org.apache.activemq/activemq-stomp/5.13-SNAPSHOT/activemq-stomp-5.13-SNAPSHOT.pom
[JENKINS] Archiving <https://builds.apache.org/job/ActiveMQ-Java7-All-UnitTests/ws/activemq-stomp/target/activemq-stomp-5.13-SNAPSHOT.jar>
to org.apache.activemq/activemq-stomp/5.13-SNAPSHOT/activemq-stomp-5.13-SNAPSHOT.jar
[JENKINS] Archiving <https://builds.apache.org/job/ActiveMQ-Java7-All-UnitTests/ws/activemq-mqtt/pom.xml>
to org.apache.activemq/activemq-mqtt/5.13-SNAPSHOT/activemq-mqtt-5.13-SNAPSHOT.pom
[JENKINS] Archiving <https://builds.apache.org/job/ActiveMQ-Java7-All-UnitTests/ws/activemq-mqtt/target/activemq-mqtt-5.13-SNAPSHOT.jar>
to org.apache.activemq/activemq-mqtt/5.13-SNAPSHOT/activemq-mqtt-5.13-SNAPSHOT.jar
[JENKINS] Archiving <https://builds.apache.org/job/ActiveMQ-Java7-All-UnitTests/ws/activemq-console/pom.xml>
to org.apache.activemq/activemq-console/5.13-SNAPSHOT/activemq-console-5.13-SNAPSHOT.pom
[JENKINS] Archiving <https://builds.apache.org/job/ActiveMQ-Java7-All-UnitTests/ws/activemq-console/target/activemq-console-5.13-SNAPSHOT.jar>
to org.apache.activemq/activemq-console/5.13-SNAPSHOT/activemq-console-5.13-SNAPSHOT.jar
[JENKINS] Archiving <https://builds.apache.org/job/ActiveMQ-Java7-All-UnitTests/ws/activemq-client/pom.xml>
to org.apache.activemq/activemq-client/5.13-SNAPSHOT/activemq-client-5.13-SNAPSHOT.pom
[JENKINS] Archiving <https://builds.apache.org/job/ActiveMQ-Java7-All-UnitTests/ws/activemq-client/target/activemq-client-5.13-SNAPSHOT.jar>
to org.apache.activemq/activemq-client/5.13-SNAPSHOT/activemq-client-5.13-SNAPSHOT.jar
[JENKINS] Archiving <https://builds.apache.org/job/ActiveMQ-Java7-All-UnitTests/ws/pom.xml>
to org.apache.activemq/activemq-parent/5.13-SNAPSHOT/activemq-parent-5.13-SNAPSHOT.pom
Compressed 58.83 KB of artifacts by 54.4% relative to #269
[JENKINS] Archiving <https://builds.apache.org/job/ActiveMQ-Java7-All-UnitTests/ws/activemq-broker/pom.xml>
to org.apache.activemq/activemq-broker/5.13-SNAPSHOT/activemq-broker-5.13-SNAPSHOT.pom
[JENKINS] Archiving <https://builds.apache.org/job/ActiveMQ-Java7-All-UnitTests/ws/activemq-broker/target/activemq-broker-5.13-SNAPSHOT.jar>
to org.apache.activemq/activemq-broker/5.13-SNAPSHOT/activemq-broker-5.13-SNAPSHOT.jar
[JENKINS] Archiving <https://builds.apache.org/job/ActiveMQ-Java7-All-UnitTests/ws/activemq-broker/target/activemq-broker-5.13-SNAPSHOT-tests.jar>
to org.apache.activemq/activemq-broker/5.13-SNAPSHOT/activemq-broker-5.13-SNAPSHOT-tests.jar
[JENKINS] Archiving <https://builds.apache.org/job/ActiveMQ-Java7-All-UnitTests/ws/activemq-ra/pom.xml>
to org.apache.activemq/activemq-ra/5.13-SNAPSHOT/activemq-ra-5.13-SNAPSHOT.pom
[JENKINS] Archiving <https://builds.apache.org/job/ActiveMQ-Java7-All-UnitTests/ws/activemq-ra/target/activemq-ra-5.13-SNAPSHOT.jar>
to org.apache.activemq/activemq-ra/5.13-SNAPSHOT/activemq-ra-5.13-SNAPSHOT.jar
[JENKINS] Archiving <https://builds.apache.org/job/ActiveMQ-Java7-All-UnitTests/ws/activemq-ra/target/xbean/activemq-ra.xsd>
to org.apache.activemq/activemq-ra/5.13-SNAPSHOT/activemq-ra-5.13-SNAPSHOT.xsd
[JENKINS] Archiving <https://builds.apache.org/job/ActiveMQ-Java7-All-UnitTests/ws/activemq-ra/target/xbean/activemq-ra.xsd.html>
to org.apache.activemq/activemq-ra/5.13-SNAPSHOT/activemq-ra-5.13-SNAPSHOT-schema.html
[JENKINS] Archiving <https://builds.apache.org/job/ActiveMQ-Java7-All-UnitTests/ws/activemq-ra/target/xbean/activemq-ra.xsd.html>
to org.apache.activemq/activemq-ra/5.13-SNAPSHOT/activemq-ra-5.13-SNAPSHOT.xsd.html
[JENKINS] Archiving <https://builds.apache.org/job/ActiveMQ-Java7-All-UnitTests/ws/activemq-spring/pom.xml>
to org.apache.activemq/activemq-spring/5.13-SNAPSHOT/activemq-spring-5.13-SNAPSHOT.pom
[JENKINS] Archiving <https://builds.apache.org/job/ActiveMQ-Java7-All-UnitTests/ws/activemq-spring/target/activemq-spring-5.13-SNAPSHOT.jar>
to org.apache.activemq/activemq-spring/5.13-SNAPSHOT/activemq-spring-5.13-SNAPSHOT.jar
[JENKINS] Archiving <https://builds.apache.org/job/ActiveMQ-Java7-All-UnitTests/ws/activemq-spring/target/classes/activemq.xsd>
to org.apache.activemq/activemq-spring/5.13-SNAPSHOT/activemq-spring-5.13-SNAPSHOT.xsd
[JENKINS] Archiving <https://builds.apache.org/job/ActiveMQ-Java7-All-UnitTests/ws/activemq-spring/target/classes/activemq.xsd.html>
to org.apache.activemq/activemq-spring/5.13-SNAPSHOT/activemq-spring-5.13-SNAPSHOT-schema.html
Compressed 883.81 KB of artifacts by 79.7% relative to #269
[JENKINS] Archiving <https://builds.apache.org/job/ActiveMQ-Java7-All-UnitTests/ws/activemq-kahadb-store/pom.xml>
to org.apache.activemq/activemq-kahadb-store/5.13-SNAPSHOT/activemq-kahadb-store-5.13-SNAPSHOT.pom
[JENKINS] Archiving <https://builds.apache.org/job/ActiveMQ-Java7-All-UnitTests/ws/activemq-kahadb-store/target/activemq-kahadb-store-5.13-SNAPSHOT.jar>
to org.apache.activemq/activemq-kahadb-store/5.13-SNAPSHOT/activemq-kahadb-store-5.13-SNAPSHOT.jar
[JENKINS] Archiving <https://builds.apache.org/job/ActiveMQ-Java7-All-UnitTests/ws/activemq-jaas/pom.xml>
to org.apache.activemq/activemq-jaas/5.13-SNAPSHOT/activemq-jaas-5.13-SNAPSHOT.pom
[JENKINS] Archiving <https://builds.apache.org/job/ActiveMQ-Java7-All-UnitTests/ws/activemq-jaas/target/activemq-jaas-5.13-SNAPSHOT.jar>
to org.apache.activemq/activemq-jaas/5.13-SNAPSHOT/activemq-jaas-5.13-SNAPSHOT.jar
[JENKINS] Archiving <https://builds.apache.org/job/ActiveMQ-Java7-All-UnitTests/ws/activemq-partition/pom.xml>
to org.apache.activemq/activemq-partition/5.13-SNAPSHOT/activemq-partition-5.13-SNAPSHOT.pom
[JENKINS] Archiving <https://builds.apache.org/job/ActiveMQ-Java7-All-UnitTests/ws/activemq-partition/target/activemq-partition-5.13-SNAPSHOT.jar>
to org.apache.activemq/activemq-partition/5.13-SNAPSHOT/activemq-partition-5.13-SNAPSHOT.jar
[JENKINS] Archiving <https://builds.apache.org/job/ActiveMQ-Java7-All-UnitTests/ws/activemq-leveldb-store/pom.xml>
to org.apache.activemq/activemq-leveldb-store/5.13-SNAPSHOT/activemq-leveldb-store-5.13-SNAPSHOT.pom
[JENKINS] Archiving <https://builds.apache.org/job/ActiveMQ-Java7-All-UnitTests/ws/activemq-leveldb-store/target/activemq-leveldb-store-5.13-SNAPSHOT.jar>
to org.apache.activemq/activemq-leveldb-store/5.13-SNAPSHOT/activemq-leveldb-store-5.13-SNAPSHOT.jar
channel stopped
[locks-and-latches] Releasing all the locks
[locks-and-latches] All the locks released

Mime
View raw message