activemq-commits mailing list archives

Site index · List index
Message view « Date » · « Thread »
Top « Date » · « Thread »
From Apache Jenkins Server <jenk...@builds.apache.org>
Subject Build failed in Jenkins: ActiveMQ-Java7 » ActiveMQ :: Spring #869
Date Fri, 13 Nov 2015 07:20:08 GMT
See <https://builds.apache.org/job/ActiveMQ-Java7/org.apache.activemq$activemq-spring/869/>

------------------------------------------
[INFO]                                                                         
[INFO] ------------------------------------------------------------------------
[INFO] Building ActiveMQ :: Spring 5.13-SNAPSHOT
[INFO] ------------------------------------------------------------------------
[INFO] 
[INFO] --- maven-clean-plugin:2.5:clean (default-clean) @ activemq-spring ---
[INFO] Deleting <https://builds.apache.org/job/ActiveMQ-Java7/org.apache.activemq$activemq-spring/ws/target>
[INFO] 
[INFO] --- maven-enforcer-plugin:1.3.1:enforce (default) @ activemq-spring ---
[INFO] 
[INFO] --- maven-bundle-plugin:2.3.7:cleanVersions (cleanVersions) @ activemq-spring ---
[INFO] 
[INFO] --- maven-remote-resources-plugin:1.5:process (default) @ activemq-spring ---
[INFO] 
[INFO] --- maven-resources-plugin:2.7:resources (default-resources) @ activemq-spring ---
[INFO] Using 'UTF-8' encoding to copy filtered resources.
[INFO] Copying 1 resource
[INFO] Copying 3 resources
[INFO] 
[INFO] --- maven-compiler-plugin:3.3:compile (default-compile) @ activemq-spring ---
[INFO] Changes detected - recompiling the module!
[INFO] Compiling 20 source files to <https://builds.apache.org/job/ActiveMQ-Java7/org.apache.activemq$activemq-spring/ws/target/classes>
[INFO] <https://builds.apache.org/job/ActiveMQ-Java7/org.apache.activemq$activemq-spring/ws/src/main/java/org/apache/activemq/spring/SpringBrokerContext.java>:
<https://builds.apache.org/job/ActiveMQ-Java7/org.apache.activemq$activemq-spring/ws/src/main/java/org/apache/activemq/spring/SpringBrokerContext.java>
uses unchecked or unsafe operations.
[INFO] <https://builds.apache.org/job/ActiveMQ-Java7/org.apache.activemq$activemq-spring/ws/src/main/java/org/apache/activemq/spring/SpringBrokerContext.java>:
Recompile with -Xlint:unchecked for details.
[INFO] 
[INFO] --- maven-xbean-plugin:3.12:mapping (default) @ activemq-spring ---
[INFO] Generating META-INF properties file: <https://builds.apache.org/job/ActiveMQ-Java7/org.apache.activemq$activemq-spring/ws/target/classes/META-INF/services/org/apache/xbean/spring/http/activemq.apache.org/schema/core>
for namespace: http://activemq.apache.org/schema/core
[INFO] Generating Spring 2.0 handler mapping: <https://builds.apache.org/job/ActiveMQ-Java7/org.apache.activemq$activemq-spring/ws/target/classes/META-INF/spring.handlers>
for namespace: http://activemq.apache.org/schema/core
[INFO] Generating HTML documentation file: <https://builds.apache.org/job/ActiveMQ-Java7/org.apache.activemq$activemq-spring/ws/target/classes/activemq.xsd.html>
for namespace: http://activemq.apache.org/schema/core
Warning, could not load class: org.apache.camel.CamelContext: java.lang.ClassNotFoundException:
org.apache.camel.CamelContext
Warning, could not load class: org.apache.activemq.camel.component.ActiveMQComponent: java.lang.ClassNotFoundException:
org.apache.activemq.camel.component.ActiveMQComponent
Warning, could not load class: T: java.lang.ClassNotFoundException: T
Warning, could not load class: T: java.lang.ClassNotFoundException: T
Warning, could not load class: org.apache.activemq.partition.dto.Partitioning: java.lang.ClassNotFoundException:
org.apache.activemq.partition.dto.Partitioning
Warning, could not load class: T: java.lang.ClassNotFoundException: T
Warning, could not load class: T: java.lang.ClassNotFoundException: T
[INFO] Generating XSD file: <https://builds.apache.org/job/ActiveMQ-Java7/org.apache.activemq$activemq-spring/ws/target/classes/activemq.xsd>
for namespace: http://activemq.apache.org/schema/core
[INFO] Generating WIKI documentation file: <https://builds.apache.org/job/ActiveMQ-Java7/org.apache.activemq$activemq-spring/ws/target/classes/activemq.xsd.wiki>
for namespace: http://activemq.apache.org/schema/core
[INFO] ...done.
[INFO] 
[INFO] --- maven-resources-plugin:2.7:testResources (default-testResources) @ activemq-spring
---
[INFO] Using 'UTF-8' encoding to copy filtered resources.
[INFO] Copying 8 resources
[INFO] Copying 3 resources
[INFO] 
[INFO] --- maven-compiler-plugin:3.3:testCompile (default-testCompile) @ activemq-spring ---
[INFO] Changes detected - recompiling the module!
[INFO] Compiling 12 source files to <https://builds.apache.org/job/ActiveMQ-Java7/org.apache.activemq$activemq-spring/ws/target/test-classes>
[INFO] 
[INFO] --- maven-surefire-plugin:2.16:test (default-test) @ activemq-spring ---
[INFO] Surefire report directory: <https://builds.apache.org/job/ActiveMQ-Java7/org.apache.activemq$activemq-spring/ws/target/surefire-reports>

-------------------------------------------------------
 T E S T S
-------------------------------------------------------
Running org.apache.activemq.store.leveldb.LevelDBConfigTest
Tests run: 1, Failures: 0, Errors: 0, Skipped: 0, Time elapsed: 2.288 sec - in org.apache.activemq.store.leveldb.LevelDBConfigTest
Running org.apache.activemq.spring.SpringBrokerFactoryTest
Tests run: 1, Failures: 0, Errors: 0, Skipped: 0, Time elapsed: 0.684 sec - in org.apache.activemq.spring.SpringBrokerFactoryTest
Running org.apache.activemq.spring.ListenerTest
Tests run: 2, Failures: 0, Errors: 0, Skipped: 0, Time elapsed: 6.065 sec - in org.apache.activemq.spring.ListenerTest
Running org.apache.activemq.spring.SpringTest
#
# A fatal error has been detected by the Java Runtime Environment:
#
#  SIGSEGV (0xb) at pc=0xce229654, pid=22592, tid=4136627008
#
# JRE version: 7.0_25-b15
# Java VM: Java HotSpot(TM) Server VM (23.25-b01 mixed mode linux-x86 )
# Problematic frame:
# C  [libnet.so+0x14654]  _fini+0x1d0c
#
# Failed to write core dump. Core dumps have been disabled. To enable core dumping, try "ulimit
-c unlimited" before starting Java again
#
# An error report file with more information is saved as:
# <https://builds.apache.org/job/ActiveMQ-Java7/org.apache.activemq$activemq-spring/ws/hs_err_pid22592.log>
#
# If you would like to submit a bug report, please visit:
#   http://bugreport.sun.com/bugreport/crash.jsp
# The crash happened outside the Java Virtual Machine in native code.
# See problematic frame for where to report the bug.
#
Aborted

Results :

Tests run: 4, Failures: 0, Errors: 0, Skipped: 0

[JENKINS] Recording test results

Mime
View raw message