activemq-commits mailing list archives

Site index · List index
Message view « Date » · « Thread »
Top « Date » · « Thread »
From Apache Jenkins Server <jenk...@builds.apache.org>
Subject Build failed in Jenkins: ActiveMQ-Java7-All-UnitTests #255
Date Wed, 14 Oct 2015 01:27:55 GMT
See <https://builds.apache.org/job/ActiveMQ-Java7-All-UnitTests/255/changes>

Changes:

[robbie] AMQ-6009: update to Qpid JMS 0.6.0 release

[christopher.l.shannon] https://issues.apache.org/jira/browse/AMQ-6003 - Upgrade Pax runner
to

[christopher.l.shannon] Updated jodatime to 2.8.2

------------------------------------------
[...truncated 2020 lines...]
Running org.apache.activemq.broker.region.group.MessageGroupMapTest
Tests run: 2, Failures: 0, Errors: 0, Skipped: 0, Time elapsed: 0.049 sec - in org.apache.activemq.broker.region.group.MessageGroupMapTest
Running org.apache.activemq.broker.region.group.MessageGroupTest
Tests run: 3, Failures: 0, Errors: 0, Skipped: 0, Time elapsed: 1.291 sec - in org.apache.activemq.broker.region.group.MessageGroupTest
Running org.apache.activemq.broker.scheduler.JmsCronSchedulerTest
Tests run: 2, Failures: 0, Errors: 0, Skipped: 0, Time elapsed: 150.436 sec - in org.apache.activemq.broker.scheduler.JmsCronSchedulerTest
Running org.apache.activemq.broker.scheduler.JmsSchedulerTest
Tests run: 6, Failures: 0, Errors: 0, Skipped: 0, Time elapsed: 114.269 sec - in org.apache.activemq.broker.scheduler.JmsSchedulerTest
Running org.apache.activemq.broker.scheduler.JobSchedulerBrokerShutdownTest
Tests run: 1, Failures: 0, Errors: 0, Skipped: 0, Time elapsed: 10.381 sec - in org.apache.activemq.broker.scheduler.JobSchedulerBrokerShutdownTest
Running org.apache.activemq.broker.scheduler.JobSchedulerManagementTest
Tests run: 7, Failures: 0, Errors: 0, Skipped: 0, Time elapsed: 89.281 sec - in org.apache.activemq.broker.scheduler.JobSchedulerManagementTest
Running org.apache.activemq.broker.scheduler.JobSchedulerStoreCheckpointTest
Tests run: 1, Failures: 0, Errors: 0, Skipped: 0, Time elapsed: 65.598 sec - in org.apache.activemq.broker.scheduler.JobSchedulerStoreCheckpointTest
Running org.apache.activemq.broker.scheduler.JobSchedulerStoreTest
Tests run: 1, Failures: 0, Errors: 0, Skipped: 0, Time elapsed: 36.555 sec - in org.apache.activemq.broker.scheduler.JobSchedulerStoreTest
Running org.apache.activemq.broker.scheduler.JobSchedulerTest
Tests run: 10, Failures: 0, Errors: 0, Skipped: 0, Time elapsed: 105.817 sec - in org.apache.activemq.broker.scheduler.JobSchedulerTest
Running org.apache.activemq.broker.scheduler.JobSchedulerTxTest
Tests run: 2, Failures: 0, Errors: 0, Skipped: 0, Time elapsed: 17.556 sec - in org.apache.activemq.broker.scheduler.JobSchedulerTxTest
Running org.apache.activemq.broker.scheduler.KahaDBSchedulerIndexRebuildTest
Tests run: 2, Failures: 0, Errors: 0, Skipped: 0, Time elapsed: 44.31 sec - in org.apache.activemq.broker.scheduler.KahaDBSchedulerIndexRebuildTest
Running org.apache.activemq.broker.scheduler.KahaDBSchedulerMissingJournalLogsTest
Tests run: 2, Failures: 0, Errors: 0, Skipped: 0, Time elapsed: 13.078 sec - in org.apache.activemq.broker.scheduler.KahaDBSchedulerMissingJournalLogsTest
Running org.apache.activemq.broker.scheduler.LostScheduledMessagesTest
Tests run: 2, Failures: 0, Errors: 0, Skipped: 0, Time elapsed: 37.132 sec - in org.apache.activemq.broker.scheduler.LostScheduledMessagesTest
Running org.apache.activemq.broker.scheduler.SchedulerDBVersionTest
Tests run: 2, Failures: 0, Errors: 0, Skipped: 1, Time elapsed: 2.706 sec - in org.apache.activemq.broker.scheduler.SchedulerDBVersionTest
Running org.apache.activemq.broker.scheduler.memory.InMemeoryJmsSchedulerTest
Tests run: 6, Failures: 0, Errors: 0, Skipped: 0, Time elapsed: 135.418 sec - in org.apache.activemq.broker.scheduler.memory.InMemeoryJmsSchedulerTest
Running org.apache.activemq.broker.scheduler.memory.InMemoryJmsCronSchedulerTest
Tests run: 2, Failures: 0, Errors: 0, Skipped: 0, Time elapsed: 162.171 sec - in org.apache.activemq.broker.scheduler.memory.InMemoryJmsCronSchedulerTest
Running org.apache.activemq.broker.scheduler.memory.InMemoryJobSchedulerManagementTest
Tests run: 7, Failures: 0, Errors: 0, Skipped: 0, Time elapsed: 75.727 sec - in org.apache.activemq.broker.scheduler.memory.InMemoryJobSchedulerManagementTest
Running org.apache.activemq.broker.scheduler.memory.InMemoryJobSchedulerStoreTest
Tests run: 1, Failures: 0, Errors: 0, Skipped: 0, Time elapsed: 0.363 sec - in org.apache.activemq.broker.scheduler.memory.InMemoryJobSchedulerStoreTest
Running org.apache.activemq.broker.scheduler.memory.InMemoryJobSchedulerTest
Tests run: 10, Failures: 0, Errors: 0, Skipped: 0, Time elapsed: 64.988 sec - in org.apache.activemq.broker.scheduler.memory.InMemoryJobSchedulerTest
Running org.apache.activemq.broker.scheduler.memory.InMemoryJobSchedulerTxTest
Tests run: 2, Failures: 0, Errors: 0, Skipped: 0, Time elapsed: 12.814 sec - in org.apache.activemq.broker.scheduler.memory.InMemoryJobSchedulerTxTest
Running org.apache.activemq.broker.store.DefaultStoreBrokerTest
Tests run: 127, Failures: 0, Errors: 0, Skipped: 0, Time elapsed: 130.328 sec - in org.apache.activemq.broker.store.DefaultStoreBrokerTest
Running org.apache.activemq.broker.store.DefaultStoreRecoveryBrokerTest
Tests run: 9, Failures: 0, Errors: 0, Skipped: 0, Time elapsed: 45.27 sec - in org.apache.activemq.broker.store.DefaultStoreRecoveryBrokerTest
Running org.apache.activemq.broker.store.RecoverExpiredMessagesTest
Tests run: 4, Failures: 0, Errors: 0, Skipped: 0, Time elapsed: 46.53 sec - in org.apache.activemq.broker.store.RecoverExpiredMessagesTest
Running org.apache.activemq.broker.util.DestinationsPluginTest
Tests run: 1, Failures: 0, Errors: 0, Skipped: 0, Time elapsed: 0.85 sec - in org.apache.activemq.broker.util.DestinationsPluginTest
Running org.apache.activemq.broker.util.PluginBrokerTest
Tests run: 1, Failures: 0, Errors: 0, Skipped: 0, Time elapsed: 2.684 sec - in org.apache.activemq.broker.util.PluginBrokerTest
Running org.apache.activemq.broker.util.RedeliveryPluginTest
Tests run: 1, Failures: 0, Errors: 0, Skipped: 0, Time elapsed: 0.41 sec - in org.apache.activemq.broker.util.RedeliveryPluginTest
Running org.apache.activemq.broker.util.TimeStampingBrokerPluginTest
Tests run: 3, Failures: 0, Errors: 0, Skipped: 0, Time elapsed: 3.01 sec - in org.apache.activemq.broker.util.TimeStampingBrokerPluginTest
Running org.apache.activemq.broker.util.TraceBrokerPathPluginTest
Tests run: 1, Failures: 0, Errors: 0, Skipped: 0, Time elapsed: 1.17 sec - in org.apache.activemq.broker.util.TraceBrokerPathPluginTest
Running org.apache.activemq.broker.virtual.CompositeQueueTest
Tests run: 1, Failures: 0, Errors: 0, Skipped: 0, Time elapsed: 1.633 sec - in org.apache.activemq.broker.virtual.CompositeQueueTest
Running org.apache.activemq.broker.virtual.CompositeTopicTest
Tests run: 1, Failures: 0, Errors: 0, Skipped: 0, Time elapsed: 3.268 sec - in org.apache.activemq.broker.virtual.CompositeTopicTest
Running org.apache.activemq.broker.virtual.DestinationInterceptorDurableSubTest
Tests run: 1, Failures: 0, Errors: 0, Skipped: 0, Time elapsed: 1.894 sec - in org.apache.activemq.broker.virtual.DestinationInterceptorDurableSubTest
Running org.apache.activemq.broker.virtual.FilteredQueueTest
Tests run: 1, Failures: 0, Errors: 0, Skipped: 0, Time elapsed: 2.939 sec - in org.apache.activemq.broker.virtual.FilteredQueueTest
Running org.apache.activemq.broker.virtual.MirroredQueueCorrectMemoryUsageTest
Tests run: 1, Failures: 0, Errors: 0, Skipped: 0, Time elapsed: 366.698 sec - in org.apache.activemq.broker.virtual.MirroredQueueCorrectMemoryUsageTest
Running org.apache.activemq.broker.virtual.MirroredQueueTest
Tests run: 2, Failures: 0, Errors: 0, Skipped: 0, Time elapsed: 1.114 sec - in org.apache.activemq.broker.virtual.MirroredQueueTest
Running org.apache.activemq.broker.virtual.MirroredQueueUsingVirtualTopicQueueTest
Tests run: 2, Failures: 0, Errors: 0, Skipped: 0, Time elapsed: 1.057 sec - in org.apache.activemq.broker.virtual.MirroredQueueUsingVirtualTopicQueueTest
Running org.apache.activemq.broker.virtual.VirtualDestPerfTest
Tests run: 2, Failures: 0, Errors: 0, Skipped: 2, Time elapsed: 0.087 sec - in org.apache.activemq.broker.virtual.VirtualDestPerfTest
Running org.apache.activemq.broker.virtual.VirtualTopicDLQTest
Tests run: 1, Failures: 0, Errors: 0, Skipped: 0, Time elapsed: 8.552 sec - in org.apache.activemq.broker.virtual.VirtualTopicDLQTest
Running org.apache.activemq.broker.virtual.VirtualTopicDisconnectSelectorTest
Tests run: 2, Failures: 0, Errors: 0, Skipped: 0, Time elapsed: 5.824 sec - in org.apache.activemq.broker.virtual.VirtualTopicDisconnectSelectorTest
Running org.apache.activemq.broker.virtual.VirtualTopicFanoutPerfTest
Tests run: 1, Failures: 0, Errors: 0, Skipped: 1, Time elapsed: 0.089 sec - in org.apache.activemq.broker.virtual.VirtualTopicFanoutPerfTest
Running org.apache.activemq.broker.virtual.VirtualTopicPubSubTest
Tests run: 2, Failures: 0, Errors: 0, Skipped: 0, Time elapsed: 1.374 sec - in org.apache.activemq.broker.virtual.VirtualTopicPubSubTest
Running org.apache.activemq.broker.virtual.VirtualTopicPubSubUsingXBeanTest
Tests run: 2, Failures: 0, Errors: 0, Skipped: 0, Time elapsed: 1.24 sec - in org.apache.activemq.broker.virtual.VirtualTopicPubSubUsingXBeanTest
Running org.apache.activemq.broker.virtual.VirtualTopicSelectorTest
Tests run: 1, Failures: 0, Errors: 0, Skipped: 0, Time elapsed: 2.073 sec - in org.apache.activemq.broker.virtual.VirtualTopicSelectorTest
Running org.apache.activemq.broker.virtual.VirtualTopicsAndDurableSubsTest
Tests run: 30, Failures: 0, Errors: 0, Skipped: 0, Time elapsed: 27.115 sec - in org.apache.activemq.broker.virtual.VirtualTopicsAndDurableSubsTest
Running org.apache.activemq.bugs.AMQ1687Test
Tests run: 1, Failures: 0, Errors: 0, Skipped: 0, Time elapsed: 1.249 sec - in org.apache.activemq.bugs.AMQ1687Test
Running org.apache.activemq.bugs.AMQ1853Test
Tests run: 1, Failures: 0, Errors: 0, Skipped: 0, Time elapsed: 7.68 sec - in org.apache.activemq.bugs.AMQ1853Test
Running org.apache.activemq.bugs.AMQ1893Test

Results :

Failed tests: 
  RedeliveryRestartWithExceptionTest>CombinationTestSupport.runBare:113->CombinationTestSupport.runBare:107->testValidateRedeliveryFlagOnNonPersistentAfterTransientFailureConnectionDrop:256
redelivery flag set on:0 expected:<true> but was:<false>

Tests run: 1559, Failures: 1, Errors: 0, Skipped: 5

[JENKINS] Recording test results
[INFO] ------------------------------------------------------------------------
[INFO] Reactor Summary:
[INFO] 
[INFO] ActiveMQ .......................................... SUCCESS [4.562s]
[INFO] ActiveMQ :: Client ................................ SUCCESS [1:24.322s]
[INFO] ActiveMQ :: Openwire Legacy Support ............... SUCCESS [12.171s]
[INFO] ActiveMQ :: JAAS .................................. SUCCESS [48.687s]
[INFO] ActiveMQ :: Broker ................................ SUCCESS [1:31.265s]
[INFO] ActiveMQ :: KahaDB Store .......................... SUCCESS [4:43.381s]
[INFO] ActiveMQ :: STOMP Protocol ........................ SUCCESS [11:23.904s]
[INFO] ActiveMQ :: MQTT Protocol ......................... SUCCESS [19:54.103s]
[INFO] ActiveMQ :: JDBC Store ............................ SUCCESS [1.036s]
[INFO] ActiveMQ :: LevelDB Store ......................... SUCCESS [11:39.488s]
[INFO] ActiveMQ :: Generic JMS Pool ...................... SUCCESS [38.452s]
[INFO] ActiveMQ :: Pool .................................. SUCCESS [2.419s]
[INFO] ActiveMQ :: RA .................................... SUCCESS [2:36.940s]
[INFO] ActiveMQ :: Spring ................................ SUCCESS [1:32.397s]
[INFO] ActiveMQ :: AMQP .................................. SUCCESS [10:46.976s]
[INFO] ActiveMQ :: Console ............................... SUCCESS [12.592s]
[INFO] ActiveMQ :: Partition Management .................. SUCCESS [26.604s]
[INFO] ActiveMQ :: Unit Tests ............................ FAILURE [2:24:03.844s]
[INFO] ------------------------------------------------------------------------
[INFO] BUILD FAILURE
[INFO] ------------------------------------------------------------------------
[INFO] Total time: 3:35:45.114s
[INFO] Finished at: Wed Oct 14 01:28:30 UTC 2015
[INFO] Final Memory: 98M/993M
[INFO] ------------------------------------------------------------------------
Waiting for Jenkins to finish collecting data
[ERROR] Failed to execute goal org.apache.maven.plugins:maven-surefire-plugin:2.16:test (default-test)
on project activemq-unit-tests: ExecutionException; nested exception is java.util.concurrent.ExecutionException:
java.lang.RuntimeException: The forked VM terminated without saying properly goodbye. VM crash
or System.exit called ?
[ERROR] Command was/bin/sh -c cd <https://builds.apache.org/job/ActiveMQ-Java7-All-UnitTests/ws/activemq-unit-tests>
&& /x1/jenkins/tools/java/jdk1.7.0_25-32/jre/bin/java -Xmx512m -jar <https://builds.apache.org/job/ActiveMQ-Java7-All-UnitTests/ws/activemq-unit-tests/target/surefire/surefirebooter6222185230243494413.jar>
<https://builds.apache.org/job/ActiveMQ-Java7-All-UnitTests/ws/activemq-unit-tests/target/surefire/surefire9185392890818676957tmp>
<https://builds.apache.org/job/ActiveMQ-Java7-All-UnitTests/ws/activemq-unit-tests/target/surefire/surefire_283931641891730650874tmp>
[ERROR] -> [Help 1]
org.apache.maven.lifecycle.LifecycleExecutionException: Failed to execute goal org.apache.maven.plugins:maven-surefire-plugin:2.16:test
(default-test) on project activemq-unit-tests: ExecutionException; nested exception is java.util.concurrent.ExecutionException:
java.lang.RuntimeException: The forked VM terminated without saying properly goodbye. VM crash
or System.exit called ?
Command was/bin/sh -c cd <https://builds.apache.org/job/ActiveMQ-Java7-All-UnitTests/ws/activemq-unit-tests>
&& /x1/jenkins/tools/java/jdk1.7.0_25-32/jre/bin/java -Xmx512m -jar <https://builds.apache.org/job/ActiveMQ-Java7-All-UnitTests/ws/activemq-unit-tests/target/surefire/surefirebooter6222185230243494413.jar>
<https://builds.apache.org/job/ActiveMQ-Java7-All-UnitTests/ws/activemq-unit-tests/target/surefire/surefire9185392890818676957tmp>
<https://builds.apache.org/job/ActiveMQ-Java7-All-UnitTests/ws/activemq-unit-tests/target/surefire/surefire_283931641891730650874tmp>
	at org.apache.maven.lifecycle.internal.MojoExecutor.execute(MojoExecutor.java:213)
	at org.apache.maven.lifecycle.internal.MojoExecutor.execute(MojoExecutor.java:153)
	at org.apache.maven.lifecycle.internal.MojoExecutor.execute(MojoExecutor.java:145)
	at org.apache.maven.lifecycle.internal.LifecycleModuleBuilder.buildProject(LifecycleModuleBuilder.java:84)
	at org.apache.maven.lifecycle.internal.LifecycleModuleBuilder.buildProject(LifecycleModuleBuilder.java:59)
	at org.apache.maven.lifecycle.internal.LifecycleStarter.singleThreadedBuild(LifecycleStarter.java:183)
	at org.apache.maven.lifecycle.internal.LifecycleStarter.execute(LifecycleStarter.java:161)
	at org.apache.maven.DefaultMaven.doExecute(DefaultMaven.java:320)
	at org.apache.maven.DefaultMaven.execute(DefaultMaven.java:156)
	at org.jvnet.hudson.maven3.launcher.Maven3Launcher.main(Maven3Launcher.java:117)
	at sun.reflect.NativeMethodAccessorImpl.invoke0(Native Method)
	at sun.reflect.NativeMethodAccessorImpl.invoke(NativeMethodAccessorImpl.java:57)
	at sun.reflect.DelegatingMethodAccessorImpl.invoke(DelegatingMethodAccessorImpl.java:43)
	at java.lang.reflect.Method.invoke(Method.java:606)
	at org.codehaus.plexus.classworlds.launcher.Launcher.launchStandard(Launcher.java:329)
	at org.codehaus.plexus.classworlds.launcher.Launcher.launch(Launcher.java:239)
	at org.jvnet.hudson.maven3.agent.Maven3Main.launch(Maven3Main.java:181)
	at sun.reflect.NativeMethodAccessorImpl.invoke0(Native Method)
	at sun.reflect.NativeMethodAccessorImpl.invoke(NativeMethodAccessorImpl.java:57)
	at sun.reflect.DelegatingMethodAccessorImpl.invoke(DelegatingMethodAccessorImpl.java:43)
	at java.lang.reflect.Method.invoke(Method.java:606)
	at hudson.maven.Maven3Builder.call(Maven3Builder.java:136)
	at hudson.maven.Maven3Builder.call(Maven3Builder.java:71)
	at hudson.remoting.UserRequest.perform(UserRequest.java:121)
	at hudson.remoting.UserRequest.perform(UserRequest.java:49)
	at hudson.remoting.Request$2.run(Request.java:326)
	at hudson.remoting.InterceptingExecutorService$1.call(InterceptingExecutorService.java:68)
	at java.util.concurrent.FutureTask$Sync.innerRun(FutureTask.java:334)
	at java.util.concurrent.FutureTask.run(FutureTask.java:166)
	at java.util.concurrent.ThreadPoolExecutor.runWorker(ThreadPoolExecutor.java:1145)
	at java.util.concurrent.ThreadPoolExecutor$Worker.run(ThreadPoolExecutor.java:615)
	at java.lang.Thread.run(Thread.java:724)
Caused by: org.apache.maven.plugin.MojoFailureException: ExecutionException; nested exception
is java.util.concurrent.ExecutionException: java.lang.RuntimeException: The forked VM terminated
without saying properly goodbye. VM crash or System.exit called ?
Command was/bin/sh -c cd <https://builds.apache.org/job/ActiveMQ-Java7-All-UnitTests/ws/activemq-unit-tests>
&& /x1/jenkins/tools/java/jdk1.7.0_25-32/jre/bin/java -Xmx512m -jar <https://builds.apache.org/job/ActiveMQ-Java7-All-UnitTests/ws/activemq-unit-tests/target/surefire/surefirebooter6222185230243494413.jar>
<https://builds.apache.org/job/ActiveMQ-Java7-All-UnitTests/ws/activemq-unit-tests/target/surefire/surefire9185392890818676957tmp>
<https://builds.apache.org/job/ActiveMQ-Java7-All-UnitTests/ws/activemq-unit-tests/target/surefire/surefire_283931641891730650874tmp>
	at org.apache.maven.plugin.surefire.SurefirePlugin.assertNoException(SurefirePlugin.java:198)
	at org.apache.maven.plugin.surefire.SurefirePlugin.handleSummary(SurefirePlugin.java:188)
	at org.apache.maven.plugin.surefire.AbstractSurefireMojo.executeAfterPreconditionsChecked(AbstractSurefireMojo.java:852)
	at org.apache.maven.plugin.surefire.AbstractSurefireMojo.execute(AbstractSurefireMojo.java:720)
	at org.apache.maven.plugin.DefaultBuildPluginManager.executeMojo(DefaultBuildPluginManager.java:101)
	at org.apache.maven.lifecycle.internal.MojoExecutor.execute(MojoExecutor.java:209)
	... 31 more
Caused by: org.apache.maven.surefire.booter.SurefireBooterForkException: ExecutionException;
nested exception is java.util.concurrent.ExecutionException: java.lang.RuntimeException: The
forked VM terminated without saying properly goodbye. VM crash or System.exit called ?
Command was/bin/sh -c cd <https://builds.apache.org/job/ActiveMQ-Java7-All-UnitTests/ws/activemq-unit-tests>
&& /x1/jenkins/tools/java/jdk1.7.0_25-32/jre/bin/java -Xmx512m -jar <https://builds.apache.org/job/ActiveMQ-Java7-All-UnitTests/ws/activemq-unit-tests/target/surefire/surefirebooter6222185230243494413.jar>
<https://builds.apache.org/job/ActiveMQ-Java7-All-UnitTests/ws/activemq-unit-tests/target/surefire/surefire9185392890818676957tmp>
<https://builds.apache.org/job/ActiveMQ-Java7-All-UnitTests/ws/activemq-unit-tests/target/surefire/surefire_283931641891730650874tmp>
	at org.apache.maven.plugin.surefire.booterclient.ForkStarter.runSuitesForkPerTestSet(ForkStarter.java:316)
	at org.apache.maven.plugin.surefire.booterclient.ForkStarter.run(ForkStarter.java:169)
	at org.apache.maven.plugin.surefire.AbstractSurefireMojo.executeProvider(AbstractSurefireMojo.java:958)
	at org.apache.maven.plugin.surefire.AbstractSurefireMojo.executeAfterPreconditionsChecked(AbstractSurefireMojo.java:822)
	... 34 more
Caused by: java.util.concurrent.ExecutionException: java.lang.RuntimeException: The forked
VM terminated without saying properly goodbye. VM crash or System.exit called ?
Command was/bin/sh -c cd <https://builds.apache.org/job/ActiveMQ-Java7-All-UnitTests/ws/activemq-unit-tests>
&& /x1/jenkins/tools/java/jdk1.7.0_25-32/jre/bin/java -Xmx512m -jar <https://builds.apache.org/job/ActiveMQ-Java7-All-UnitTests/ws/activemq-unit-tests/target/surefire/surefirebooter6222185230243494413.jar>
<https://builds.apache.org/job/ActiveMQ-Java7-All-UnitTests/ws/activemq-unit-tests/target/surefire/surefire9185392890818676957tmp>
<https://builds.apache.org/job/ActiveMQ-Java7-All-UnitTests/ws/activemq-unit-tests/target/surefire/surefire_283931641891730650874tmp>
	at java.util.concurrent.FutureTask$Sync.innerGet(FutureTask.java:252)
	at java.util.concurrent.FutureTask.get(FutureTask.java:111)
	at org.apache.maven.plugin.surefire.booterclient.ForkStarter.runSuitesForkPerTestSet(ForkStarter.java:300)
	... 37 more
Caused by: java.lang.RuntimeException: The forked VM terminated without saying properly goodbye.
VM crash or System.exit called ?
Command was/bin/sh -c cd <https://builds.apache.org/job/ActiveMQ-Java7-All-UnitTests/ws/activemq-unit-tests>
&& /x1/jenkins/tools/java/jdk1.7.0_25-32/jre/bin/java -Xmx512m -jar <https://builds.apache.org/job/ActiveMQ-Java7-All-UnitTests/ws/activemq-unit-tests/target/surefire/surefirebooter6222185230243494413.jar>
<https://builds.apache.org/job/ActiveMQ-Java7-All-UnitTests/ws/activemq-unit-tests/target/surefire/surefire9185392890818676957tmp>
<https://builds.apache.org/job/ActiveMQ-Java7-All-UnitTests/ws/activemq-unit-tests/target/surefire/surefire_283931641891730650874tmp>
	at org.apache.maven.plugin.surefire.booterclient.ForkStarter.fork(ForkStarter.java:485)
	at org.apache.maven.plugin.surefire.booterclient.ForkStarter.fork(ForkStarter.java:352)
	at org.apache.maven.plugin.surefire.booterclient.ForkStarter.access$300(ForkStarter.java:85)
	at org.apache.maven.plugin.surefire.booterclient.ForkStarter$2.call(ForkStarter.java:288)
	at org.apache.maven.plugin.surefire.booterclient.ForkStarter$2.call(ForkStarter.java:283)
	... 5 more
[ERROR] 
[ERROR] Re-run Maven using the -X switch to enable full debug logging.
[ERROR] 
[ERROR] For more information about the errors and possible solutions, please read the following
articles:
[ERROR] [Help 1] http://cwiki.apache.org/confluence/display/MAVEN/MojoFailureException
[ERROR] 
[ERROR] After correcting the problems, you can resume the build with the command
[ERROR]   mvn <goals> -rf :activemq-unit-tests
[JENKINS] Archiving <https://builds.apache.org/job/ActiveMQ-Java7-All-UnitTests/ws/activemq-unit-tests/pom.xml>
to org.apache.activemq/activemq-unit-tests/5.13-SNAPSHOT/activemq-unit-tests-5.13-SNAPSHOT.pom
Compressed 71.13 KB of artifacts by 90.0% relative to #250
[JENKINS] Archiving <https://builds.apache.org/job/ActiveMQ-Java7-All-UnitTests/ws/activemq-openwire-legacy/pom.xml>
to org.apache.activemq/activemq-openwire-legacy/5.13-SNAPSHOT/activemq-openwire-legacy-5.13-SNAPSHOT.pom
[JENKINS] Archiving <https://builds.apache.org/job/ActiveMQ-Java7-All-UnitTests/ws/activemq-openwire-legacy/target/activemq-openwire-legacy-5.13-SNAPSHOT.jar>
to org.apache.activemq/activemq-openwire-legacy/5.13-SNAPSHOT/activemq-openwire-legacy-5.13-SNAPSHOT.jar
[JENKINS] Archiving <https://builds.apache.org/job/ActiveMQ-Java7-All-UnitTests/ws/activemq-jdbc-store/pom.xml>
to org.apache.activemq/activemq-jdbc-store/5.13-SNAPSHOT/activemq-jdbc-store-5.13-SNAPSHOT.pom
[JENKINS] Archiving <https://builds.apache.org/job/ActiveMQ-Java7-All-UnitTests/ws/activemq-jdbc-store/target/activemq-jdbc-store-5.13-SNAPSHOT.jar>
to org.apache.activemq/activemq-jdbc-store/5.13-SNAPSHOT/activemq-jdbc-store-5.13-SNAPSHOT.jar
[JENKINS] Archiving <https://builds.apache.org/job/ActiveMQ-Java7-All-UnitTests/ws/activemq-amqp/pom.xml>
to org.apache.activemq/activemq-amqp/5.13-SNAPSHOT/activemq-amqp-5.13-SNAPSHOT.pom
[JENKINS] Archiving <https://builds.apache.org/job/ActiveMQ-Java7-All-UnitTests/ws/activemq-amqp/target/activemq-amqp-5.13-SNAPSHOT.jar>
to org.apache.activemq/activemq-amqp/5.13-SNAPSHOT/activemq-amqp-5.13-SNAPSHOT.jar
[JENKINS] Archiving <https://builds.apache.org/job/ActiveMQ-Java7-All-UnitTests/ws/activemq-jms-pool/pom.xml>
to org.apache.activemq/activemq-jms-pool/5.13-SNAPSHOT/activemq-jms-pool-5.13-SNAPSHOT.pom
[JENKINS] Archiving <https://builds.apache.org/job/ActiveMQ-Java7-All-UnitTests/ws/activemq-jms-pool/target/activemq-jms-pool-5.13-SNAPSHOT.jar>
to org.apache.activemq/activemq-jms-pool/5.13-SNAPSHOT/activemq-jms-pool-5.13-SNAPSHOT.jar
[JENKINS] Archiving <https://builds.apache.org/job/ActiveMQ-Java7-All-UnitTests/ws/activemq-pool/pom.xml>
to org.apache.activemq/activemq-pool/5.13-SNAPSHOT/activemq-pool-5.13-SNAPSHOT.pom
[JENKINS] Archiving <https://builds.apache.org/job/ActiveMQ-Java7-All-UnitTests/ws/activemq-pool/target/activemq-pool-5.13-SNAPSHOT.jar>
to org.apache.activemq/activemq-pool/5.13-SNAPSHOT/activemq-pool-5.13-SNAPSHOT.jar
[JENKINS] Archiving <https://builds.apache.org/job/ActiveMQ-Java7-All-UnitTests/ws/activemq-stomp/pom.xml>
to org.apache.activemq/activemq-stomp/5.13-SNAPSHOT/activemq-stomp-5.13-SNAPSHOT.pom
[JENKINS] Archiving <https://builds.apache.org/job/ActiveMQ-Java7-All-UnitTests/ws/activemq-stomp/target/activemq-stomp-5.13-SNAPSHOT.jar>
to org.apache.activemq/activemq-stomp/5.13-SNAPSHOT/activemq-stomp-5.13-SNAPSHOT.jar
[JENKINS] Archiving <https://builds.apache.org/job/ActiveMQ-Java7-All-UnitTests/ws/activemq-mqtt/pom.xml>
to org.apache.activemq/activemq-mqtt/5.13-SNAPSHOT/activemq-mqtt-5.13-SNAPSHOT.pom
[JENKINS] Archiving <https://builds.apache.org/job/ActiveMQ-Java7-All-UnitTests/ws/activemq-mqtt/target/activemq-mqtt-5.13-SNAPSHOT.jar>
to org.apache.activemq/activemq-mqtt/5.13-SNAPSHOT/activemq-mqtt-5.13-SNAPSHOT.jar
[JENKINS] Archiving <https://builds.apache.org/job/ActiveMQ-Java7-All-UnitTests/ws/activemq-console/pom.xml>
to org.apache.activemq/activemq-console/5.13-SNAPSHOT/activemq-console-5.13-SNAPSHOT.pom
[JENKINS] Archiving <https://builds.apache.org/job/ActiveMQ-Java7-All-UnitTests/ws/activemq-console/target/activemq-console-5.13-SNAPSHOT.jar>
to org.apache.activemq/activemq-console/5.13-SNAPSHOT/activemq-console-5.13-SNAPSHOT.jar
[JENKINS] Archiving <https://builds.apache.org/job/ActiveMQ-Java7-All-UnitTests/ws/activemq-client/pom.xml>
to org.apache.activemq/activemq-client/5.13-SNAPSHOT/activemq-client-5.13-SNAPSHOT.pom
[JENKINS] Archiving <https://builds.apache.org/job/ActiveMQ-Java7-All-UnitTests/ws/activemq-client/target/activemq-client-5.13-SNAPSHOT.jar>
to org.apache.activemq/activemq-client/5.13-SNAPSHOT/activemq-client-5.13-SNAPSHOT.jar
[JENKINS] Archiving <https://builds.apache.org/job/ActiveMQ-Java7-All-UnitTests/ws/pom.xml>
to org.apache.activemq/activemq-parent/5.13-SNAPSHOT/activemq-parent-5.13-SNAPSHOT.pom
[JENKINS] Archiving <https://builds.apache.org/job/ActiveMQ-Java7-All-UnitTests/ws/activemq-broker/pom.xml>
to org.apache.activemq/activemq-broker/5.13-SNAPSHOT/activemq-broker-5.13-SNAPSHOT.pom
[JENKINS] Archiving <https://builds.apache.org/job/ActiveMQ-Java7-All-UnitTests/ws/activemq-broker/target/activemq-broker-5.13-SNAPSHOT.jar>
to org.apache.activemq/activemq-broker/5.13-SNAPSHOT/activemq-broker-5.13-SNAPSHOT.jar
[JENKINS] Archiving <https://builds.apache.org/job/ActiveMQ-Java7-All-UnitTests/ws/activemq-broker/target/activemq-broker-5.13-SNAPSHOT-tests.jar>
to org.apache.activemq/activemq-broker/5.13-SNAPSHOT/activemq-broker-5.13-SNAPSHOT-tests.jar
[JENKINS] Archiving <https://builds.apache.org/job/ActiveMQ-Java7-All-UnitTests/ws/activemq-ra/pom.xml>
to org.apache.activemq/activemq-ra/5.13-SNAPSHOT/activemq-ra-5.13-SNAPSHOT.pom
[JENKINS] Archiving <https://builds.apache.org/job/ActiveMQ-Java7-All-UnitTests/ws/activemq-ra/target/activemq-ra-5.13-SNAPSHOT.jar>
to org.apache.activemq/activemq-ra/5.13-SNAPSHOT/activemq-ra-5.13-SNAPSHOT.jar
[JENKINS] Archiving <https://builds.apache.org/job/ActiveMQ-Java7-All-UnitTests/ws/activemq-ra/target/xbean/activemq-ra.xsd>
to org.apache.activemq/activemq-ra/5.13-SNAPSHOT/activemq-ra-5.13-SNAPSHOT.xsd
[JENKINS] Archiving <https://builds.apache.org/job/ActiveMQ-Java7-All-UnitTests/ws/activemq-ra/target/xbean/activemq-ra.xsd.html>
to org.apache.activemq/activemq-ra/5.13-SNAPSHOT/activemq-ra-5.13-SNAPSHOT-schema.html
[JENKINS] Archiving <https://builds.apache.org/job/ActiveMQ-Java7-All-UnitTests/ws/activemq-ra/target/xbean/activemq-ra.xsd.html>
to org.apache.activemq/activemq-ra/5.13-SNAPSHOT/activemq-ra-5.13-SNAPSHOT.xsd.html
[JENKINS] Archiving <https://builds.apache.org/job/ActiveMQ-Java7-All-UnitTests/ws/activemq-spring/pom.xml>
to org.apache.activemq/activemq-spring/5.13-SNAPSHOT/activemq-spring-5.13-SNAPSHOT.pom
[JENKINS] Archiving <https://builds.apache.org/job/ActiveMQ-Java7-All-UnitTests/ws/activemq-spring/target/activemq-spring-5.13-SNAPSHOT.jar>
to org.apache.activemq/activemq-spring/5.13-SNAPSHOT/activemq-spring-5.13-SNAPSHOT.jar
[JENKINS] Archiving <https://builds.apache.org/job/ActiveMQ-Java7-All-UnitTests/ws/activemq-spring/target/classes/activemq.xsd>
to org.apache.activemq/activemq-spring/5.13-SNAPSHOT/activemq-spring-5.13-SNAPSHOT.xsd
[JENKINS] Archiving <https://builds.apache.org/job/ActiveMQ-Java7-All-UnitTests/ws/activemq-spring/target/classes/activemq.xsd.html>
to org.apache.activemq/activemq-spring/5.13-SNAPSHOT/activemq-spring-5.13-SNAPSHOT-schema.html
Compressed 883.82 KB of artifacts by 76.0% relative to #254
[JENKINS] Archiving <https://builds.apache.org/job/ActiveMQ-Java7-All-UnitTests/ws/activemq-kahadb-store/pom.xml>
to org.apache.activemq/activemq-kahadb-store/5.13-SNAPSHOT/activemq-kahadb-store-5.13-SNAPSHOT.pom
[JENKINS] Archiving <https://builds.apache.org/job/ActiveMQ-Java7-All-UnitTests/ws/activemq-kahadb-store/target/activemq-kahadb-store-5.13-SNAPSHOT.jar>
to org.apache.activemq/activemq-kahadb-store/5.13-SNAPSHOT/activemq-kahadb-store-5.13-SNAPSHOT.jar
[JENKINS] Archiving <https://builds.apache.org/job/ActiveMQ-Java7-All-UnitTests/ws/activemq-jaas/pom.xml>
to org.apache.activemq/activemq-jaas/5.13-SNAPSHOT/activemq-jaas-5.13-SNAPSHOT.pom
[JENKINS] Archiving <https://builds.apache.org/job/ActiveMQ-Java7-All-UnitTests/ws/activemq-jaas/target/activemq-jaas-5.13-SNAPSHOT.jar>
to org.apache.activemq/activemq-jaas/5.13-SNAPSHOT/activemq-jaas-5.13-SNAPSHOT.jar
[JENKINS] Archiving <https://builds.apache.org/job/ActiveMQ-Java7-All-UnitTests/ws/activemq-partition/pom.xml>
to org.apache.activemq/activemq-partition/5.13-SNAPSHOT/activemq-partition-5.13-SNAPSHOT.pom
[JENKINS] Archiving <https://builds.apache.org/job/ActiveMQ-Java7-All-UnitTests/ws/activemq-partition/target/activemq-partition-5.13-SNAPSHOT.jar>
to org.apache.activemq/activemq-partition/5.13-SNAPSHOT/activemq-partition-5.13-SNAPSHOT.jar
[JENKINS] Archiving <https://builds.apache.org/job/ActiveMQ-Java7-All-UnitTests/ws/activemq-leveldb-store/pom.xml>
to org.apache.activemq/activemq-leveldb-store/5.13-SNAPSHOT/activemq-leveldb-store-5.13-SNAPSHOT.pom
[JENKINS] Archiving <https://builds.apache.org/job/ActiveMQ-Java7-All-UnitTests/ws/activemq-leveldb-store/target/activemq-leveldb-store-5.13-SNAPSHOT.jar>
to org.apache.activemq/activemq-leveldb-store/5.13-SNAPSHOT/activemq-leveldb-store-5.13-SNAPSHOT.jar
channel stopped
[locks-and-latches] Releasing all the locks
[locks-and-latches] All the locks released

Mime
View raw message