activemq-commits mailing list archives

Site index · List index
Message view « Date » · « Thread »
Top « Date » · « Thread »
From Apache Jenkins Server <jenk...@builds.apache.org>
Subject Build failed in Jenkins: ActiveMQ-Java7-All-UnitTests #254
Date Tue, 13 Oct 2015 07:57:30 GMT
See <https://builds.apache.org/job/ActiveMQ-Java7-All-UnitTests/254/changes>

Changes:

[christopher.l.shannon] Adding my key

[christopher.l.shannon] fixing KEYS format

[christopher.l.shannon] Adding schema for 5.12.1 release

------------------------------------------
[...truncated 3701 lines...]
Running org.apache.activemq.openwire.v9.ControlCommandTest
Tests run: 1, Failures: 0, Errors: 0, Skipped: 0, Time elapsed: 0.228 sec - in org.apache.activemq.openwire.v9.ControlCommandTest
Running org.apache.activemq.openwire.v9.DataArrayResponseTest
Tests run: 1, Failures: 0, Errors: 0, Skipped: 0, Time elapsed: 0.25 sec - in org.apache.activemq.openwire.v9.DataArrayResponseTest
Running org.apache.activemq.openwire.v9.DataResponseTest
Tests run: 1, Failures: 0, Errors: 0, Skipped: 0, Time elapsed: 0.251 sec - in org.apache.activemq.openwire.v9.DataResponseTest
Running org.apache.activemq.openwire.v9.DestinationInfoTest
Tests run: 1, Failures: 0, Errors: 0, Skipped: 0, Time elapsed: 0.256 sec - in org.apache.activemq.openwire.v9.DestinationInfoTest
Running org.apache.activemq.openwire.v9.DiscoveryEventTest
Tests run: 1, Failures: 0, Errors: 0, Skipped: 0, Time elapsed: 0.216 sec - in org.apache.activemq.openwire.v9.DiscoveryEventTest
Running org.apache.activemq.openwire.v9.ExceptionResponseTest
Tests run: 1, Failures: 0, Errors: 0, Skipped: 0, Time elapsed: 0.228 sec - in org.apache.activemq.openwire.v9.ExceptionResponseTest
Running org.apache.activemq.openwire.v9.FlushCommandTest
Tests run: 1, Failures: 0, Errors: 0, Skipped: 0, Time elapsed: 0.262 sec - in org.apache.activemq.openwire.v9.FlushCommandTest
Running org.apache.activemq.openwire.v9.IntegerResponseTest
Tests run: 1, Failures: 0, Errors: 0, Skipped: 0, Time elapsed: 0.255 sec - in org.apache.activemq.openwire.v9.IntegerResponseTest
Running org.apache.activemq.openwire.v9.JournalQueueAckTest
Tests run: 1, Failures: 0, Errors: 0, Skipped: 0, Time elapsed: 0.317 sec - in org.apache.activemq.openwire.v9.JournalQueueAckTest
Running org.apache.activemq.openwire.v9.JournalTopicAckTest
Tests run: 1, Failures: 0, Errors: 0, Skipped: 0, Time elapsed: 0.321 sec - in org.apache.activemq.openwire.v9.JournalTopicAckTest
Running org.apache.activemq.openwire.v9.JournalTraceTest
Tests run: 1, Failures: 0, Errors: 0, Skipped: 0, Time elapsed: 0.26 sec - in org.apache.activemq.openwire.v9.JournalTraceTest
Running org.apache.activemq.openwire.v9.JournalTransactionTest
Tests run: 1, Failures: 0, Errors: 0, Skipped: 0, Time elapsed: 0.269 sec - in org.apache.activemq.openwire.v9.JournalTransactionTest
Running org.apache.activemq.openwire.v9.KeepAliveInfoTest
Tests run: 1, Failures: 0, Errors: 0, Skipped: 0, Time elapsed: 0.252 sec - in org.apache.activemq.openwire.v9.KeepAliveInfoTest
Running org.apache.activemq.openwire.v9.LastPartialCommandTest
Tests run: 1, Failures: 0, Errors: 0, Skipped: 0, Time elapsed: 0.252 sec - in org.apache.activemq.openwire.v9.LastPartialCommandTest
Running org.apache.activemq.openwire.v9.LocalTransactionIdTest
Tests run: 1, Failures: 0, Errors: 0, Skipped: 0, Time elapsed: 0.286 sec - in org.apache.activemq.openwire.v9.LocalTransactionIdTest
Running org.apache.activemq.openwire.v9.MessageAckTest
Tests run: 1, Failures: 0, Errors: 0, Skipped: 0, Time elapsed: 0.296 sec - in org.apache.activemq.openwire.v9.MessageAckTest
Running org.apache.activemq.openwire.v9.MessageDispatchNotificationTest
Tests run: 1, Failures: 0, Errors: 0, Skipped: 0, Time elapsed: 0.271 sec - in org.apache.activemq.openwire.v9.MessageDispatchNotificationTest
Running org.apache.activemq.openwire.v9.MessageDispatchTest
Tests run: 1, Failures: 0, Errors: 0, Skipped: 0, Time elapsed: 0.323 sec - in org.apache.activemq.openwire.v9.MessageDispatchTest
Running org.apache.activemq.openwire.v9.MessageIdTest

Results :

Failed tests: 
  kahaDbJdbcLeaseQueueMasterSlaveTest>CombinationTestSupport.runBare:113->CombinationTestSupport.runBare:107->QueueMasterSlaveTestSupport.testVirtualTopicFailover:133
null
  AMQ1853Test.testConsumerMessagesAreNotOrdered:139 for message ID:asf910.gq1.ygridcore.net-36450-1444710326448-7:1:1:1:5
counter =  2

Tests in error: 
  AMQ2870Test.testSize:120->sendMessage:169 » TestTimedOut test timed out after ...
  AMQ5266Test.startBroker:140 » IO Failed to start database 'derbydb' with class...
  AMQ5266Test.startBroker:140 » IO Failed to start database 'derbydb' with class...
  AMQ5266Test.startBroker:140 » IO Failed to start database 'derbydb' with class...
  AMQ5266Test.startBroker:140 » IO Failed to start database 'derbydb' with class...
  AMQ5266Test.startBroker:140 » IO Failed to start database 'derbydb' with class...
  AMQ5567Test>CombinationTestSupport.runBare:107->BrokerTestSupport.setUp:86 » IO
  AMQ5567Test>CombinationTestSupport.runBare:107->BrokerTestSupport.setUp:86 » IO
  AMQ5863CompositePublishTest.startBroker:76 » IO Failed to start database 'derb...

Tests run: 2892, Failures: 2, Errors: 3, Skipped: 9

Tests run: 1, Failures: 0, Errors: 0, Skipped: 0, Time elapsed: 0.226 sec - in org.apache.activemq.openwire.v9.MessageIdTest
[WARNING] Could not delete temp direcotry <https://builds.apache.org/job/ActiveMQ-Java7-All-UnitTests/ws/activemq-unit-tests/target/surefire>
because Directory <https://builds.apache.org/job/ActiveMQ-Java7-All-UnitTests/ws/activemq-unit-tests/target/surefire>
unable to be deleted.
Running org.apache.activemq.openwire.v9.MessagePullTest
[JENKINS] Recording test results
Tests run: 1, Failures: 0, Errors: 0, Skipped: 0, Time elapsed: 0.267 sec - in org.apache.activemq.openwire.v9.MessagePullTest
Running org.apache.activemq.openwire.v9.NetworkBridgeFilterTest
Tests run: 1, Failures: 0, Errors: 0, Skipped: 0, Time elapsed: 0.229 sec - in org.apache.activemq.openwire.v9.NetworkBridgeFilterTest
Running org.apache.activemq.openwire.v9.PartialCommandTest
Tests run: 1, Failures: 0, Errors: 0, Skipped: 0, Time elapsed: 0.227 sec - in org.apache.activemq.openwire.v9.PartialCommandTest
Running org.apache.activemq.openwire.v9.ProducerAckTest
Tests run: 1, Failures: 0, Errors: 0, Skipped: 0, Time elapsed: 0.248 sec - in org.apache.activemq.openwire.v9.ProducerAckTest
Running org.apache.activemq.openwire.v9.ProducerIdTest
Tests run: 1, Failures: 0, Errors: 0, Skipped: 0, Time elapsed: 0.22 sec - in org.apache.activemq.openwire.v9.ProducerIdTest
Running org.apache.activemq.openwire.v9.ProducerInfoTest
Tests run: 1, Failures: 0, Errors: 0, Skipped: 0, Time elapsed: 0.267 sec - in org.apache.activemq.openwire.v9.ProducerInfoTest
Running org.apache.activemq.openwire.v9.RemoveInfoTest
Tests run: 1, Failures: 0, Errors: 0, Skipped: 0, Time elapsed: 0.251 sec - in org.apache.activemq.openwire.v9.RemoveInfoTest
Running org.apache.activemq.openwire.v9.RemoveSubscriptionInfoTest
Tests run: 1, Failures: 0, Errors: 0, Skipped: 0, Time elapsed: 0.23 sec - in org.apache.activemq.openwire.v9.RemoveSubscriptionInfoTest
Running org.apache.activemq.openwire.v9.ReplayCommandTest
Tests run: 1, Failures: 0, Errors: 0, Skipped: 0, Time elapsed: 0.222 sec - in org.apache.activemq.openwire.v9.ReplayCommandTest
Running org.apache.activemq.openwire.v9.ResponseTest
Tests run: 1, Failures: 0, Errors: 0, Skipped: 0, Time elapsed: 0.223 sec - in org.apache.activemq.openwire.v9.ResponseTest
Running org.apache.activemq.openwire.v9.SessionIdTest
Tests run: 1, Failures: 0, Errors: 0, Skipped: 0, Time elapsed: 0.226 sec - in org.apache.activemq.openwire.v9.SessionIdTest
Running org.apache.activemq.openwire.v9.SessionInfoTest
Tests run: 1, Failures: 0, Errors: 0, Skipped: 0, Time elapsed: 0.233 sec - in org.apache.activemq.openwire.v9.SessionInfoTest
Running org.apache.activemq.openwire.v9.ShutdownInfoTest
Tests run: 1, Failures: 0, Errors: 0, Skipped: 0, Time elapsed: 0.237 sec - in org.apache.activemq.openwire.v9.ShutdownInfoTest
Running org.apache.activemq.openwire.v9.SubscriptionInfoTest
Tests run: 1, Failures: 0, Errors: 0, Skipped: 0, Time elapsed: 0.25 sec - in org.apache.activemq.openwire.v9.SubscriptionInfoTest
Running org.apache.activemq.openwire.v9.TransactionInfoTest
Tests run: 1, Failures: 0, Errors: 0, Skipped: 0, Time elapsed: 0.244 sec - in org.apache.activemq.openwire.v9.TransactionInfoTest
Running org.apache.activemq.openwire.v9.XATransactionIdTest
Tests run: 1, Failures: 0, Errors: 0, Skipped: 0, Time elapsed: 0.235 sec - in org.apache.activemq.openwire.v9.XATransactionIdTest
Running org.apache.activemq.plugin.BrokerStatisticsPluginTest
Tests run: 5, Failures: 0, Errors: 0, Skipped: 0, Time elapsed: 6.321 sec - in org.apache.activemq.plugin.BrokerStatisticsPluginTest
[INFO] ------------------------------------------------------------------------
[INFO] Reactor Summary:
[INFO] 
[INFO] ActiveMQ .......................................... SUCCESS [3.524s]
[INFO] ActiveMQ :: Client ................................ SUCCESS [1:34.271s]
[INFO] ActiveMQ :: Openwire Legacy Support ............... SUCCESS [2.416s]
[INFO] ActiveMQ :: JAAS .................................. SUCCESS [37.626s]
[INFO] ActiveMQ :: Broker ................................ SUCCESS [1:21.853s]
[INFO] ActiveMQ :: KahaDB Store .......................... SUCCESS [3:43.249s]
[INFO] ActiveMQ :: STOMP Protocol ........................ SUCCESS [11:57.224s]
[INFO] ActiveMQ :: MQTT Protocol ......................... SUCCESS [20:17.230s]
[INFO] ActiveMQ :: JDBC Store ............................ SUCCESS [1.396s]
[INFO] ActiveMQ :: LevelDB Store ......................... SUCCESS [8:58.572s]
[INFO] ActiveMQ :: Generic JMS Pool ...................... SUCCESS [45.092s]
[INFO] ActiveMQ :: Pool .................................. SUCCESS [2.882s]
[INFO] ActiveMQ :: RA .................................... SUCCESS [2:37.541s]
[INFO] ActiveMQ :: Spring ................................ SUCCESS [1:11.254s]
[INFO] ActiveMQ :: AMQP .................................. SUCCESS [8:51.050s]
[INFO] ActiveMQ :: Console ............................... SUCCESS [4.723s]
[INFO] ActiveMQ :: Partition Management .................. SUCCESS [19.485s]
[INFO] ActiveMQ :: Unit Tests ............................ FAILURE [5:42:36.837s]
[INFO] ------------------------------------------------------------------------
[INFO] BUILD FAILURE
[INFO] ------------------------------------------------------------------------
[INFO] Total time: 6:45:18.195s
[INFO] Finished at: Tue Oct 13 07:57:56 UTC 2015
[INFO] Final Memory: 114M/1021M
[INFO] ------------------------------------------------------------------------
Running org.apache.activemq.pool.JmsSendReceiveTwoConnectionsWithSenderUsingPoolTest
Tests run: 1, Failures: 0, Errors: 0, Skipped: 0, Time elapsed: 1.792 sec - in org.apache.activemq.pool.JmsSendReceiveTwoConnectionsWithSenderUsingPoolTest
Running org.apache.activemq.proxy.AMQ4889Test
Waiting for Jenkins to finish collecting data
Tests run: 1, Failures: 0, Errors: 0, Skipped: 0, Time elapsed: 2.106 sec - in org.apache.activemq.proxy.AMQ4889Test
Running org.apache.activemq.proxy.ProxyFailoverTest
[ERROR] Failed to execute goal org.apache.maven.plugins:maven-surefire-plugin:2.16:test (default-test)
on project activemq-unit-tests: ExecutionException; nested exception is java.util.concurrent.ExecutionException:
java.lang.RuntimeException: The forked VM terminated without saying properly goodbye. VM crash
or System.exit called ?
[ERROR] Command was/bin/sh -c cd <https://builds.apache.org/job/ActiveMQ-Java7-All-UnitTests/ws/activemq-unit-tests>
&& /home/jenkins/tools/java/jdk1.7.0_25-32/jre/bin/java -Xmx512m -jar <https://builds.apache.org/job/ActiveMQ-Java7-All-UnitTests/ws/activemq-unit-tests/target/surefire/surefirebooter3069918709515771887.jar>
<https://builds.apache.org/job/ActiveMQ-Java7-All-UnitTests/ws/activemq-unit-tests/target/surefire/surefire4574681826927470093tmp>
<https://builds.apache.org/job/ActiveMQ-Java7-All-UnitTests/ws/activemq-unit-tests/target/surefire/surefire_4974992586666995801642tmp>
[ERROR] -> [Help 1]
org.apache.maven.lifecycle.LifecycleExecutionException: Failed to execute goal org.apache.maven.plugins:maven-surefire-plugin:2.16:test
(default-test) on project activemq-unit-tests: ExecutionException; nested exception is java.util.concurrent.ExecutionException:
java.lang.RuntimeException: The forked VM terminated without saying properly goodbye. VM crash
or System.exit called ?
Command was/bin/sh -c cd <https://builds.apache.org/job/ActiveMQ-Java7-All-UnitTests/ws/activemq-unit-tests>
&& /home/jenkins/tools/java/jdk1.7.0_25-32/jre/bin/java -Xmx512m -jar <https://builds.apache.org/job/ActiveMQ-Java7-All-UnitTests/ws/activemq-unit-tests/target/surefire/surefirebooter3069918709515771887.jar>
<https://builds.apache.org/job/ActiveMQ-Java7-All-UnitTests/ws/activemq-unit-tests/target/surefire/surefire4574681826927470093tmp>
<https://builds.apache.org/job/ActiveMQ-Java7-All-UnitTests/ws/activemq-unit-tests/target/surefire/surefire_4974992586666995801642tmp>
	at org.apache.maven.lifecycle.internal.MojoExecutor.execute(MojoExecutor.java:213)
	at org.apache.maven.lifecycle.internal.MojoExecutor.execute(MojoExecutor.java:153)
	at org.apache.maven.lifecycle.internal.MojoExecutor.execute(MojoExecutor.java:145)
	at org.apache.maven.lifecycle.internal.LifecycleModuleBuilder.buildProject(LifecycleModuleBuilder.java:84)
	at org.apache.maven.lifecycle.internal.LifecycleModuleBuilder.buildProject(LifecycleModuleBuilder.java:59)
	at org.apache.maven.lifecycle.internal.LifecycleStarter.singleThreadedBuild(LifecycleStarter.java:183)
	at org.apache.maven.lifecycle.internal.LifecycleStarter.execute(LifecycleStarter.java:161)
	at org.apache.maven.DefaultMaven.doExecute(DefaultMaven.java:320)
	at org.apache.maven.DefaultMaven.execute(DefaultMaven.java:156)
	at org.jvnet.hudson.maven3.launcher.Maven3Launcher.main(Maven3Launcher.java:117)
	at sun.reflect.NativeMethodAccessorImpl.invoke0(Native Method)
	at sun.reflect.NativeMethodAccessorImpl.invoke(NativeMethodAccessorImpl.java:57)
	at sun.reflect.DelegatingMethodAccessorImpl.invoke(DelegatingMethodAccessorImpl.java:43)
	at java.lang.reflect.Method.invoke(Method.java:606)
	at org.codehaus.plexus.classworlds.launcher.Launcher.launchStandard(Launcher.java:329)
	at org.codehaus.plexus.classworlds.launcher.Launcher.launch(Launcher.java:239)
	at org.jvnet.hudson.maven3.agent.Maven3Main.launch(Maven3Main.java:181)
	at sun.reflect.NativeMethodAccessorImpl.invoke0(Native Method)
	at sun.reflect.NativeMethodAccessorImpl.invoke(NativeMethodAccessorImpl.java:57)
	at sun.reflect.DelegatingMethodAccessorImpl.invoke(DelegatingMethodAccessorImpl.java:43)
	at java.lang.reflect.Method.invoke(Method.java:606)
	at hudson.maven.Maven3Builder.call(Maven3Builder.java:136)
	at hudson.maven.Maven3Builder.call(Maven3Builder.java:71)
	at hudson.remoting.UserRequest.perform(UserRequest.java:121)
	at hudson.remoting.UserRequest.perform(UserRequest.java:49)
	at hudson.remoting.Request$2.run(Request.java:326)
	at hudson.remoting.InterceptingExecutorService$1.call(InterceptingExecutorService.java:68)
	at java.util.concurrent.FutureTask$Sync.innerRun(FutureTask.java:334)
	at java.util.concurrent.FutureTask.run(FutureTask.java:166)
	at java.util.concurrent.ThreadPoolExecutor.runWorker(ThreadPoolExecutor.java:1145)
	at java.util.concurrent.ThreadPoolExecutor$Worker.run(ThreadPoolExecutor.java:615)
	at java.lang.Thread.run(Thread.java:724)
Caused by: org.apache.maven.plugin.MojoFailureException: ExecutionException; nested exception
is java.util.concurrent.ExecutionException: java.lang.RuntimeException: The forked VM terminated
without saying properly goodbye. VM crash or System.exit called ?
Command was/bin/sh -c cd <https://builds.apache.org/job/ActiveMQ-Java7-All-UnitTests/ws/activemq-unit-tests>
&& /home/jenkins/tools/java/jdk1.7.0_25-32/jre/bin/java -Xmx512m -jar <https://builds.apache.org/job/ActiveMQ-Java7-All-UnitTests/ws/activemq-unit-tests/target/surefire/surefirebooter3069918709515771887.jar>
<https://builds.apache.org/job/ActiveMQ-Java7-All-UnitTests/ws/activemq-unit-tests/target/surefire/surefire4574681826927470093tmp>
<https://builds.apache.org/job/ActiveMQ-Java7-All-UnitTests/ws/activemq-unit-tests/target/surefire/surefire_4974992586666995801642tmp>
	at org.apache.maven.plugin.surefire.SurefirePlugin.assertNoException(SurefirePlugin.java:198)
	at org.apache.maven.plugin.surefire.SurefirePlugin.handleSummary(SurefirePlugin.java:188)
	at org.apache.maven.plugin.surefire.AbstractSurefireMojo.executeAfterPreconditionsChecked(AbstractSurefireMojo.java:852)
	at org.apache.maven.plugin.surefire.AbstractSurefireMojo.execute(AbstractSurefireMojo.java:720)
	at org.apache.maven.plugin.DefaultBuildPluginManager.executeMojo(DefaultBuildPluginManager.java:101)
	at org.apache.maven.lifecycle.internal.MojoExecutor.execute(MojoExecutor.java:209)
	... 31 more
Caused by: org.apache.maven.surefire.booter.SurefireBooterForkException: ExecutionException;
nested exception is java.util.concurrent.ExecutionException: java.lang.RuntimeException: The
forked VM terminated without saying properly goodbye. VM crash or System.exit called ?
Command was/bin/sh -c cd <https://builds.apache.org/job/ActiveMQ-Java7-All-UnitTests/ws/activemq-unit-tests>
&& /home/jenkins/tools/java/jdk1.7.0_25-32/jre/bin/java -Xmx512m -jar <https://builds.apache.org/job/ActiveMQ-Java7-All-UnitTests/ws/activemq-unit-tests/target/surefire/surefirebooter3069918709515771887.jar>
<https://builds.apache.org/job/ActiveMQ-Java7-All-UnitTests/ws/activemq-unit-tests/target/surefire/surefire4574681826927470093tmp>
<https://builds.apache.org/job/ActiveMQ-Java7-All-UnitTests/ws/activemq-unit-tests/target/surefire/surefire_4974992586666995801642tmp>
	at org.apache.maven.plugin.surefire.booterclient.ForkStarter.runSuitesForkPerTestSet(ForkStarter.java:316)
	at org.apache.maven.plugin.surefire.booterclient.ForkStarter.run(ForkStarter.java:169)
	at org.apache.maven.plugin.surefire.AbstractSurefireMojo.executeProvider(AbstractSurefireMojo.java:958)
	at org.apache.maven.plugin.surefire.AbstractSurefireMojo.executeAfterPreconditionsChecked(AbstractSurefireMojo.java:822)
	... 34 more
Caused by: java.util.concurrent.ExecutionException: java.lang.RuntimeException: The forked
VM terminated without saying properly goodbye. VM crash or System.exit called ?
Command was/bin/sh -c cd <https://builds.apache.org/job/ActiveMQ-Java7-All-UnitTests/ws/activemq-unit-tests>
&& /home/jenkins/tools/java/jdk1.7.0_25-32/jre/bin/java -Xmx512m -jar <https://builds.apache.org/job/ActiveMQ-Java7-All-UnitTests/ws/activemq-unit-tests/target/surefire/surefirebooter3069918709515771887.jar>
<https://builds.apache.org/job/ActiveMQ-Java7-All-UnitTests/ws/activemq-unit-tests/target/surefire/surefire4574681826927470093tmp>
<https://builds.apache.org/job/ActiveMQ-Java7-All-UnitTests/ws/activemq-unit-tests/target/surefire/surefire_4974992586666995801642tmp>
	at java.util.concurrent.FutureTask$Sync.innerGet(FutureTask.java:252)
	at java.util.concurrent.FutureTask.get(FutureTask.java:111)
	at org.apache.maven.plugin.surefire.booterclient.ForkStarter.runSuitesForkPerTestSet(ForkStarter.java:300)
	... 37 more
Caused by: java.lang.RuntimeException: The forked VM terminated without saying properly goodbye.
VM crash or System.exit called ?
Command was/bin/sh -c cd <https://builds.apache.org/job/ActiveMQ-Java7-All-UnitTests/ws/activemq-unit-tests>
&& /home/jenkins/tools/java/jdk1.7.0_25-32/jre/bin/java -Xmx512m -jar <https://builds.apache.org/job/ActiveMQ-Java7-All-UnitTests/ws/activemq-unit-tests/target/surefire/surefirebooter3069918709515771887.jar>
<https://builds.apache.org/job/ActiveMQ-Java7-All-UnitTests/ws/activemq-unit-tests/target/surefire/surefire4574681826927470093tmp>
<https://builds.apache.org/job/ActiveMQ-Java7-All-UnitTests/ws/activemq-unit-tests/target/surefire/surefire_4974992586666995801642tmp>
	at org.apache.maven.plugin.surefire.booterclient.ForkStarter.fork(ForkStarter.java:485)
	at org.apache.maven.plugin.surefire.booterclient.ForkStarter.fork(ForkStarter.java:352)
	at org.apache.maven.plugin.surefire.booterclient.ForkStarter.access$300(ForkStarter.java:85)
	at org.apache.maven.plugin.surefire.booterclient.ForkStarter$2.call(ForkStarter.java:288)
	at org.apache.maven.plugin.surefire.booterclient.ForkStarter$2.call(ForkStarter.java:283)
	... 5 more
[ERROR] 
[ERROR] Re-run Maven using the -X switch to enable full debug logging.
[ERROR] 
[ERROR] For more information about the errors and possible solutions, please read the following
articles:
[ERROR] [Help 1] http://cwiki.apache.org/confluence/display/MAVEN/MojoFailureException
[ERROR] 
[ERROR] After correcting the problems, you can resume the build with the command
[ERROR]   mvn <goals> -rf :activemq-unit-tests
[JENKINS] Archiving <https://builds.apache.org/job/ActiveMQ-Java7-All-UnitTests/ws/activemq-unit-tests/pom.xml>
to org.apache.activemq/activemq-unit-tests/5.13-SNAPSHOT/activemq-unit-tests-5.13-SNAPSHOT.pom
Compressed 71.13 KB of artifacts by 90.0% relative to #250
[JENKINS] Archiving <https://builds.apache.org/job/ActiveMQ-Java7-All-UnitTests/ws/activemq-openwire-legacy/pom.xml>
to org.apache.activemq/activemq-openwire-legacy/5.13-SNAPSHOT/activemq-openwire-legacy-5.13-SNAPSHOT.pom
[JENKINS] Archiving <https://builds.apache.org/job/ActiveMQ-Java7-All-UnitTests/ws/activemq-openwire-legacy/target/activemq-openwire-legacy-5.13-SNAPSHOT.jar>
to org.apache.activemq/activemq-openwire-legacy/5.13-SNAPSHOT/activemq-openwire-legacy-5.13-SNAPSHOT.jar
[JENKINS] Archiving <https://builds.apache.org/job/ActiveMQ-Java7-All-UnitTests/ws/activemq-jdbc-store/pom.xml>
to org.apache.activemq/activemq-jdbc-store/5.13-SNAPSHOT/activemq-jdbc-store-5.13-SNAPSHOT.pom
[JENKINS] Archiving <https://builds.apache.org/job/ActiveMQ-Java7-All-UnitTests/ws/activemq-jdbc-store/target/activemq-jdbc-store-5.13-SNAPSHOT.jar>
to org.apache.activemq/activemq-jdbc-store/5.13-SNAPSHOT/activemq-jdbc-store-5.13-SNAPSHOT.jar
[JENKINS] Archiving <https://builds.apache.org/job/ActiveMQ-Java7-All-UnitTests/ws/activemq-amqp/pom.xml>
to org.apache.activemq/activemq-amqp/5.13-SNAPSHOT/activemq-amqp-5.13-SNAPSHOT.pom
[JENKINS] Archiving <https://builds.apache.org/job/ActiveMQ-Java7-All-UnitTests/ws/activemq-amqp/target/activemq-amqp-5.13-SNAPSHOT.jar>
to org.apache.activemq/activemq-amqp/5.13-SNAPSHOT/activemq-amqp-5.13-SNAPSHOT.jar
[JENKINS] Archiving <https://builds.apache.org/job/ActiveMQ-Java7-All-UnitTests/ws/activemq-jms-pool/pom.xml>
to org.apache.activemq/activemq-jms-pool/5.13-SNAPSHOT/activemq-jms-pool-5.13-SNAPSHOT.pom
[JENKINS] Archiving <https://builds.apache.org/job/ActiveMQ-Java7-All-UnitTests/ws/activemq-jms-pool/target/activemq-jms-pool-5.13-SNAPSHOT.jar>
to org.apache.activemq/activemq-jms-pool/5.13-SNAPSHOT/activemq-jms-pool-5.13-SNAPSHOT.jar
[JENKINS] Archiving <https://builds.apache.org/job/ActiveMQ-Java7-All-UnitTests/ws/activemq-pool/pom.xml>
to org.apache.activemq/activemq-pool/5.13-SNAPSHOT/activemq-pool-5.13-SNAPSHOT.pom
[JENKINS] Archiving <https://builds.apache.org/job/ActiveMQ-Java7-All-UnitTests/ws/activemq-pool/target/activemq-pool-5.13-SNAPSHOT.jar>
to org.apache.activemq/activemq-pool/5.13-SNAPSHOT/activemq-pool-5.13-SNAPSHOT.jar
[JENKINS] Archiving <https://builds.apache.org/job/ActiveMQ-Java7-All-UnitTests/ws/activemq-stomp/pom.xml>
to org.apache.activemq/activemq-stomp/5.13-SNAPSHOT/activemq-stomp-5.13-SNAPSHOT.pom
[JENKINS] Archiving <https://builds.apache.org/job/ActiveMQ-Java7-All-UnitTests/ws/activemq-stomp/target/activemq-stomp-5.13-SNAPSHOT.jar>
to org.apache.activemq/activemq-stomp/5.13-SNAPSHOT/activemq-stomp-5.13-SNAPSHOT.jar
[JENKINS] Archiving <https://builds.apache.org/job/ActiveMQ-Java7-All-UnitTests/ws/activemq-mqtt/pom.xml>
to org.apache.activemq/activemq-mqtt/5.13-SNAPSHOT/activemq-mqtt-5.13-SNAPSHOT.pom
[JENKINS] Archiving <https://builds.apache.org/job/ActiveMQ-Java7-All-UnitTests/ws/activemq-mqtt/target/activemq-mqtt-5.13-SNAPSHOT.jar>
to org.apache.activemq/activemq-mqtt/5.13-SNAPSHOT/activemq-mqtt-5.13-SNAPSHOT.jar
[JENKINS] Archiving <https://builds.apache.org/job/ActiveMQ-Java7-All-UnitTests/ws/activemq-console/pom.xml>
to org.apache.activemq/activemq-console/5.13-SNAPSHOT/activemq-console-5.13-SNAPSHOT.pom
[JENKINS] Archiving <https://builds.apache.org/job/ActiveMQ-Java7-All-UnitTests/ws/activemq-console/target/activemq-console-5.13-SNAPSHOT.jar>
to org.apache.activemq/activemq-console/5.13-SNAPSHOT/activemq-console-5.13-SNAPSHOT.jar
[JENKINS] Archiving <https://builds.apache.org/job/ActiveMQ-Java7-All-UnitTests/ws/activemq-client/pom.xml>
to org.apache.activemq/activemq-client/5.13-SNAPSHOT/activemq-client-5.13-SNAPSHOT.pom
[JENKINS] Archiving <https://builds.apache.org/job/ActiveMQ-Java7-All-UnitTests/ws/activemq-client/target/activemq-client-5.13-SNAPSHOT.jar>
to org.apache.activemq/activemq-client/5.13-SNAPSHOT/activemq-client-5.13-SNAPSHOT.jar
[JENKINS] Archiving <https://builds.apache.org/job/ActiveMQ-Java7-All-UnitTests/ws/pom.xml>
to org.apache.activemq/activemq-parent/5.13-SNAPSHOT/activemq-parent-5.13-SNAPSHOT.pom
Compressed 58.83 KB of artifacts by 54.4% relative to #253
[JENKINS] Archiving <https://builds.apache.org/job/ActiveMQ-Java7-All-UnitTests/ws/activemq-broker/pom.xml>
to org.apache.activemq/activemq-broker/5.13-SNAPSHOT/activemq-broker-5.13-SNAPSHOT.pom
[JENKINS] Archiving <https://builds.apache.org/job/ActiveMQ-Java7-All-UnitTests/ws/activemq-broker/target/activemq-broker-5.13-SNAPSHOT.jar>
to org.apache.activemq/activemq-broker/5.13-SNAPSHOT/activemq-broker-5.13-SNAPSHOT.jar
[JENKINS] Archiving <https://builds.apache.org/job/ActiveMQ-Java7-All-UnitTests/ws/activemq-broker/target/activemq-broker-5.13-SNAPSHOT-tests.jar>
to org.apache.activemq/activemq-broker/5.13-SNAPSHOT/activemq-broker-5.13-SNAPSHOT-tests.jar
[JENKINS] Archiving <https://builds.apache.org/job/ActiveMQ-Java7-All-UnitTests/ws/activemq-ra/pom.xml>
to org.apache.activemq/activemq-ra/5.13-SNAPSHOT/activemq-ra-5.13-SNAPSHOT.pom
[JENKINS] Archiving <https://builds.apache.org/job/ActiveMQ-Java7-All-UnitTests/ws/activemq-ra/target/activemq-ra-5.13-SNAPSHOT.jar>
to org.apache.activemq/activemq-ra/5.13-SNAPSHOT/activemq-ra-5.13-SNAPSHOT.jar
[JENKINS] Archiving <https://builds.apache.org/job/ActiveMQ-Java7-All-UnitTests/ws/activemq-ra/target/xbean/activemq-ra.xsd>
to org.apache.activemq/activemq-ra/5.13-SNAPSHOT/activemq-ra-5.13-SNAPSHOT.xsd
[JENKINS] Archiving <https://builds.apache.org/job/ActiveMQ-Java7-All-UnitTests/ws/activemq-ra/target/xbean/activemq-ra.xsd.html>
to org.apache.activemq/activemq-ra/5.13-SNAPSHOT/activemq-ra-5.13-SNAPSHOT-schema.html
[JENKINS] Archiving <https://builds.apache.org/job/ActiveMQ-Java7-All-UnitTests/ws/activemq-ra/target/xbean/activemq-ra.xsd.html>
to org.apache.activemq/activemq-ra/5.13-SNAPSHOT/activemq-ra-5.13-SNAPSHOT.xsd.html
[JENKINS] Archiving <https://builds.apache.org/job/ActiveMQ-Java7-All-UnitTests/ws/activemq-spring/pom.xml>
to org.apache.activemq/activemq-spring/5.13-SNAPSHOT/activemq-spring-5.13-SNAPSHOT.pom
[JENKINS] Archiving <https://builds.apache.org/job/ActiveMQ-Java7-All-UnitTests/ws/activemq-spring/target/activemq-spring-5.13-SNAPSHOT.jar>
to org.apache.activemq/activemq-spring/5.13-SNAPSHOT/activemq-spring-5.13-SNAPSHOT.jar
[JENKINS] Archiving <https://builds.apache.org/job/ActiveMQ-Java7-All-UnitTests/ws/activemq-spring/target/classes/activemq.xsd>
to org.apache.activemq/activemq-spring/5.13-SNAPSHOT/activemq-spring-5.13-SNAPSHOT.xsd
[JENKINS] Archiving <https://builds.apache.org/job/ActiveMQ-Java7-All-UnitTests/ws/activemq-spring/target/classes/activemq.xsd.html>
to org.apache.activemq/activemq-spring/5.13-SNAPSHOT/activemq-spring-5.13-SNAPSHOT-schema.html
Compressed 883.82 KB of artifacts by 76.0% relative to #252
[JENKINS] Archiving <https://builds.apache.org/job/ActiveMQ-Java7-All-UnitTests/ws/activemq-kahadb-store/pom.xml>
to org.apache.activemq/activemq-kahadb-store/5.13-SNAPSHOT/activemq-kahadb-store-5.13-SNAPSHOT.pom
[JENKINS] Archiving <https://builds.apache.org/job/ActiveMQ-Java7-All-UnitTests/ws/activemq-kahadb-store/target/activemq-kahadb-store-5.13-SNAPSHOT.jar>
to org.apache.activemq/activemq-kahadb-store/5.13-SNAPSHOT/activemq-kahadb-store-5.13-SNAPSHOT.jar
[JENKINS] Archiving <https://builds.apache.org/job/ActiveMQ-Java7-All-UnitTests/ws/activemq-jaas/pom.xml>
to org.apache.activemq/activemq-jaas/5.13-SNAPSHOT/activemq-jaas-5.13-SNAPSHOT.pom
[JENKINS] Archiving <https://builds.apache.org/job/ActiveMQ-Java7-All-UnitTests/ws/activemq-jaas/target/activemq-jaas-5.13-SNAPSHOT.jar>
to org.apache.activemq/activemq-jaas/5.13-SNAPSHOT/activemq-jaas-5.13-SNAPSHOT.jar
[JENKINS] Archiving <https://builds.apache.org/job/ActiveMQ-Java7-All-UnitTests/ws/activemq-partition/pom.xml>
to org.apache.activemq/activemq-partition/5.13-SNAPSHOT/activemq-partition-5.13-SNAPSHOT.pom
[JENKINS] Archiving <https://builds.apache.org/job/ActiveMQ-Java7-All-UnitTests/ws/activemq-partition/target/activemq-partition-5.13-SNAPSHOT.jar>
to org.apache.activemq/activemq-partition/5.13-SNAPSHOT/activemq-partition-5.13-SNAPSHOT.jar
[JENKINS] Archiving <https://builds.apache.org/job/ActiveMQ-Java7-All-UnitTests/ws/activemq-leveldb-store/pom.xml>
to org.apache.activemq/activemq-leveldb-store/5.13-SNAPSHOT/activemq-leveldb-store-5.13-SNAPSHOT.pom
[JENKINS] Archiving <https://builds.apache.org/job/ActiveMQ-Java7-All-UnitTests/ws/activemq-leveldb-store/target/activemq-leveldb-store-5.13-SNAPSHOT.jar>
to org.apache.activemq/activemq-leveldb-store/5.13-SNAPSHOT/activemq-leveldb-store-5.13-SNAPSHOT.jar
channel stopped
[locks-and-latches] Releasing all the locks
[locks-and-latches] All the locks released

Mime
View raw message