activemq-commits mailing list archives

Site index · List index
Message view « Date » · « Thread »
Top « Date » · « Thread »
From Apache Jenkins Server <jenk...@builds.apache.org>
Subject Build failed in Jenkins: ActiveMQ-Java8 » ActiveMQ :: Unit Tests #510
Date Tue, 20 Oct 2015 15:00:58 GMT
See <https://builds.apache.org/job/ActiveMQ-Java8/org.apache.activemq$activemq-unit-tests/510/>

------------------------------------------
[...truncated 707 lines...]
Tests run: 10, Failures: 0, Errors: 0, Skipped: 0, Time elapsed: 1.678 sec - in org.apache.activemq.security.SimpleAuthenticationPluginNoUsersTest
Running org.apache.activemq.security.SimpleAuthenticationPluginSeparatorTest
Tests run: 29, Failures: 0, Errors: 0, Skipped: 0, Time elapsed: 16.052 sec - in org.apache.activemq.security.SimpleAuthenticationPluginSeparatorTest
Running org.apache.activemq.security.SimpleAuthenticationPluginTest
Tests run: 33, Failures: 0, Errors: 0, Skipped: 0, Time elapsed: 18.316 sec - in org.apache.activemq.security.SimpleAuthenticationPluginTest
Running org.apache.activemq.security.SimpleAuthorizationMapTest
Tests run: 5, Failures: 0, Errors: 0, Skipped: 0, Time elapsed: 0.161 sec - in org.apache.activemq.security.SimpleAuthorizationMapTest
Running org.apache.activemq.security.SimpleSecurityBrokerSystemTest
Tests run: 60, Failures: 0, Errors: 0, Skipped: 0, Time elapsed: 18.493 sec - in org.apache.activemq.security.SimpleSecurityBrokerSystemTest
Running org.apache.activemq.security.TextFileCertificateLoginModuleTest
Tests run: 2, Failures: 0, Errors: 0, Skipped: 0, Time elapsed: 0.916 sec - in org.apache.activemq.security.TextFileCertificateLoginModuleTest
Running org.apache.activemq.security.XBeanSecurityTest
Tests run: 29, Failures: 0, Errors: 0, Skipped: 0, Time elapsed: 11.797 sec - in org.apache.activemq.security.XBeanSecurityTest
Running org.apache.activemq.security.XBeanSecurityWithGuestTest
Tests run: 7, Failures: 0, Errors: 0, Skipped: 0, Time elapsed: 2.168 sec - in org.apache.activemq.security.XBeanSecurityWithGuestTest
Running org.apache.activemq.selector.SelectorParserTest
Tests run: 3, Failures: 0, Errors: 0, Skipped: 0, Time elapsed: 0.192 sec - in org.apache.activemq.selector.SelectorParserTest
Running org.apache.activemq.selector.SelectorTest
Tests run: 21, Failures: 0, Errors: 0, Skipped: 0, Time elapsed: 0.417 sec - in org.apache.activemq.selector.SelectorTest
Running org.apache.activemq.selector.UnknownHandlingSelectorTest
Tests run: 7, Failures: 0, Errors: 0, Skipped: 0, Time elapsed: 0.144 sec - in org.apache.activemq.selector.UnknownHandlingSelectorTest
Running org.apache.activemq.spring.ActiveMQConnectionFactoryFactoryBeanTest
Tests run: 6, Failures: 0, Errors: 0, Skipped: 0, Time elapsed: 0.163 sec - in org.apache.activemq.spring.ActiveMQConnectionFactoryFactoryBeanTest
Running org.apache.activemq.spring.SpringTest
Tests run: 7, Failures: 0, Errors: 0, Skipped: 0, Time elapsed: 12.633 sec - in org.apache.activemq.spring.SpringTest
Running org.apache.activemq.statistics.DurableSubscriptionInflightMessageSizeTest
Tests run: 32, Failures: 0, Errors: 0, Skipped: 6, Time elapsed: 117.091 sec - in org.apache.activemq.statistics.DurableSubscriptionInflightMessageSizeTest
Running org.apache.activemq.statistics.QueueSubscriptionInflightMessageSizeTest
Tests run: 32, Failures: 0, Errors: 0, Skipped: 6, Time elapsed: 113.589 sec - in org.apache.activemq.statistics.QueueSubscriptionInflightMessageSizeTest
Running org.apache.activemq.statistics.TopicSubscriptionInflightMessageSizeTest
Tests run: 32, Failures: 0, Errors: 0, Skipped: 6, Time elapsed: 64.062 sec - in org.apache.activemq.statistics.TopicSubscriptionInflightMessageSizeTest
Running org.apache.activemq.store.LevelDBStorePerDestinationTest
Tests run: 6, Failures: 0, Errors: 0, Skipped: 0, Time elapsed: 93.944 sec - in org.apache.activemq.store.LevelDBStorePerDestinationTest
Running org.apache.activemq.store.SharedFileLockerTest
Tests run: 3, Failures: 0, Errors: 0, Skipped: 0, Time elapsed: 8.507 sec - in org.apache.activemq.store.SharedFileLockerTest
Running org.apache.activemq.store.jdbc.DatabaseLockerConfigTest
Tests run: 4, Failures: 0, Errors: 0, Skipped: 0, Time elapsed: 0.174 sec - in org.apache.activemq.store.jdbc.DatabaseLockerConfigTest
Running org.apache.activemq.store.jdbc.JDBCIOExceptionHandlerMockeryTest
Tests run: 1, Failures: 0, Errors: 0, Skipped: 0, Time elapsed: 1.69 sec - in org.apache.activemq.store.jdbc.JDBCIOExceptionHandlerMockeryTest
Running org.apache.activemq.store.jdbc.JDBCIOExceptionHandlerTest
Tests run: 4, Failures: 0, Errors: 0, Skipped: 0, Time elapsed: 31.141 sec - in org.apache.activemq.store.jdbc.JDBCIOExceptionHandlerTest
Running org.apache.activemq.store.jdbc.JDBCLockTablePrefixTest
Tests run: 1, Failures: 0, Errors: 0, Skipped: 0, Time elapsed: 11.07 sec - in org.apache.activemq.store.jdbc.JDBCLockTablePrefixTest
Running org.apache.activemq.store.jdbc.JDBCStoreAutoCommitTest
Tests run: 3, Failures: 0, Errors: 0, Skipped: 0, Time elapsed: 11.051 sec - in org.apache.activemq.store.jdbc.JDBCStoreAutoCommitTest
Running org.apache.activemq.store.jdbc.JDBCTablePrefixAssignedTest
Tests run: 1, Failures: 0, Errors: 0, Skipped: 0, Time elapsed: 8.014 sec - in org.apache.activemq.store.jdbc.JDBCTablePrefixAssignedTest
Running org.apache.activemq.store.jdbc.LeaseDatabaseLockerTest
Tests run: 5, Failures: 0, Errors: 0, Skipped: 0, Time elapsed: 58.409 sec - in org.apache.activemq.store.jdbc.LeaseDatabaseLockerTest
Running org.apache.activemq.store.jdbc.TransactionContextTest
Tests run: 2, Failures: 0, Errors: 0, Skipped: 0, Time elapsed: 0.984 sec - in org.apache.activemq.store.jdbc.TransactionContextTest
Running org.apache.activemq.store.kahadb.CustomLockerTest
Tests run: 1, Failures: 0, Errors: 0, Skipped: 0, Time elapsed: 2.121 sec - in org.apache.activemq.store.kahadb.CustomLockerTest
Running org.apache.activemq.store.kahadb.KahaDBDeleteLockTest
Tests run: 2, Failures: 0, Errors: 0, Skipped: 0, Time elapsed: 5.751 sec - in org.apache.activemq.store.kahadb.KahaDBDeleteLockTest
Running org.apache.activemq.store.kahadb.KahaDBIndexLocationTest
Tests run: 2, Failures: 0, Errors: 0, Skipped: 0, Time elapsed: 6.218 sec - in org.apache.activemq.store.kahadb.KahaDBIndexLocationTest
Running org.apache.activemq.store.kahadb.KahaDBMessageStoreSizeStatTest
Tests run: 7, Failures: 0, Errors: 0, Skipped: 0, Time elapsed: 68.584 sec - in org.apache.activemq.store.kahadb.KahaDBMessageStoreSizeStatTest
Running org.apache.activemq.store.kahadb.KahaDBMessageStoreSizeTest
Tests run: 4, Failures: 0, Errors: 0, Skipped: 0, Time elapsed: 5.024 sec - in org.apache.activemq.store.kahadb.KahaDBMessageStoreSizeTest
Running org.apache.activemq.store.kahadb.KahaDBPersistenceAdapterTest
Tests run: 2, Failures: 0, Errors: 0, Skipped: 0, Time elapsed: 2.747 sec - in org.apache.activemq.store.kahadb.KahaDBPersistenceAdapterTest
Running org.apache.activemq.store.kahadb.KahaDBStoreBrokerTest
Tests run: 127, Failures: 0, Errors: 0, Skipped: 0, Time elapsed: 105.695 sec - in org.apache.activemq.store.kahadb.KahaDBStoreBrokerTest
Running org.apache.activemq.store.kahadb.KahaDBStoreOrderTest
Tests run: 2, Failures: 0, Errors: 0, Skipped: 0, Time elapsed: 4.972 sec - in org.apache.activemq.store.kahadb.KahaDBStoreOrderTest
Running org.apache.activemq.store.kahadb.MultiKahaDBMessageStoreSizeStatTest
Tests run: 8, Failures: 0, Errors: 0, Skipped: 0, Time elapsed: 93.156 sec - in org.apache.activemq.store.kahadb.MultiKahaDBMessageStoreSizeStatTest
Running org.apache.activemq.store.kahadb.MultiKahaDBMessageStoreSizeTest
Tests run: 4, Failures: 0, Errors: 0, Skipped: 0, Time elapsed: 5.437 sec - in org.apache.activemq.store.kahadb.MultiKahaDBMessageStoreSizeTest
Running org.apache.activemq.store.kahadb.MultiKahaDBQueueDeletionTest
Tests run: 8, Failures: 0, Errors: 0, Skipped: 0, Time elapsed: 7.438 sec - in org.apache.activemq.store.kahadb.MultiKahaDBQueueDeletionTest
Running org.apache.activemq.store.kahadb.MultiKahaDBTopicDeletionTest
Tests run: 8, Failures: 0, Errors: 0, Skipped: 0, Time elapsed: 7.551 sec - in org.apache.activemq.store.kahadb.MultiKahaDBTopicDeletionTest
Running org.apache.activemq.store.kahadb.NoSpaceIOTest
Tests run: 1, Failures: 0, Errors: 0, Skipped: 1, Time elapsed: 0.066 sec - in org.apache.activemq.store.kahadb.NoSpaceIOTest
Running org.apache.activemq.store.kahadb.PBMesssagesTest
Tests run: 1, Failures: 0, Errors: 0, Skipped: 0, Time elapsed: 0.054 sec - in org.apache.activemq.store.kahadb.PBMesssagesTest
Running org.apache.activemq.store.kahadb.SubscriptionRecoveryTest
Tests run: 2, Failures: 0, Errors: 0, Skipped: 0, Time elapsed: 90.861 sec - in org.apache.activemq.store.kahadb.SubscriptionRecoveryTest
Running org.apache.activemq.store.kahadb.TempKahaDBStoreBrokerTest
Tests run: 127, Failures: 0, Errors: 0, Skipped: 0, Time elapsed: 128.666 sec - in org.apache.activemq.store.kahadb.TempKahaDBStoreBrokerTest
Running org.apache.activemq.store.kahadb.plist.KahaDBFilePendingMessageCursorTest
Tests run: 3, Failures: 0, Errors: 0, Skipped: 0, Time elapsed: 3.214 sec - in org.apache.activemq.store.kahadb.plist.KahaDBFilePendingMessageCursorTest
Running org.apache.activemq.store.leveldb.LevelDBNegativeQueueTest
Tests run: 4, Failures: 0, Errors: 0, Skipped: 0, Time elapsed: 357.657 sec - in org.apache.activemq.store.leveldb.LevelDBNegativeQueueTest
Running org.apache.activemq.store.leveldb.LevelDBStoreBrokerTest
Tests run: 127, Failures: 0, Errors: 0, Skipped: 0, Time elapsed: 48.764 sec - in org.apache.activemq.store.leveldb.LevelDBStoreBrokerTest
Running org.apache.activemq.store.memory.MemoryMessageStoreSizeStatTest
Tests run: 6, Failures: 0, Errors: 0, Skipped: 0, Time elapsed: 2.881 sec - in org.apache.activemq.store.memory.MemoryMessageStoreSizeStatTest
Running org.apache.activemq.store.memory.MemoryMessageStoreSizeTest
Tests run: 1, Failures: 0, Errors: 0, Skipped: 0, Time elapsed: 0.306 sec - in org.apache.activemq.store.memory.MemoryMessageStoreSizeTest
Running org.apache.activemq.test.JmsTopicSendReceiveTest
Tests run: 1, Failures: 0, Errors: 0, Skipped: 0, Time elapsed: 1.932 sec - in org.apache.activemq.test.JmsTopicSendReceiveTest
Running org.apache.activemq.test.JmsTopicSendReceiveWithTwoConnectionsAndByteSelectorTest
Tests run: 1, Failures: 0, Errors: 0, Skipped: 0, Time elapsed: 1.923 sec - in org.apache.activemq.test.JmsTopicSendReceiveWithTwoConnectionsAndByteSelectorTest
Running org.apache.activemq.test.JmsTopicSendReceiveWithTwoConnectionsTest
Tests run: 1, Failures: 0, Errors: 0, Skipped: 0, Time elapsed: 1.96 sec - in org.apache.activemq.test.JmsTopicSendReceiveWithTwoConnectionsTest
Running org.apache.activemq.test.TemporaryDestinationToFromNameTest
Tests run: 2, Failures: 0, Errors: 0, Skipped: 0, Time elapsed: 0.892 sec - in org.apache.activemq.test.TemporaryDestinationToFromNameTest
Running org.apache.activemq.test.retroactive.RetroactiveConsumerTestWithDestinationBasedBufferTest
Tests run: 1, Failures: 0, Errors: 0, Skipped: 0, Time elapsed: 1.537 sec - in org.apache.activemq.test.retroactive.RetroactiveConsumerTestWithDestinationBasedBufferTest
Running org.apache.activemq.test.retroactive.RetroactiveConsumerTestWithLastImagePolicyWithWildcardTest
Tests run: 1, Failures: 0, Errors: 0, Skipped: 0, Time elapsed: 1.586 sec - in org.apache.activemq.test.retroactive.RetroactiveConsumerTestWithLastImagePolicyWithWildcardTest
Running org.apache.activemq.test.retroactive.RetroactiveConsumerTestWithSimpleMessageListTest
Tests run: 1, Failures: 0, Errors: 0, Skipped: 0, Time elapsed: 1.509 sec - in org.apache.activemq.test.retroactive.RetroactiveConsumerTestWithSimpleMessageListTest
Running org.apache.activemq.test.retroactive.RetroactiveConsumerTestWithTimePolicyTest
Tests run: 1, Failures: 0, Errors: 0, Skipped: 0, Time elapsed: 1.546 sec - in org.apache.activemq.test.retroactive.RetroactiveConsumerTestWithTimePolicyTest
Running org.apache.activemq.test.retroactive.RetroactiveConsumerWithMessageQueryTest
Tests run: 1, Failures: 0, Errors: 0, Skipped: 0, Time elapsed: 1.465 sec - in org.apache.activemq.test.retroactive.RetroactiveConsumerWithMessageQueryTest
Running org.apache.activemq.test.rollback.CloseRollbackRedeliveryQueueTest
Tests run: 3, Failures: 0, Errors: 0, Skipped: 0, Time elapsed: 1.129 sec - in org.apache.activemq.test.rollback.CloseRollbackRedeliveryQueueTest
Running org.apache.activemq.transport.auto.AutoNIOSslTransportBrokerTest
Tests run: 127, Failures: 0, Errors: 0, Skipped: 0, Time elapsed: 35.398 sec - in org.apache.activemq.transport.auto.AutoNIOSslTransportBrokerTest
Running org.apache.activemq.transport.auto.AutoNIOTransportBrokerTest
Tests run: 127, Failures: 0, Errors: 0, Skipped: 0, Time elapsed: 18.366 sec - in org.apache.activemq.transport.auto.AutoNIOTransportBrokerTest
Running org.apache.activemq.transport.auto.AutoSslTransportBrokerTest
Tests run: 127, Failures: 0, Errors: 0, Skipped: 0, Time elapsed: 37.772 sec - in org.apache.activemq.transport.auto.AutoSslTransportBrokerTest
Running org.apache.activemq.transport.auto.AutoTransportBrokerTest
Tests run: 127, Failures: 0, Errors: 0, Skipped: 0, Time elapsed: 22.347 sec - in org.apache.activemq.transport.auto.AutoTransportBrokerTest
Running org.apache.activemq.transport.auto.AutoTransportConfigureTest
Tests run: 24, Failures: 0, Errors: 0, Skipped: 0, Time elapsed: 3.809 sec - in org.apache.activemq.transport.auto.AutoTransportConfigureTest
Running org.apache.activemq.transport.auto.AutoTransportMaxConnectionsTest
Tests run: 4, Failures: 0, Errors: 0, Skipped: 0, Time elapsed: 5.423 sec - in org.apache.activemq.transport.auto.AutoTransportMaxConnectionsTest
Running org.apache.activemq.transport.auto.failover.AutoFailoverClusterTest
Tests run: 3, Failures: 0, Errors: 0, Skipped: 0, Time elapsed: 16.462 sec - in org.apache.activemq.transport.auto.failover.AutoFailoverClusterTest
Running org.apache.activemq.transport.auto.failover.AutoFailoverTimeoutTest
Tests run: 5, Failures: 0, Errors: 0, Skipped: 0, Time elapsed: 13.35 sec - in org.apache.activemq.transport.auto.failover.AutoFailoverTimeoutTest
Running org.apache.activemq.transport.auto.failover.FailoverAutoRandomTest
Tests run: 1, Failures: 0, Errors: 0, Skipped: 0, Time elapsed: 0.831 sec - in org.apache.activemq.transport.auto.failover.FailoverAutoRandomTest
Running org.apache.activemq.transport.auto.failover.FailoverAutoTransportBrokerTest
Tests run: 5, Failures: 0, Errors: 0, Skipped: 0, Time elapsed: 1.967 sec - in org.apache.activemq.transport.auto.failover.FailoverAutoTransportBrokerTest
Running org.apache.activemq.transport.failover.BadConnectionTest
Tests run: 1, Failures: 0, Errors: 0, Skipped: 0, Time elapsed: 0.799 sec - in org.apache.activemq.transport.failover.BadConnectionTest
Running org.apache.activemq.transport.failover.FailoverBackupLeakTest
Tests run: 2, Failures: 0, Errors: 0, Skipped: 0, Time elapsed: 1.937 sec - in org.apache.activemq.transport.failover.FailoverBackupLeakTest
Running org.apache.activemq.transport.failover.FailoverReadInactivityBlockWriteTimeoutClientTest
Tests run: 1, Failures: 0, Errors: 0, Skipped: 0, Time elapsed: 22.437 sec - in org.apache.activemq.transport.failover.FailoverReadInactivityBlockWriteTimeoutClientTest
Running org.apache.activemq.transport.failover.FailoverTransportTest
Tests run: 4, Failures: 0, Errors: 0, Skipped: 1, Time elapsed: 0.284 sec - in org.apache.activemq.transport.failover.FailoverTransportTest
Running org.apache.activemq.transport.failover.FailoverTransportUriHandlingTest
Tests run: 4, Failures: 0, Errors: 0, Skipped: 0, Time elapsed: 0.519 sec - in org.apache.activemq.transport.failover.FailoverTransportUriHandlingTest
Running org.apache.activemq.transport.failover.FailoverTxSlowAckTest
Tests run: 1, Failures: 1, Errors: 0, Skipped: 0, Time elapsed: 33.121 sec <<< FAILURE!
- in org.apache.activemq.transport.failover.FailoverTxSlowAckTest
testFailoverDuringAckRollsback(org.apache.activemq.transport.failover.FailoverTxSlowAckTest)
 Time elapsed: 32.95 sec  <<< FAILURE!
java.lang.AssertionError: got disconnect/reconnect
	at org.junit.Assert.fail(Assert.java:88)
	at org.junit.Assert.assertTrue(Assert.java:41)
	at org.apache.activemq.transport.failover.FailoverTxSlowAckTest.testFailoverDuringAckRollsback(FailoverTxSlowAckTest.java:229)

Running org.apache.activemq.transport.failover.FailoverUriTest
Tests run: 16, Failures: 0, Errors: 0, Skipped: 0, Time elapsed: 1.205 sec - in org.apache.activemq.transport.failover.FailoverUriTest
Running org.apache.activemq.transport.failover.SlowConnectionTest
Tests run: 1, Failures: 0, Errors: 0, Skipped: 0, Time elapsed: 1.438 sec - in org.apache.activemq.transport.failover.SlowConnectionTest
Running org.apache.activemq.transport.failover.TwoBrokerFailoverClusterTest
Tests run: 1, Failures: 0, Errors: 0, Skipped: 0, Time elapsed: 19.303 sec - in org.apache.activemq.transport.failover.TwoBrokerFailoverClusterTest
Running org.apache.activemq.transport.reliable.ReliableTransportTest
Tests run: 7, Failures: 0, Errors: 0, Skipped: 0, Time elapsed: 0.146 sec - in org.apache.activemq.transport.reliable.ReliableTransportTest
Running org.apache.activemq.transport.tcp.QualityOfServiceUtilsTest
Tests run: 6, Failures: 0, Errors: 0, Skipped: 0, Time elapsed: 0.039 sec - in org.apache.activemq.transport.tcp.QualityOfServiceUtilsTest
Running org.apache.activemq.transport.tcp.SslTransportFactoryTest
Tests run: 2, Failures: 0, Errors: 0, Skipped: 0, Time elapsed: 0.751 sec - in org.apache.activemq.transport.tcp.SslTransportFactoryTest
Running org.apache.activemq.transport.tcp.SslTransportServerTest
Tests run: 2, Failures: 0, Errors: 0, Skipped: 0, Time elapsed: 0.137 sec - in org.apache.activemq.transport.tcp.SslTransportServerTest
Running org.apache.activemq.transport.tcp.SslTransportTest
Tests run: 1, Failures: 0, Errors: 0, Skipped: 0, Time elapsed: 0.144 sec - in org.apache.activemq.transport.tcp.SslTransportTest
Running org.apache.activemq.transport.tcp.TcpTransportBindTest
Tests run: 2, Failures: 0, Errors: 0, Skipped: 0, Time elapsed: 1.851 sec - in org.apache.activemq.transport.tcp.TcpTransportBindTest
Running org.apache.activemq.transport.tcp.TcpTransportServerTest
Tests run: 1, Failures: 0, Errors: 0, Skipped: 0, Time elapsed: 0.249 sec - in org.apache.activemq.transport.tcp.TcpTransportServerTest
Running org.apache.activemq.transport.tcp.TransportConnectorInvalidSocketOptionsTest
Tests run: 2, Failures: 0, Errors: 0, Skipped: 0, Time elapsed: 0.818 sec - in org.apache.activemq.transport.tcp.TransportConnectorInvalidSocketOptionsTest
Running org.apache.activemq.transport.tcp.TransportUriTest
Tests run: 14, Failures: 0, Errors: 0, Skipped: 0, Time elapsed: 1.164 sec - in org.apache.activemq.transport.tcp.TransportUriTest
Running org.apache.activemq.transport.tcp.WireformatNegociationTest
Tests run: 5, Failures: 0, Errors: 0, Skipped: 0, Time elapsed: 0.308 sec - in org.apache.activemq.transport.tcp.WireformatNegociationTest
Running org.apache.activemq.transport.udp.UdpSendReceiveWithTwoConnectionsAndLargeMessagesTest
Tests run: 1, Failures: 0, Errors: 0, Skipped: 0, Time elapsed: 1.847 sec - in org.apache.activemq.transport.udp.UdpSendReceiveWithTwoConnectionsAndLargeMessagesTest
Running org.apache.activemq.transport.udp.UdpSendReceiveWithTwoConnectionsTest
Tests run: 1, Failures: 0, Errors: 0, Skipped: 0, Time elapsed: 1.894 sec - in org.apache.activemq.transport.udp.UdpSendReceiveWithTwoConnectionsTest
Running org.apache.activemq.transport.udp.UdpTransportTest
Tests run: 3, Failures: 0, Errors: 0, Skipped: 0, Time elapsed: 0.261 sec - in org.apache.activemq.transport.udp.UdpTransportTest
Running org.apache.activemq.transport.udp.UdpTransportUsingServerTest
Tests run: 4, Failures: 0, Errors: 0, Skipped: 0, Time elapsed: 0.283 sec - in org.apache.activemq.transport.udp.UdpTransportUsingServerTest
Running org.apache.activemq.transport.udp.UpdTransportBindTest
Tests run: 1, Failures: 0, Errors: 0, Skipped: 0, Time elapsed: 0.894 sec - in org.apache.activemq.transport.udp.UpdTransportBindTest
Running org.apache.activemq.transport.vm.VMTransportBrokerTest
Tests run: 127, Failures: 0, Errors: 0, Skipped: 0, Time elapsed: 17.525 sec - in org.apache.activemq.transport.vm.VMTransportBrokerTest
Running org.apache.activemq.transport.vm.VMTransportEmbeddedBrokerTest
Tests run: 1, Failures: 0, Errors: 0, Skipped: 0, Time elapsed: 0.857 sec - in org.apache.activemq.transport.vm.VMTransportEmbeddedBrokerTest
Running org.apache.activemq.transport.vm.VMTransportThreadSafeTest
Tests run: 19, Failures: 0, Errors: 0, Skipped: 0, Time elapsed: 74.968 sec - in org.apache.activemq.transport.vm.VMTransportThreadSafeTest
Running org.apache.activemq.usage.CompositeMessageCursorUsageTest
Tests run: 1, Failures: 0, Errors: 0, Skipped: 0, Time elapsed: 0.975 sec - in org.apache.activemq.usage.CompositeMessageCursorUsageTest
Running org.apache.activemq.usage.JobSchedulerStoreUsageTest
Tests run: 1, Failures: 0, Errors: 0, Skipped: 0, Time elapsed: 7.345 sec - in org.apache.activemq.usage.JobSchedulerStoreUsageTest
Running org.apache.activemq.usage.PercentDiskUsageLimitTest
Tests run: 3, Failures: 0, Errors: 0, Skipped: 0, Time elapsed: 3.111 sec - in org.apache.activemq.usage.PercentDiskUsageLimitTest
Running org.apache.activemq.usage.PeriodicDiskUsageLimitTest
Tests run: 6, Failures: 0, Errors: 0, Skipped: 0, Time elapsed: 33.095 sec - in org.apache.activemq.usage.PeriodicDiskUsageLimitTest
Running org.apache.activemq.usage.StoreUsageLimitsTest
Tests run: 1, Failures: 0, Errors: 0, Skipped: 0, Time elapsed: 2.016 sec - in org.apache.activemq.usage.StoreUsageLimitsTest
Running org.apache.activemq.usecases.AMQ5153LevelDBSubscribedDestTest
Tests run: 1, Failures: 0, Errors: 0, Skipped: 0, Time elapsed: 2.178 sec - in org.apache.activemq.usecases.AMQ5153LevelDBSubscribedDestTest
Running org.apache.activemq.usecases.AdvisoryTopicDeletionTest
Tests run: 2, Failures: 0, Errors: 0, Skipped: 0, Time elapsed: 0.945 sec - in org.apache.activemq.usecases.AdvisoryTopicDeletionTest
Running org.apache.activemq.usecases.AdvisoryViaNetworkTest
Tests run: 4, Failures: 0, Errors: 0, Skipped: 0, Time elapsed: 9.963 sec - in org.apache.activemq.usecases.AdvisoryViaNetworkTest
Running org.apache.activemq.usecases.AuthorizationFromAdminViewTest
Tests run: 1, Failures: 0, Errors: 0, Skipped: 0, Time elapsed: 0.779 sec - in org.apache.activemq.usecases.AuthorizationFromAdminViewTest
Running org.apache.activemq.usecases.BacklogNetworkCrossTalkTest
Running org.apache.activemq.usecases.BatchedMessagePriorityConsumerTest
Tests run: 2, Failures: 0, Errors: 0, Skipped: 0, Time elapsed: 2.995 sec - in org.apache.activemq.usecases.BatchedMessagePriorityConsumerTest
Running org.apache.activemq.usecases.BrokerQueueNetworkWithDisconnectTest
Tests run: 4, Failures: 0, Errors: 0, Skipped: 0, Time elapsed: 99.85 sec - in org.apache.activemq.usecases.BrokerQueueNetworkWithDisconnectTest
Running org.apache.activemq.usecases.BrowseDLQTest
Tests run: 1, Failures: 0, Errors: 0, Skipped: 0, Time elapsed: 10.844 sec - in org.apache.activemq.usecases.BrowseDLQTest
Running org.apache.activemq.usecases.ChangeSentMessageTest
Tests run: 1, Failures: 0, Errors: 0, Skipped: 0, Time elapsed: 1.024 sec - in org.apache.activemq.usecases.ChangeSentMessageTest
Running org.apache.activemq.usecases.ChangeSessionDeliveryModeTest
Tests run: 1, Failures: 0, Errors: 0, Skipped: 0, Time elapsed: 0.841 sec - in org.apache.activemq.usecases.ChangeSessionDeliveryModeTest
Running org.apache.activemq.usecases.CompositeConsumeTest
Tests run: 1, Failures: 0, Errors: 0, Skipped: 0, Time elapsed: 0.998 sec - in org.apache.activemq.usecases.CompositeConsumeTest
Running org.apache.activemq.usecases.ConsumeQueuePrefetchTest
Tests run: 4, Failures: 0, Errors: 0, Skipped: 0, Time elapsed: 1.282 sec - in org.apache.activemq.usecases.ConsumeQueuePrefetchTest
Running org.apache.activemq.usecases.ConsumeTopicPrefetchTest
Tests run: 3, Failures: 0, Errors: 0, Skipped: 0, Time elapsed: 1.196 sec - in org.apache.activemq.usecases.ConsumeTopicPrefetchTest
Running org.apache.activemq.usecases.CreateTemporaryQueueBeforeStartTest
Tests run: 3, Failures: 0, Errors: 0, Skipped: 0, Time elapsed: 0.935 sec - in org.apache.activemq.usecases.CreateTemporaryQueueBeforeStartTest
Running org.apache.activemq.usecases.DurableSubInBrokerNetworkTest
Tests run: 2, Failures: 0, Errors: 0, Skipped: 0, Time elapsed: 1.559 sec - in org.apache.activemq.usecases.DurableSubInBrokerNetworkTest
Running org.apache.activemq.usecases.DurableSubProcessConcurrentCommitActivateNoDuplicateTest
Tests run: 1, Failures: 0, Errors: 0, Skipped: 1, Time elapsed: 0.08 sec - in org.apache.activemq.usecases.DurableSubProcessConcurrentCommitActivateNoDuplicateTest
Running org.apache.activemq.usecases.DurableSubProcessWithRestartTest
Tests run: 1, Failures: 0, Errors: 0, Skipped: 1, Time elapsed: 0.078 sec - in org.apache.activemq.usecases.DurableSubProcessWithRestartTest
Running org.apache.activemq.usecases.DurableSubsOfflineSelectorConcurrentConsumeIndexUseTest
Tests run: 1, Failures: 0, Errors: 0, Skipped: 0, Time elapsed: 428.154 sec - in org.apache.activemq.usecases.DurableSubsOfflineSelectorConcurrentConsumeIndexUseTest
Running org.apache.activemq.usecases.DurableSubsOfflineSelectorIndexUseTest

Results :

Failed tests: 
  FailoverTxSlowAckTest.testFailoverDuringAckRollsback:229 got disconnect/reconnect

Tests run: 3652, Failures: 1, Errors: 0, Skipped: 32

[JENKINS] Recording test results
Tests run: 3, Failures: 0, Errors: 0, Skipped: 0, Time elapsed: 98.68 sec - in org.apache.activemq.usecases.DurableSubsOfflineSelectorIndexUseTest

Mime
View raw message