activemq-commits mailing list archives

Site index · List index
Message view « Date » · « Thread »
Top « Date » · « Thread »
From Apache Jenkins Server <jenk...@builds.apache.org>
Subject Build failed in Jenkins: ActiveMQ-Java7 » ActiveMQ :: Unit Tests #815
Date Thu, 10 Sep 2015 00:30:18 GMT
See <https://builds.apache.org/job/ActiveMQ-Java7/org.apache.activemq$activemq-unit-tests/815/changes>

Changes:

[christopher.l.shannon] https://issues.apache.org/jira/browse/AMQ-5923

------------------------------------------
[...truncated 885 lines...]
Running org.apache.activemq.test.retroactive.RetroactiveConsumerTestWithDestinationBasedBufferTest
Tests run: 1, Failures: 0, Errors: 0, Skipped: 0, Time elapsed: 1.921 sec - in org.apache.activemq.test.retroactive.RetroactiveConsumerTestWithDestinationBasedBufferTest
Running org.apache.activemq.test.retroactive.RetroactiveConsumerTestWithLastImagePolicyWithWildcardTest
Tests run: 1, Failures: 0, Errors: 0, Skipped: 0, Time elapsed: 1.939 sec - in org.apache.activemq.test.retroactive.RetroactiveConsumerTestWithLastImagePolicyWithWildcardTest
Running org.apache.activemq.test.retroactive.RetroactiveConsumerTestWithSimpleMessageListTest
Tests run: 1, Failures: 0, Errors: 0, Skipped: 0, Time elapsed: 1.878 sec - in org.apache.activemq.test.retroactive.RetroactiveConsumerTestWithSimpleMessageListTest
Running org.apache.activemq.test.retroactive.RetroactiveConsumerTestWithTimePolicyTest
Tests run: 1, Failures: 0, Errors: 0, Skipped: 0, Time elapsed: 1.835 sec - in org.apache.activemq.test.retroactive.RetroactiveConsumerTestWithTimePolicyTest
Running org.apache.activemq.test.retroactive.RetroactiveConsumerWithMessageQueryTest
Tests run: 1, Failures: 0, Errors: 0, Skipped: 0, Time elapsed: 1.844 sec - in org.apache.activemq.test.retroactive.RetroactiveConsumerWithMessageQueryTest
Running org.apache.activemq.test.rollback.CloseRollbackRedeliveryQueueTest
Tests run: 3, Failures: 0, Errors: 0, Skipped: 0, Time elapsed: 1.317 sec - in org.apache.activemq.test.rollback.CloseRollbackRedeliveryQueueTest
Running org.apache.activemq.transport.auto.AutoNIOSslTransportBrokerTest
Tests run: 127, Failures: 0, Errors: 0, Skipped: 0, Time elapsed: 37.163 sec - in org.apache.activemq.transport.auto.AutoNIOSslTransportBrokerTest
Running org.apache.activemq.transport.auto.AutoNIOTransportBrokerTest
Tests run: 127, Failures: 0, Errors: 0, Skipped: 0, Time elapsed: 21.186 sec - in org.apache.activemq.transport.auto.AutoNIOTransportBrokerTest
Running org.apache.activemq.transport.auto.AutoSslTransportBrokerTest
Tests run: 127, Failures: 0, Errors: 0, Skipped: 0, Time elapsed: 37.922 sec - in org.apache.activemq.transport.auto.AutoSslTransportBrokerTest
Running org.apache.activemq.transport.auto.AutoTransportBrokerTest
Tests run: 127, Failures: 0, Errors: 0, Skipped: 0, Time elapsed: 19.123 sec - in org.apache.activemq.transport.auto.AutoTransportBrokerTest
Running org.apache.activemq.transport.auto.AutoTransportConfigureTest
Tests run: 24, Failures: 0, Errors: 0, Skipped: 0, Time elapsed: 4.502 sec - in org.apache.activemq.transport.auto.AutoTransportConfigureTest
Running org.apache.activemq.transport.auto.AutoTransportMaxConnectionsTest
Tests run: 4, Failures: 1, Errors: 0, Skipped: 0, Time elapsed: 34.649 sec <<< FAILURE!
- in org.apache.activemq.transport.auto.AutoTransportMaxConnectionsTest
testMaxConnectionControl[1](org.apache.activemq.transport.auto.AutoTransportMaxConnectionsTest)
 Time elapsed: 30.063 sec  <<< FAILURE!
java.lang.AssertionError: Expected: 20 found: 0
	at org.junit.Assert.fail(Assert.java:88)
	at org.junit.Assert.assertTrue(Assert.java:41)
	at org.apache.activemq.transport.auto.AutoTransportMaxConnectionsTest.testMaxConnectionControl(AutoTransportMaxConnectionsTest.java:130)

Running org.apache.activemq.transport.auto.failover.AutoFailoverClusterTest
Tests run: 3, Failures: 0, Errors: 0, Skipped: 0, Time elapsed: 16.51 sec - in org.apache.activemq.transport.auto.failover.AutoFailoverClusterTest
Running org.apache.activemq.transport.auto.failover.AutoFailoverTimeoutTest
Tests run: 4, Failures: 0, Errors: 0, Skipped: 0, Time elapsed: 9.871 sec - in org.apache.activemq.transport.auto.failover.AutoFailoverTimeoutTest
Running org.apache.activemq.transport.auto.failover.FailoverAutoRandomTest
Tests run: 1, Failures: 0, Errors: 0, Skipped: 0, Time elapsed: 0.953 sec - in org.apache.activemq.transport.auto.failover.FailoverAutoRandomTest
Running org.apache.activemq.transport.auto.failover.FailoverAutoTransportBrokerTest
Tests run: 5, Failures: 0, Errors: 0, Skipped: 0, Time elapsed: 2.161 sec - in org.apache.activemq.transport.auto.failover.FailoverAutoTransportBrokerTest
Running org.apache.activemq.transport.failover.BadConnectionTest
Tests run: 1, Failures: 0, Errors: 0, Skipped: 0, Time elapsed: 0.928 sec - in org.apache.activemq.transport.failover.BadConnectionTest
Running org.apache.activemq.transport.failover.FailoverBackupLeakTest
Tests run: 2, Failures: 0, Errors: 0, Skipped: 0, Time elapsed: 2.081 sec - in org.apache.activemq.transport.failover.FailoverBackupLeakTest
Running org.apache.activemq.transport.failover.FailoverReadInactivityBlockWriteTimeoutClientTest
Tests run: 1, Failures: 0, Errors: 0, Skipped: 0, Time elapsed: 23.285 sec - in org.apache.activemq.transport.failover.FailoverReadInactivityBlockWriteTimeoutClientTest
Running org.apache.activemq.transport.failover.FailoverTransportTest
Tests run: 4, Failures: 0, Errors: 0, Skipped: 1, Time elapsed: 0.329 sec - in org.apache.activemq.transport.failover.FailoverTransportTest
Running org.apache.activemq.transport.failover.FailoverTransportUriHandlingTest
Tests run: 4, Failures: 0, Errors: 0, Skipped: 0, Time elapsed: 0.362 sec - in org.apache.activemq.transport.failover.FailoverTransportUriHandlingTest
Running org.apache.activemq.transport.failover.FailoverUriTest
Tests run: 16, Failures: 0, Errors: 0, Skipped: 0, Time elapsed: 1.415 sec - in org.apache.activemq.transport.failover.FailoverUriTest
Running org.apache.activemq.transport.failover.SlowConnectionTest
Tests run: 1, Failures: 0, Errors: 0, Skipped: 0, Time elapsed: 1.49 sec - in org.apache.activemq.transport.failover.SlowConnectionTest
Running org.apache.activemq.transport.failover.TwoBrokerFailoverClusterTest
Tests run: 1, Failures: 0, Errors: 0, Skipped: 0, Time elapsed: 19.45 sec - in org.apache.activemq.transport.failover.TwoBrokerFailoverClusterTest
Running org.apache.activemq.transport.reliable.ReliableTransportTest
Tests run: 7, Failures: 0, Errors: 0, Skipped: 0, Time elapsed: 0.164 sec - in org.apache.activemq.transport.reliable.ReliableTransportTest
Running org.apache.activemq.transport.tcp.QualityOfServiceUtilsTest
Tests run: 6, Failures: 0, Errors: 0, Skipped: 0, Time elapsed: 0.061 sec - in org.apache.activemq.transport.tcp.QualityOfServiceUtilsTest
Running org.apache.activemq.transport.tcp.SslTransportFactoryTest
Tests run: 2, Failures: 0, Errors: 0, Skipped: 0, Time elapsed: 0.708 sec - in org.apache.activemq.transport.tcp.SslTransportFactoryTest
Running org.apache.activemq.transport.tcp.SslTransportServerTest
Tests run: 2, Failures: 0, Errors: 0, Skipped: 0, Time elapsed: 0.175 sec - in org.apache.activemq.transport.tcp.SslTransportServerTest
Running org.apache.activemq.transport.tcp.SslTransportTest
Tests run: 1, Failures: 0, Errors: 0, Skipped: 0, Time elapsed: 0.171 sec - in org.apache.activemq.transport.tcp.SslTransportTest
Running org.apache.activemq.transport.tcp.TcpTransportBindTest
Tests run: 2, Failures: 0, Errors: 0, Skipped: 0, Time elapsed: 1.968 sec - in org.apache.activemq.transport.tcp.TcpTransportBindTest
Running org.apache.activemq.transport.tcp.TcpTransportServerTest
Tests run: 1, Failures: 0, Errors: 0, Skipped: 0, Time elapsed: 0.29 sec - in org.apache.activemq.transport.tcp.TcpTransportServerTest
Running org.apache.activemq.transport.tcp.TransportConnectorInvalidSocketOptionsTest
Tests run: 2, Failures: 0, Errors: 0, Skipped: 0, Time elapsed: 0.908 sec - in org.apache.activemq.transport.tcp.TransportConnectorInvalidSocketOptionsTest
Running org.apache.activemq.transport.tcp.TransportUriTest
Tests run: 14, Failures: 0, Errors: 0, Skipped: 0, Time elapsed: 1.401 sec - in org.apache.activemq.transport.tcp.TransportUriTest
Running org.apache.activemq.transport.tcp.WireformatNegociationTest
Tests run: 5, Failures: 0, Errors: 0, Skipped: 0, Time elapsed: 0.373 sec - in org.apache.activemq.transport.tcp.WireformatNegociationTest
Running org.apache.activemq.transport.udp.UdpSendReceiveWithTwoConnectionsAndLargeMessagesTest
Tests run: 1, Failures: 0, Errors: 0, Skipped: 0, Time elapsed: 1.956 sec - in org.apache.activemq.transport.udp.UdpSendReceiveWithTwoConnectionsAndLargeMessagesTest
Running org.apache.activemq.transport.udp.UdpSendReceiveWithTwoConnectionsTest
Tests run: 1, Failures: 0, Errors: 0, Skipped: 0, Time elapsed: 2.006 sec - in org.apache.activemq.transport.udp.UdpSendReceiveWithTwoConnectionsTest
Running org.apache.activemq.transport.udp.UdpTransportTest
Tests run: 3, Failures: 0, Errors: 0, Skipped: 0, Time elapsed: 0.31 sec - in org.apache.activemq.transport.udp.UdpTransportTest
Running org.apache.activemq.transport.udp.UdpTransportUsingServerTest
Tests run: 4, Failures: 0, Errors: 0, Skipped: 0, Time elapsed: 0.34 sec - in org.apache.activemq.transport.udp.UdpTransportUsingServerTest
Running org.apache.activemq.transport.udp.UpdTransportBindTest
Tests run: 1, Failures: 0, Errors: 0, Skipped: 0, Time elapsed: 1.075 sec - in org.apache.activemq.transport.udp.UpdTransportBindTest
Running org.apache.activemq.transport.vm.VMTransportBrokerTest
Tests run: 127, Failures: 0, Errors: 0, Skipped: 0, Time elapsed: 18.562 sec - in org.apache.activemq.transport.vm.VMTransportBrokerTest
Running org.apache.activemq.transport.vm.VMTransportEmbeddedBrokerTest
Tests run: 1, Failures: 0, Errors: 0, Skipped: 0, Time elapsed: 0.918 sec - in org.apache.activemq.transport.vm.VMTransportEmbeddedBrokerTest
Running org.apache.activemq.transport.vm.VMTransportThreadSafeTest
Tests run: 19, Failures: 0, Errors: 0, Skipped: 0, Time elapsed: 71.233 sec - in org.apache.activemq.transport.vm.VMTransportThreadSafeTest
Running org.apache.activemq.usage.CompositeMessageCursorUsageTest
Tests run: 1, Failures: 0, Errors: 0, Skipped: 0, Time elapsed: 1.176 sec - in org.apache.activemq.usage.CompositeMessageCursorUsageTest
Running org.apache.activemq.usage.JobSchedulerStoreUsageTest
Tests run: 1, Failures: 0, Errors: 0, Skipped: 0, Time elapsed: 4.118 sec - in org.apache.activemq.usage.JobSchedulerStoreUsageTest
Running org.apache.activemq.usage.PeriodicDiskUsageLimitTest
Tests run: 3, Failures: 0, Errors: 0, Skipped: 0, Time elapsed: 14.271 sec - in org.apache.activemq.usage.PeriodicDiskUsageLimitTest
Running org.apache.activemq.usage.StoreUsageLimitsTest
Tests run: 1, Failures: 0, Errors: 0, Skipped: 0, Time elapsed: 2.108 sec - in org.apache.activemq.usage.StoreUsageLimitsTest
Running org.apache.activemq.usecases.AMQ5153LevelDBSubscribedDestTest
Tests run: 1, Failures: 0, Errors: 0, Skipped: 0, Time elapsed: 1.962 sec - in org.apache.activemq.usecases.AMQ5153LevelDBSubscribedDestTest
Running org.apache.activemq.usecases.AdvisoryTopicDeletionTest
Tests run: 2, Failures: 0, Errors: 0, Skipped: 0, Time elapsed: 1.102 sec - in org.apache.activemq.usecases.AdvisoryTopicDeletionTest
Running org.apache.activemq.usecases.AdvisoryViaNetworkTest
Tests run: 4, Failures: 0, Errors: 0, Skipped: 0, Time elapsed: 9.161 sec - in org.apache.activemq.usecases.AdvisoryViaNetworkTest
Running org.apache.activemq.usecases.AuthorizationFromAdminViewTest
Tests run: 1, Failures: 0, Errors: 0, Skipped: 0, Time elapsed: 0.877 sec - in org.apache.activemq.usecases.AuthorizationFromAdminViewTest
Running org.apache.activemq.usecases.BacklogNetworkCrossTalkTest
Tests run: 1, Failures: 0, Errors: 0, Skipped: 0, Time elapsed: 29.028 sec - in org.apache.activemq.usecases.BacklogNetworkCrossTalkTest
Running org.apache.activemq.usecases.BatchedMessagePriorityConsumerTest
Tests run: 2, Failures: 0, Errors: 0, Skipped: 0, Time elapsed: 3.136 sec - in org.apache.activemq.usecases.BatchedMessagePriorityConsumerTest
Running org.apache.activemq.usecases.BrokerQueueNetworkWithDisconnectTest
Tests run: 4, Failures: 0, Errors: 0, Skipped: 0, Time elapsed: 78.028 sec - in org.apache.activemq.usecases.BrokerQueueNetworkWithDisconnectTest
Running org.apache.activemq.usecases.BrowseDLQTest
Tests run: 1, Failures: 0, Errors: 0, Skipped: 0, Time elapsed: 4.109 sec - in org.apache.activemq.usecases.BrowseDLQTest
Running org.apache.activemq.usecases.ChangeSentMessageTest
Tests run: 1, Failures: 0, Errors: 0, Skipped: 0, Time elapsed: 1.116 sec - in org.apache.activemq.usecases.ChangeSentMessageTest
Running org.apache.activemq.usecases.ChangeSessionDeliveryModeTest
Tests run: 1, Failures: 0, Errors: 0, Skipped: 0, Time elapsed: 0.944 sec - in org.apache.activemq.usecases.ChangeSessionDeliveryModeTest
Running org.apache.activemq.usecases.CompositeConsumeTest
Tests run: 1, Failures: 0, Errors: 0, Skipped: 0, Time elapsed: 1.061 sec - in org.apache.activemq.usecases.CompositeConsumeTest
Running org.apache.activemq.usecases.ConsumeQueuePrefetchTest
Tests run: 4, Failures: 0, Errors: 0, Skipped: 0, Time elapsed: 1.516 sec - in org.apache.activemq.usecases.ConsumeQueuePrefetchTest
Running org.apache.activemq.usecases.ConsumeTopicPrefetchTest
Tests run: 3, Failures: 0, Errors: 0, Skipped: 0, Time elapsed: 1.352 sec - in org.apache.activemq.usecases.ConsumeTopicPrefetchTest
Running org.apache.activemq.usecases.CreateTemporaryQueueBeforeStartTest
Tests run: 3, Failures: 0, Errors: 0, Skipped: 0, Time elapsed: 1.196 sec - in org.apache.activemq.usecases.CreateTemporaryQueueBeforeStartTest
Running org.apache.activemq.usecases.DurableSubInBrokerNetworkTest
Tests run: 2, Failures: 0, Errors: 0, Skipped: 0, Time elapsed: 1.717 sec - in org.apache.activemq.usecases.DurableSubInBrokerNetworkTest
Running org.apache.activemq.usecases.DurableSubProcessConcurrentCommitActivateNoDuplicateTest
Tests run: 1, Failures: 0, Errors: 0, Skipped: 1, Time elapsed: 0.108 sec - in org.apache.activemq.usecases.DurableSubProcessConcurrentCommitActivateNoDuplicateTest
Running org.apache.activemq.usecases.DurableSubProcessWithRestartTest
Tests run: 1, Failures: 0, Errors: 0, Skipped: 1, Time elapsed: 0.107 sec - in org.apache.activemq.usecases.DurableSubProcessWithRestartTest
Running org.apache.activemq.usecases.DurableSubsOfflineSelectorConcurrentConsumeIndexUseTest
Tests run: 1, Failures: 0, Errors: 0, Skipped: 0, Time elapsed: 15.284 sec - in org.apache.activemq.usecases.DurableSubsOfflineSelectorConcurrentConsumeIndexUseTest
Running org.apache.activemq.usecases.DurableSubsOfflineSelectorIndexUseTest
Tests run: 3, Failures: 0, Errors: 0, Skipped: 0, Time elapsed: 24.358 sec - in org.apache.activemq.usecases.DurableSubsOfflineSelectorIndexUseTest
Running org.apache.activemq.usecases.DurableSubscriberWithNetworkRestartTest
Tests run: 2, Failures: 0, Errors: 0, Skipped: 0, Time elapsed: 17.935 sec - in org.apache.activemq.usecases.DurableSubscriberWithNetworkRestartTest
Running org.apache.activemq.usecases.DurableSubscriptionOffline1Test
Tests run: 18, Failures: 0, Errors: 0, Skipped: 0, Time elapsed: 115.384 sec - in org.apache.activemq.usecases.DurableSubscriptionOffline1Test
Running org.apache.activemq.usecases.DurableSubscriptionOffline2Test
Tests run: 2, Failures: 0, Errors: 0, Skipped: 0, Time elapsed: 4.024 sec - in org.apache.activemq.usecases.DurableSubscriptionOffline2Test
Running org.apache.activemq.usecases.DurableSubscriptionOffline3Test
Tests run: 12, Failures: 0, Errors: 0, Skipped: 0, Time elapsed: 117.522 sec - in org.apache.activemq.usecases.DurableSubscriptionOffline3Test
Running org.apache.activemq.usecases.DurableSubscriptionOffline4Test
Tests run: 2, Failures: 0, Errors: 0, Skipped: 0, Time elapsed: 7.761 sec - in org.apache.activemq.usecases.DurableSubscriptionOffline4Test
Running org.apache.activemq.usecases.DurableSubscriptionOfflineBrowseRemoveTest
Tests run: 4, Failures: 0, Errors: 0, Skipped: 0, Time elapsed: 4.612 sec - in org.apache.activemq.usecases.DurableSubscriptionOfflineBrowseRemoveTest
Running org.apache.activemq.usecases.DurableSubscriptionWithNoLocalTest
Tests run: 4, Failures: 0, Errors: 0, Skipped: 3, Time elapsed: 3.035 sec - in org.apache.activemq.usecases.DurableSubscriptionWithNoLocalTest
Running org.apache.activemq.usecases.ExceptionListenerTest
Tests run: 2, Failures: 0, Errors: 0, Skipped: 0, Time elapsed: 0.852 sec - in org.apache.activemq.usecases.ExceptionListenerTest
Running org.apache.activemq.usecases.LevelDBDurableSubscriptionTest
Tests run: 12, Failures: 0, Errors: 0, Skipped: 0, Time elapsed: 26.316 sec - in org.apache.activemq.usecases.LevelDBDurableSubscriptionTest
Running org.apache.activemq.usecases.ManagedDurableSubscriptionTest
Tests run: 1, Failures: 0, Errors: 0, Skipped: 0, Time elapsed: 1.876 sec - in org.apache.activemq.usecases.ManagedDurableSubscriptionTest
Running org.apache.activemq.usecases.MemoryLimitTest
Tests run: 9, Failures: 0, Errors: 0, Skipped: 3, Time elapsed: 28.435 sec - in org.apache.activemq.usecases.MemoryLimitTest
Running org.apache.activemq.usecases.MessageGroupLateArrivalsTest
Tests run: 2, Failures: 0, Errors: 0, Skipped: 0, Time elapsed: 1.995 sec - in org.apache.activemq.usecases.MessageGroupLateArrivalsTest
Running org.apache.activemq.usecases.MessageGroupReconnectDistributionTest
Tests run: 2, Failures: 0, Errors: 0, Skipped: 0, Time elapsed: 30.858 sec - in org.apache.activemq.usecases.MessageGroupReconnectDistributionTest
Running org.apache.activemq.usecases.NewConsumerCreatesDestinationTest
Tests run: 1, Failures: 0, Errors: 0, Skipped: 0, Time elapsed: 1.04 sec - in org.apache.activemq.usecases.NewConsumerCreatesDestinationTest
Running org.apache.activemq.usecases.ObjectMessageNotSerializableTest
Tests run: 2, Failures: 0, Errors: 0, Skipped: 0, Time elapsed: 0.892 sec - in org.apache.activemq.usecases.ObjectMessageNotSerializableTest
Running org.apache.activemq.usecases.OfflineDurableSubscriberTimeoutTest
Tests run: 1, Failures: 0, Errors: 0, Skipped: 0, Time elapsed: 11.245 sec - in org.apache.activemq.usecases.OfflineDurableSubscriberTimeoutTest
Running org.apache.activemq.usecases.PublishOnDurableTopicConsumedMessageTest
Tests run: 1, Failures: 0, Errors: 0, Skipped: 0, Time elapsed: 2.085 sec - in org.apache.activemq.usecases.PublishOnDurableTopicConsumedMessageTest
Running org.apache.activemq.usecases.PublishOnQueueConsumedMessageTest
Tests run: 1, Failures: 0, Errors: 0, Skipped: 0, Time elapsed: 2.124 sec - in org.apache.activemq.usecases.PublishOnQueueConsumedMessageTest
Running org.apache.activemq.usecases.PublishOnTemporaryQueueConsumedMessageTest
Tests run: 1, Failures: 0, Errors: 0, Skipped: 0, Time elapsed: 2.18 sec - in org.apache.activemq.usecases.PublishOnTemporaryQueueConsumedMessageTest
Running org.apache.activemq.usecases.QueueBrowsingLevelDBTest
Tests run: 3, Failures: 0, Errors: 0, Skipped: 0, Time elapsed: 5.46 sec - in org.apache.activemq.usecases.QueueBrowsingLevelDBTest
Running org.apache.activemq.usecases.QueueBrowsingLimitTest
Tests run: 1, Failures: 0, Errors: 0, Skipped: 0, Time elapsed: 3.017 sec - in org.apache.activemq.usecases.QueueBrowsingLimitTest
Running org.apache.activemq.usecases.QueueBrowsingTest
Tests run: 3, Failures: 0, Errors: 0, Skipped: 0, Time elapsed: 6.597 sec - in org.apache.activemq.usecases.QueueBrowsingTest
Running org.apache.activemq.usecases.QueueRepeaterTest
Tests run: 1, Failures: 0, Errors: 0, Skipped: 0, Time elapsed: 1.016 sec - in org.apache.activemq.usecases.QueueRepeaterTest
Running org.apache.activemq.usecases.RequestReplyTempDestRemovalAdvisoryRaceTest
Tests run: 8, Failures: 0, Errors: 0, Skipped: 0, Time elapsed: 117.877 sec - in org.apache.activemq.usecases.RequestReplyTempDestRemovalAdvisoryRaceTest
Running org.apache.activemq.usecases.RequestReplyToTopicViaThreeNetworkHopsTest
Tests run: 1, Failures: 0, Errors: 0, Skipped: 0, Time elapsed: 11.503 sec - in org.apache.activemq.usecases.RequestReplyToTopicViaThreeNetworkHopsTest
Running org.apache.activemq.usecases.SingleBrokerVirtualDestinationsWithWildcardLevelDBTest
Tests run: 4, Failures: 0, Errors: 0, Skipped: 0, Time elapsed: 43.152 sec - in org.apache.activemq.usecases.SingleBrokerVirtualDestinationsWithWildcardLevelDBTest
Running org.apache.activemq.usecases.SubscribeClosePublishThenConsumeTest
Tests run: 1, Failures: 0, Errors: 0, Skipped: 0, Time elapsed: 1.13 sec - in org.apache.activemq.usecases.SubscribeClosePublishThenConsumeTest
Running org.apache.activemq.usecases.ThreeBrokerTempDestDemandSubscriptionCleanupTest
Tests run: 2, Failures: 0, Errors: 0, Skipped: 0, Time elapsed: 7.294 sec - in org.apache.activemq.usecases.ThreeBrokerTempDestDemandSubscriptionCleanupTest
Running org.apache.activemq.usecases.ThreeBrokerVirtualTopicNetworkLevelDBTest
Tests run: 1, Failures: 0, Errors: 0, Skipped: 0, Time elapsed: 22.28 sec - in org.apache.activemq.usecases.ThreeBrokerVirtualTopicNetworkLevelDBTest
Running org.apache.activemq.usecases.TopicDurableConnectStatsTest
Tests run: 1, Failures: 0, Errors: 0, Skipped: 0, Time elapsed: 2.726 sec - in org.apache.activemq.usecases.TopicDurableConnectStatsTest
Running org.apache.activemq.usecases.TopicSubscriptionZeroPrefetchTest
Tests run: 2, Failures: 0, Errors: 0, Skipped: 0, Time elapsed: 2.413 sec - in org.apache.activemq.usecases.TopicSubscriptionZeroPrefetchTest
Running org.apache.activemq.usecases.TransactionRollbackOrderTest
Tests run: 1, Failures: 0, Errors: 0, Skipped: 0, Time elapsed: 2.059 sec - in org.apache.activemq.usecases.TransactionRollbackOrderTest
Running org.apache.activemq.usecases.TransactionTest
Tests run: 1, Failures: 0, Errors: 0, Skipped: 0, Time elapsed: 1.017 sec - in org.apache.activemq.usecases.TransactionTest
Running org.apache.activemq.usecases.TwoBrokerVirtualTopicForwardingTest
Tests run: 3, Failures: 0, Errors: 0, Skipped: 0, Time elapsed: 17.429 sec - in org.apache.activemq.usecases.TwoBrokerVirtualTopicForwardingTest
Running org.apache.activemq.usecases.TwoBrokerVirtualTopicSelectorAwareForwardingTest
Tests run: 6, Failures: 0, Errors: 0, Skipped: 0, Time elapsed: 44.565 sec - in org.apache.activemq.usecases.TwoBrokerVirtualTopicSelectorAwareForwardingTest
Running org.apache.activemq.usecases.TwoSecureBrokerRequestReplyTest
Tests run: 1, Failures: 0, Errors: 0, Skipped: 0, Time elapsed: 39.098 sec - in org.apache.activemq.usecases.TwoSecureBrokerRequestReplyTest
Running org.apache.activemq.usecases.VerifyNetworkConsumersDisconnectTest
Tests run: 2, Failures: 0, Errors: 0, Skipped: 0, Time elapsed: 33.678 sec - in org.apache.activemq.usecases.VerifyNetworkConsumersDisconnectTest
Running org.apache.activemq.usecases.VirtualTopicNetworkClusterReactivationTest
Tests run: 1, Failures: 0, Errors: 0, Skipped: 0, Time elapsed: 6.504 sec - in org.apache.activemq.usecases.VirtualTopicNetworkClusterReactivationTest
Running org.apache.activemq.util.LinkedNodeTest
Tests run: 3, Failures: 0, Errors: 0, Skipped: 0, Time elapsed: 0.059 sec - in org.apache.activemq.util.LinkedNodeTest
Running org.apache.activemq.util.ReflectionSupportTest
Tests run: 3, Failures: 0, Errors: 0, Skipped: 0, Time elapsed: 0.18 sec - in org.apache.activemq.util.ReflectionSupportTest
Running org.apache.activemq.xbean.DestinationBridgeAccessorsTest
Tests run: 1, Failures: 0, Errors: 0, Skipped: 0, Time elapsed: 3.017 sec - in org.apache.activemq.xbean.DestinationBridgeAccessorsTest
Running org.apache.activemq.xbean.JDBCPersistenceAdapterXBeanConfigTest
Tests run: 1, Failures: 0, Errors: 0, Skipped: 0, Time elapsed: 3.788 sec - in org.apache.activemq.xbean.JDBCPersistenceAdapterXBeanConfigTest
Running org.apache.activemq.xbean.ManagementContextXBeanConfigTest
Tests run: 3, Failures: 0, Errors: 0, Skipped: 0, Time elapsed: 5.633 sec - in org.apache.activemq.xbean.ManagementContextXBeanConfigTest
Running org.apache.activemq.xbean.MultipleTestsWithEmbeddedBrokerAndPersistenceTest
Tests run: 2, Failures: 0, Errors: 0, Skipped: 0, Time elapsed: 2.722 sec - in org.apache.activemq.xbean.MultipleTestsWithEmbeddedBrokerAndPersistenceTest
Running org.apache.activemq.xbean.MultipleTestsWithEmbeddedBrokerTest
Tests run: 2, Failures: 0, Errors: 0, Skipped: 0, Time elapsed: 1.171 sec - in org.apache.activemq.xbean.MultipleTestsWithEmbeddedBrokerTest
Running org.apache.activemq.xbean.XBeanConfigTest
Tests run: 1, Failures: 0, Errors: 0, Skipped: 0, Time elapsed: 2.246 sec - in org.apache.activemq.xbean.XBeanConfigTest
Running org.apache.activemq.xbean.XBeanStartFalseTest
Tests run: 1, Failures: 0, Errors: 0, Skipped: 0, Time elapsed: 1.473 sec - in org.apache.activemq.xbean.XBeanStartFalseTest

Results :

Failed tests: 
  AMQ2149LevelDBTest>AMQ2149Test.testTopicTransactionalOrderWithRestart:417->AMQ2149Test.doTestTransactionalOrderWithRestart:435->AMQ2149Test.verifyOrderedMessageReceipt:560
No exceptions
  AMQ4930Test.testBrowsePendingNonPersistent:63->doTestBrowsePending:105 maxBrowsePageSize
expected:<50> but was:<0>
  AMQ3410Test.testFactorySetWrong1:129 No exception caught
  AMQ3410Test.testFactorySetWrong2:157 No exception caught
  AMQ3410Test.testFactorySetWrong3:183 null
  AMQ3411Test.testFactorySetWrong1:165 No exception caught
  AMQ3411Test.testFactorySetWrong2:195 No exception caught
  AutoTransportMaxConnectionsTest.testMaxConnectionControl:130 Expected: 20 found: 0

Tests in error: 
  KahaDBFilePendingMessageCursorTest.testAddRemoveAddIndexSize:76 � NullPointer

Tests run: 3780, Failures: 8, Errors: 1, Skipped: 38

[JENKINS] Recording test results

Mime
View raw message