activemq-commits mailing list archives

Site index · List index
Message view « Date » · « Thread »
Top « Date » · « Thread »
From Apache Jenkins Server <jenk...@builds.apache.org>
Subject Build failed in Jenkins: ActiveMQ-Artemis-Master #82
Date Tue, 04 Aug 2015 18:14:21 GMT
See <https://builds.apache.org/job/ActiveMQ-Artemis-Master/82/changes>

Changes:

[clebertsuconic] ARTEMIS-162 Fix non serializable JGroups on Configuration clone used on Colocated
support

[clebertsuconic] fixing tests

------------------------------------------
[...truncated 6533 lines...]
[ERROR] <https://builds.apache.org/job/ActiveMQ-Artemis-Master/ws/artemis-server/src/main/java/org/apache/activemq/artemis/core/paging/cursor/PageSubscription.java>:119:
warning: no description for @param
[ERROR] * @param position
[ERROR] ^
[ERROR] <https://builds.apache.org/job/ActiveMQ-Artemis-Master/ws/artemis-server/src/main/java/org/apache/activemq/artemis/core/paging/cursor/PageSubscription.java>:121:
warning: no @param for iterator
[ERROR] void redeliver(PageIterator iterator, PagePosition position);
[ERROR] ^
[ERROR] <https://builds.apache.org/job/ActiveMQ-Artemis-Master/ws/artemis-server/src/main/java/org/apache/activemq/artemis/core/paging/cursor/PageSubscription.java>:126:
warning: no description for @param
[ERROR] * @param page
[ERROR] ^
[ERROR] <https://builds.apache.org/job/ActiveMQ-Artemis-Master/ws/artemis-server/src/main/java/org/apache/activemq/artemis/core/paging/cursor/PageSubscription.java>:127:
warning: no description for @return
[ERROR] * @return
[ERROR] ^
[ERROR] <https://builds.apache.org/job/ActiveMQ-Artemis-Master/ws/artemis-server/src/main/java/org/apache/activemq/artemis/core/paging/cursor/PageSubscription.java>:140:
warning: no description for @param
[ERROR] * @param pos
[ERROR] ^
[ERROR] <https://builds.apache.org/job/ActiveMQ-Artemis-Master/ws/artemis-server/src/main/java/org/apache/activemq/artemis/core/paging/cursor/PageSubscription.java>:141:
warning: no description for @return
[ERROR] * @return
[ERROR] ^
[ERROR] <https://builds.apache.org/job/ActiveMQ-Artemis-Master/ws/artemis-server/src/main/java/org/apache/activemq/artemis/core/paging/cursor/PageSubscription.java>:151:
warning: no description for @param
[ERROR] * @param deletedPage
[ERROR] ^
[ERROR] <https://builds.apache.org/job/ActiveMQ-Artemis-Master/ws/artemis-server/src/main/java/org/apache/activemq/artemis/core/paging/cursor/PageSubscription.java>:152:
warning: no description for @throws
[ERROR] * @throws Exception
[ERROR] ^
[ERROR] <https://builds.apache.org/job/ActiveMQ-Artemis-Master/ws/artemis-server/src/main/java/org/apache/activemq/artemis/core/paging/cursor/PageSubscriptionCounter.java>:40:
warning: no description for @param
[ERROR] * @param id
[ERROR] ^
[ERROR] <https://builds.apache.org/job/ActiveMQ-Artemis-Master/ws/artemis-server/src/main/java/org/apache/activemq/artemis/core/paging/cursor/PageSubscriptionCounter.java>:41:
warning: no description for @param
[ERROR] * @param variance
[ERROR] ^
[ERROR] <https://builds.apache.org/job/ActiveMQ-Artemis-Master/ws/artemis-server/src/main/java/org/apache/activemq/artemis/core/paging/cursor/impl/PageCursorProviderImpl.java>:605:
warning: no description for @param
[ERROR] * @param cursorList
[ERROR] ^
[ERROR] <https://builds.apache.org/job/ActiveMQ-Artemis-Master/ws/artemis-server/src/main/java/org/apache/activemq/artemis/core/paging/cursor/impl/PageCursorProviderImpl.java>:606:
warning: no description for @param
[ERROR] * @param currentPage
[ERROR] ^
[ERROR] <https://builds.apache.org/job/ActiveMQ-Artemis-Master/ws/artemis-server/src/main/java/org/apache/activemq/artemis/core/paging/cursor/impl/PageCursorProviderImpl.java>:607:
warning: no description for @throws
[ERROR] * @throws Exception
[ERROR] ^
[ERROR] <https://builds.apache.org/job/ActiveMQ-Artemis-Master/ws/artemis-server/src/main/java/org/apache/activemq/artemis/core/paging/cursor/impl/PagePositionImpl.java>:38:
warning: no description for @param
[ERROR] * @param pageNr
[ERROR] ^
[ERROR] <https://builds.apache.org/job/ActiveMQ-Artemis-Master/ws/artemis-server/src/main/java/org/apache/activemq/artemis/core/paging/cursor/impl/PagePositionImpl.java>:39:
warning: no description for @param
[ERROR] * @param messageNr
[ERROR] ^
[ERROR] <https://builds.apache.org/job/ActiveMQ-Artemis-Master/ws/artemis-server/src/main/java/org/apache/activemq/artemis/core/paging/cursor/impl/PageSubscriptionCounterImpl.java>:106:
warning: no description for @param
[ERROR] * @param page
[ERROR] ^
[ERROR] <https://builds.apache.org/job/ActiveMQ-Artemis-Master/ws/artemis-server/src/main/java/org/apache/activemq/artemis/core/paging/cursor/impl/PageSubscriptionCounterImpl.java>:107:
warning: no description for @param
[ERROR] * @param increment
[ERROR] ^
[ERROR] <https://builds.apache.org/job/ActiveMQ-Artemis-Master/ws/artemis-server/src/main/java/org/apache/activemq/artemis/core/paging/cursor/impl/PageSubscriptionCounterImpl.java>:108:
warning: no description for @throws
[ERROR] * @throws Exception
[ERROR] ^
[ERROR] <https://builds.apache.org/job/ActiveMQ-Artemis-Master/ws/artemis-server/src/main/java/org/apache/activemq/artemis/core/paging/cursor/impl/PageSubscriptionCounterImpl.java>:140:
warning: no description for @param
[ERROR] * @param pageID
[ERROR] ^
[ERROR] <https://builds.apache.org/job/ActiveMQ-Artemis-Master/ws/artemis-server/src/main/java/org/apache/activemq/artemis/core/paging/cursor/impl/PageSubscriptionCounterImpl.java>:205:
warning: no description for @param
[ERROR] * @param tx
[ERROR] ^
[ERROR] <https://builds.apache.org/job/ActiveMQ-Artemis-Master/ws/artemis-server/src/main/java/org/apache/activemq/artemis/core/paging/cursor/impl/PageSubscriptionCounterImpl.java>:206:
warning: no description for @param
[ERROR] * @param recordID1
[ERROR] ^
[ERROR] <https://builds.apache.org/job/ActiveMQ-Artemis-Master/ws/artemis-server/src/main/java/org/apache/activemq/artemis/core/paging/cursor/impl/PageSubscriptionCounterImpl.java>:207:
warning: no description for @param
[ERROR] * @param add
[ERROR] ^
[ERROR] <https://builds.apache.org/job/ActiveMQ-Artemis-Master/ws/artemis-server/src/main/java/org/apache/activemq/artemis/core/paging/cursor/impl/PageSubscriptionCounterImpl.java>:325:
warning: no @param for persistent
[ERROR] public void setPersistent(final boolean persistent)
[ERROR] ^
[ERROR] <https://builds.apache.org/job/ActiveMQ-Artemis-Master/ws/artemis-server/src/main/java/org/apache/activemq/artemis/core/paging/PagedMessage.java>:34:
warning: no @return
[ERROR] long[] getQueueIDs();
[ERROR] ^
[ERROR] <https://builds.apache.org/job/ActiveMQ-Artemis-Master/ws/artemis-server/src/main/java/org/apache/activemq/artemis/core/paging/PageTransactionInfo.java>:62:
warning: no @param for pageIterator
[ERROR] boolean deliverAfterCommit(PageIterator pageIterator, PageSubscription cursor, PagePosition
cursorPos);
[ERROR] ^
[ERROR] <https://builds.apache.org/job/ActiveMQ-Artemis-Master/ws/artemis-server/src/main/java/org/apache/activemq/artemis/core/paging/PageTransactionInfo.java>:62:
warning: no @param for cursor
[ERROR] boolean deliverAfterCommit(PageIterator pageIterator, PageSubscription cursor, PagePosition
cursorPos);
[ERROR] ^
[ERROR] <https://builds.apache.org/job/ActiveMQ-Artemis-Master/ws/artemis-server/src/main/java/org/apache/activemq/artemis/core/paging/PageTransactionInfo.java>:62:
warning: no @param for cursorPos
[ERROR] boolean deliverAfterCommit(PageIterator pageIterator, PageSubscription cursor, PagePosition
cursorPos);
[ERROR] ^
[ERROR] <https://builds.apache.org/job/ActiveMQ-Artemis-Master/ws/artemis-server/src/main/java/org/apache/activemq/artemis/core/paging/PagingManager.java>:43:
warning: no @param for address
[ERROR] PagingStore getPageStore(SimpleString address) throws Exception;
[ERROR] ^
[ERROR] <https://builds.apache.org/job/ActiveMQ-Artemis-Master/ws/artemis-server/src/main/java/org/apache/activemq/artemis/core/paging/PagingManager.java>:43:
warning: no @return
[ERROR] PagingStore getPageStore(SimpleString address) throws Exception;
[ERROR] ^
[ERROR] <https://builds.apache.org/job/ActiveMQ-Artemis-Master/ws/artemis-server/src/main/java/org/apache/activemq/artemis/core/paging/PagingManager.java>:43:
warning: no @throws for java.lang.Exception
[ERROR] PagingStore getPageStore(SimpleString address) throws Exception;
[ERROR] ^
[ERROR] <https://builds.apache.org/job/ActiveMQ-Artemis-Master/ws/artemis-server/src/main/java/org/apache/activemq/artemis/core/paging/PagingManager.java>:48:
warning: no @param for pageTransaction
[ERROR] void addTransaction(PageTransactionInfo pageTransaction);
[ERROR] ^
[ERROR] <https://builds.apache.org/job/ActiveMQ-Artemis-Master/ws/artemis-server/src/main/java/org/apache/activemq/artemis/core/paging/PagingManager.java>:53:
warning: no @param for transactionID
[ERROR] PageTransactionInfo getTransaction(long transactionID);
[ERROR] ^
[ERROR] <https://builds.apache.org/job/ActiveMQ-Artemis-Master/ws/artemis-server/src/main/java/org/apache/activemq/artemis/core/paging/PagingManager.java>:53:
warning: no @return
[ERROR] PageTransactionInfo getTransaction(long transactionID);
[ERROR] ^
[ERROR] <https://builds.apache.org/job/ActiveMQ-Artemis-Master/ws/artemis-server/src/main/java/org/apache/activemq/artemis/core/paging/PagingManager.java>:56:
warning: no description for @param
[ERROR] * @param transactionID
[ERROR] ^
[ERROR] <https://builds.apache.org/job/ActiveMQ-Artemis-Master/ws/artemis-server/src/main/java/org/apache/activemq/artemis/core/paging/PagingManager.java>:64:
warning: no description for @throws
[ERROR] * @throws Exception
[ERROR] ^
[ERROR] <https://builds.apache.org/job/ActiveMQ-Artemis-Master/ws/artemis-server/src/main/java/org/apache/activemq/artemis/core/paging/PagingManager.java>:29:
error: reference not found
[ERROR] * | {@link org.apache.activemq.artemis.core.postoffice.PostOffice} |-------&gt;
|{@link PagingManager}|-------&gt; |{@link PagingStore} | ------&gt; | {@link org.apache.activemq.artemis.core.paging.impl.Page}
 | ------&gt; | {@link SequentialFile} |
[ERROR] ^
[ERROR] <https://builds.apache.org/job/ActiveMQ-Artemis-Master/ws/artemis-server/src/main/java/org/apache/activemq/artemis/core/paging/PagingStore.java>:53:
warning: no @return
[ERROR] int getCurrentWritingPage();
[ERROR] ^
[ERROR] <https://builds.apache.org/job/ActiveMQ-Artemis-Master/ws/artemis-server/src/main/java/org/apache/activemq/artemis/core/paging/PagingStore.java>:76:
warning: no @throws for java.lang.Exception
[ERROR] void sync() throws Exception;
[ERROR] ^
[ERROR] <https://builds.apache.org/job/ActiveMQ-Artemis-Master/ws/artemis-server/src/main/java/org/apache/activemq/artemis/core/paging/PagingStore.java>:81:
warning: no @throws for java.lang.Exception
[ERROR] void ioSync() throws Exception;
[ERROR] ^
[ERROR] <https://builds.apache.org/job/ActiveMQ-Artemis-Master/ws/artemis-server/src/main/java/org/apache/activemq/artemis/core/paging/PagingStore.java>:93:
warning: no @param for message
[ERROR] boolean page(ServerMessage message, Transaction tx, RouteContextList listCtx, ReadLock
readLock) throws Exception;
[ERROR] ^
[ERROR] <https://builds.apache.org/job/ActiveMQ-Artemis-Master/ws/artemis-server/src/main/java/org/apache/activemq/artemis/core/paging/PagingStore.java>:93:
warning: no @param for tx
[ERROR] boolean page(ServerMessage message, Transaction tx, RouteContextList listCtx, ReadLock
readLock) throws Exception;
[ERROR] ^
[ERROR] <https://builds.apache.org/job/ActiveMQ-Artemis-Master/ws/artemis-server/src/main/java/org/apache/activemq/artemis/core/paging/PagingStore.java>:93:
warning: no @param for listCtx
[ERROR] boolean page(ServerMessage message, Transaction tx, RouteContextList listCtx, ReadLock
readLock) throws Exception;
[ERROR] ^
[ERROR] <https://builds.apache.org/job/ActiveMQ-Artemis-Master/ws/artemis-server/src/main/java/org/apache/activemq/artemis/core/paging/PagingStore.java>:93:
warning: no @throws for java.lang.Exception
[ERROR] boolean page(ServerMessage message, Transaction tx, RouteContextList listCtx, ReadLock
readLock) throws Exception;
[ERROR] ^
[ERROR] <https://builds.apache.org/job/ActiveMQ-Artemis-Master/ws/artemis-server/src/main/java/org/apache/activemq/artemis/core/paging/PagingStore.java>:112:
warning: no @return
[ERROR] Page depage() throws Exception;
[ERROR] ^
[ERROR] <https://builds.apache.org/job/ActiveMQ-Artemis-Master/ws/artemis-server/src/main/java/org/apache/activemq/artemis/core/paging/PagingStore.java>:122:
warning: no @throws for java.lang.Exception
[ERROR] boolean startPaging() throws Exception;
[ERROR] ^
[ERROR] <https://builds.apache.org/job/ActiveMQ-Artemis-Master/ws/artemis-server/src/main/java/org/apache/activemq/artemis/core/paging/PagingStore.java>:154:
warning: no description for @throws
[ERROR] * @throws Exception
[ERROR] ^
[ERROR] <https://builds.apache.org/job/ActiveMQ-Artemis-Master/ws/artemis-server/src/main/java/org/apache/activemq/artemis/core/paging/PagingStore.java>:161:
error: reference not found
[ERROR] * Sending is done here to avoid exposing the internal {@link SequentialFile}s.
[ERROR] ^
[ERROR] <https://builds.apache.org/job/ActiveMQ-Artemis-Master/ws/artemis-server/src/main/java/org/apache/activemq/artemis/core/paging/PagingStore.java>:163:
warning: no description for @param
[ERROR] * @param replicator
[ERROR] ^
[ERROR] <https://builds.apache.org/job/ActiveMQ-Artemis-Master/ws/artemis-server/src/main/java/org/apache/activemq/artemis/core/paging/PagingStore.java>:164:
warning: no description for @param
[ERROR] * @param pageIds
[ERROR] ^
[ERROR] <https://builds.apache.org/job/ActiveMQ-Artemis-Master/ws/artemis-server/src/main/java/org/apache/activemq/artemis/core/paging/PagingStore.java>:165:
warning: no description for @throws
[ERROR] * @throws Exception
[ERROR] ^
[ERROR] <https://builds.apache.org/job/ActiveMQ-Artemis-Master/ws/artemis-server/src/main/java/org/apache/activemq/artemis/core/paging/impl/Page.java>:401:
warning: no description for @param
[ERROR] * @param pageSubscriptionCounter
[ERROR] ^
[ERROR] <https://builds.apache.org/job/ActiveMQ-Artemis-Master/ws/artemis-server/src/main/java/org/apache/activemq/artemis/core/paging/impl/PageTransactionInfoImpl.java>:178:
warning: no description for @param
[ERROR] * @param storageManager
[ERROR] ^
[ERROR] <https://builds.apache.org/job/ActiveMQ-Artemis-Master/ws/artemis-server/src/main/java/org/apache/activemq/artemis/core/paging/impl/PageTransactionInfoImpl.java>:179:
warning: no description for @param
[ERROR] * @param pagingManager
[ERROR] ^
[ERROR] <https://builds.apache.org/job/ActiveMQ-Artemis-Master/ws/artemis-server/src/main/java/org/apache/activemq/artemis/core/paging/impl/PageTransactionInfoImpl.java>:180:
warning: no description for @param
[ERROR] * @param tx
[ERROR] ^
[ERROR] <https://builds.apache.org/job/ActiveMQ-Artemis-Master/ws/artemis-server/src/main/java/org/apache/activemq/artemis/core/paging/impl/PageTransactionInfoImpl.java>:182:
warning: no @param for increment
[ERROR] protected UpdatePageTXOperation internalUpdatePageManager(final StorageManager storageManager,
[ERROR] ^
[ERROR] <https://builds.apache.org/job/ActiveMQ-Artemis-Master/ws/artemis-server/src/main/java/org/apache/activemq/artemis/core/paging/impl/PageTransactionInfoImpl.java>:182:
warning: no @return
[ERROR] protected UpdatePageTXOperation internalUpdatePageManager(final StorageManager storageManager,
[ERROR] ^
[ERROR] <https://builds.apache.org/job/ActiveMQ-Artemis-Master/ws/artemis-server/src/main/java/org/apache/activemq/artemis/core/paging/impl/PagingStoreImpl.java>:188:
warning: no description for @param
[ERROR] * @param addressSettings
[ERROR] ^
[ERROR] <https://builds.apache.org/job/ActiveMQ-Artemis-Master/ws/artemis-server/src/main/java/org/apache/activemq/artemis/core/transaction/TransactionOperation.java>:36:
warning: no @param for tx
[ERROR] void afterPrepare(Transaction tx);
[ERROR] ^
[ERROR] <https://builds.apache.org/job/ActiveMQ-Artemis-Master/ws/artemis-server/src/main/java/org/apache/activemq/artemis/core/transaction/TransactionOperation.java>:45:
warning: no @param for tx
[ERROR] void afterCommit(Transaction tx);
[ERROR] ^
[ERROR] <https://builds.apache.org/job/ActiveMQ-Artemis-Master/ws/artemis-server/src/main/java/org/apache/activemq/artemis/core/transaction/TransactionOperation.java>:54:
warning: no @param for tx
[ERROR] void afterRollback(Transaction tx);
[ERROR] ^
[ERROR] <https://builds.apache.org/job/ActiveMQ-Artemis-Master/ws/artemis-server/src/main/java/org/apache/activemq/artemis/core/transaction/impl/BindingsTransactionImpl.java>:32:
warning: no description for @throws
[ERROR] * @throws Exception
[ERROR] ^
[ERROR] <https://builds.apache.org/job/ActiveMQ-Artemis-Master/ws/artemis-server/src/main/java/org/apache/activemq/artemis/core/transaction/impl/TransactionImpl.java>:287:
warning: no description for @throws
[ERROR] * @throws Exception
[ERROR] ^
[ERROR] <https://builds.apache.org/job/ActiveMQ-Artemis-Master/ws/artemis-server/src/main/java/org/apache/activemq/artemis/core/remoting/impl/netty/NettyAcceptor.java>:661:
warning: no description for @param
[ERROR] * @param defaultActiveMQPrincipal
[ERROR] ^
[ERROR] <https://builds.apache.org/job/ActiveMQ-Artemis-Master/ws/artemis-server/src/main/java/org/apache/activemq/artemis/core/remoting/impl/netty/NettyAcceptor.java>:671:
warning: no description for @return
[ERROR] * @return
[ERROR] ^
[ERROR] <https://builds.apache.org/job/ActiveMQ-Artemis-Master/ws/artemis-server/src/main/java/org/apache/activemq/artemis/core/remoting/server/RemotingService.java>:71:
warning: no description for @param
[ERROR] * @param principal
[ERROR] ^
[ERROR] <https://builds.apache.org/job/ActiveMQ-Artemis-Master/ws/artemis-server/src/main/java/org/apache/activemq/artemis/core/remoting/server/RemotingService.java>:84:
warning: no description for @param
[ERROR] * @param scaleDownNodeID
[ERROR] ^
[ERROR] <https://builds.apache.org/job/ActiveMQ-Artemis-Master/ws/artemis-server/src/main/java/org/apache/activemq/artemis/core/remoting/server/RemotingService.java>:85:
warning: no description for @param
[ERROR] * @param remotingConnection
[ERROR] ^
[ERROR] <https://builds.apache.org/job/ActiveMQ-Artemis-Master/ws/artemis-server/src/main/java/org/apache/activemq/artemis/core/remoting/server/RemotingService.java>:94:
warning: no @return
[ERROR] Acceptor getAcceptor(String name);
[ERROR] ^
[ERROR] <https://builds.apache.org/job/ActiveMQ-Artemis-Master/ws/artemis-server/src/main/java/org/apache/activemq/artemis/core/server/ActiveMQMessageBundle.java>:286:
warning: no @param for key
[ERROR] String destroyConnectionWithSessionMetadataHeader(String key, String value);
[ERROR] ^
[ERROR] <https://builds.apache.org/job/ActiveMQ-Artemis-Master/ws/artemis-server/src/main/java/org/apache/activemq/artemis/core/server/ActiveMQMessageBundle.java>:286:
warning: no @param for value
[ERROR] String destroyConnectionWithSessionMetadataHeader(String key, String value);
[ERROR] ^
[ERROR] <https://builds.apache.org/job/ActiveMQ-Artemis-Master/ws/artemis-server/src/main/java/org/apache/activemq/artemis/core/server/ActiveMQMessageBundle.java>:286:
warning: no @return
[ERROR] String destroyConnectionWithSessionMetadataHeader(String key, String value);
[ERROR] ^
[ERROR] <https://builds.apache.org/job/ActiveMQ-Artemis-Master/ws/artemis-server/src/main/java/org/apache/activemq/artemis/core/server/ActiveMQMessageBundle.java>:292:
warning: no @param for serverSessionString
[ERROR] String destroyConnectionWithSessionMetadataClosingConnection(String serverSessionString);
[ERROR] ^
[ERROR] <https://builds.apache.org/job/ActiveMQ-Artemis-Master/ws/artemis-server/src/main/java/org/apache/activemq/artemis/core/server/ActiveMQMessageBundle.java>:292:
warning: no @return
[ERROR] String destroyConnectionWithSessionMetadataClosingConnection(String serverSessionString);
[ERROR] ^
[ERROR] <https://builds.apache.org/job/ActiveMQ-Artemis-Master/ws/artemis-server/src/main/java/org/apache/activemq/artemis/core/server/ActiveMQMessageBundle.java>:298:
warning: no @param for key
[ERROR] ActiveMQDisconnectedException destroyConnectionWithSessionMetadataSendException(String
key, String value);
[ERROR] ^
[ERROR] <https://builds.apache.org/job/ActiveMQ-Artemis-Master/ws/artemis-server/src/main/java/org/apache/activemq/artemis/core/server/ActiveMQMessageBundle.java>:298:
warning: no @param for value
[ERROR] ActiveMQDisconnectedException destroyConnectionWithSessionMetadataSendException(String
key, String value);
[ERROR] ^
[ERROR] <https://builds.apache.org/job/ActiveMQ-Artemis-Master/ws/artemis-server/src/main/java/org/apache/activemq/artemis/core/protocol/core/impl/wireformat/ReplicationSyncFileMessage.java>:30:
error: reference not found
[ERROR] * Message is used to sync {@link org.apache.activemq.artemis.core.journal.SequentialFile}s
to a backup server. The {@link FileType} controls
[ERROR] ^
[ERROR] 
[ERROR] Command line was: /home/jenkins/jenkins-slave/tools/hudson.model.JDK/latest1.8/jre/../bin/javadoc
@options @packages
[ERROR] 
[ERROR] Refer to the generated Javadoc files in '<https://builds.apache.org/job/ActiveMQ-Artemis-Master/ws/artemis-server/target/site/apidocs'>
dir.
[ERROR] -> [Help 1]
[ERROR] 
[ERROR] To see the full stack trace of the errors, re-run Maven with the -e switch.
[ERROR] Re-run Maven using the -X switch to enable full debug logging.
[ERROR] 
[ERROR] For more information about the errors and possible solutions, please read the following
articles:
[ERROR] [Help 1] http://cwiki.apache.org/confluence/display/MAVEN/MojoExecutionException
[ERROR] 
[ERROR] After correcting the problems, you can resume the build with the command
[ERROR]   mvn <goals> -rf :artemis-server
Build step 'Invoke top-level Maven targets' marked build as failure
Performing Post build task...
Could not match :Too many files with unapproved license  : False
Logical operation result is FALSE
Skipping script  : cat ratReport.txt
END OF POST BUILD TASK 	: 0
Recording test results

Mime
View raw message