activemq-commits mailing list archives

Site index · List index
Message view « Date » · « Thread »
Top « Date » · « Thread »
From Apache Jenkins Server <jenk...@builds.apache.org>
Subject Build failed in Jenkins: ActiveMQ-Java7 » ActiveMQ :: KahaDB Store #785
Date Fri, 07 Aug 2015 17:50:28 GMT
See <https://builds.apache.org/job/ActiveMQ-Java7/org.apache.activemq$activemq-kahadb-store/785/>

------------------------------------------
[INFO]                                                                         
[INFO] ------------------------------------------------------------------------
[INFO] Building ActiveMQ :: KahaDB Store 5.12-SNAPSHOT
[INFO] ------------------------------------------------------------------------
Downloading: http://repo.maven.apache.org/maven2/org/apache/activemq/activeio-core/3.1.4/activeio-core-3.1.4.pom
Downloaded: http://repo.maven.apache.org/maven2/org/apache/activemq/activeio-core/3.1.4/activeio-core-3.1.4.pom
(3 KB at 136.9 KB/sec)
Downloading: http://repo.maven.apache.org/maven2/org/apache/activemq/activeio-parent/3.1.4/activeio-parent-3.1.4.pom
Downloaded: http://repo.maven.apache.org/maven2/org/apache/activemq/activeio-parent/3.1.4/activeio-parent-3.1.4.pom
(12 KB at 488.1 KB/sec)
Downloading: http://repo.maven.apache.org/maven2/org/apache/geronimo/specs/geronimo-jacc_1.1_spec/1.0.1/geronimo-jacc_1.1_spec-1.0.1.pom
Downloaded: http://repo.maven.apache.org/maven2/org/apache/geronimo/specs/geronimo-jacc_1.1_spec/1.0.1/geronimo-jacc_1.1_spec-1.0.1.pom
(3 KB at 100.1 KB/sec)
Downloading: http://repo.maven.apache.org/maven2/org/springframework/spring-context/3.2.11.RELEASE/spring-context-3.2.11.RELEASE.pom
Downloaded: http://repo.maven.apache.org/maven2/org/springframework/spring-context/3.2.11.RELEASE/spring-context-3.2.11.RELEASE.pom
(5 KB at 218.0 KB/sec)
Downloading: http://repo.maven.apache.org/maven2/org/springframework/spring-aop/3.2.11.RELEASE/spring-aop-3.2.11.RELEASE.pom
Downloaded: http://repo.maven.apache.org/maven2/org/springframework/spring-aop/3.2.11.RELEASE/spring-aop-3.2.11.RELEASE.pom
(3 KB at 112.1 KB/sec)
Downloading: http://repo.maven.apache.org/maven2/org/springframework/spring-beans/3.2.11.RELEASE/spring-beans-3.2.11.RELEASE.pom
Downloaded: http://repo.maven.apache.org/maven2/org/springframework/spring-beans/3.2.11.RELEASE/spring-beans-3.2.11.RELEASE.pom
(2 KB at 86.5 KB/sec)
Downloading: http://repo.maven.apache.org/maven2/org/springframework/spring-core/3.2.11.RELEASE/spring-core-3.2.11.RELEASE.pom
Downloaded: http://repo.maven.apache.org/maven2/org/springframework/spring-core/3.2.11.RELEASE/spring-core-3.2.11.RELEASE.pom
(3 KB at 95.5 KB/sec)
Downloading: http://repo.maven.apache.org/maven2/org/springframework/spring-expression/3.2.11.RELEASE/spring-expression-3.2.11.RELEASE.pom
Downloaded: http://repo.maven.apache.org/maven2/org/springframework/spring-expression/3.2.11.RELEASE/spring-expression-3.2.11.RELEASE.pom
(2 KB at 70.8 KB/sec)
Downloading: http://repo.maven.apache.org/maven2/org/apache/activemq/activeio-core/3.1.4/activeio-core-3.1.4.jar
Downloading: http://repo.maven.apache.org/maven2/org/springframework/spring-context/3.2.11.RELEASE/spring-context-3.2.11.RELEASE.jar
Downloading: http://repo.maven.apache.org/maven2/org/apache/geronimo/specs/geronimo-jacc_1.1_spec/1.0.1/geronimo-jacc_1.1_spec-1.0.1.jar
Downloading: http://repo.maven.apache.org/maven2/org/springframework/spring-aop/3.2.11.RELEASE/spring-aop-3.2.11.RELEASE.jar
Downloading: http://repo.maven.apache.org/maven2/org/springframework/spring-beans/3.2.11.RELEASE/spring-beans-3.2.11.RELEASE.jar
Downloaded: http://repo.maven.apache.org/maven2/org/apache/geronimo/specs/geronimo-jacc_1.1_spec/1.0.1/geronimo-jacc_1.1_spec-1.0.1.jar
(33 KB at 1644.8 KB/sec)
Downloading: http://repo.maven.apache.org/maven2/org/springframework/spring-core/3.2.11.RELEASE/spring-core-3.2.11.RELEASE.jar
Downloaded: http://repo.maven.apache.org/maven2/org/apache/activemq/activeio-core/3.1.4/activeio-core-3.1.4.jar
(101 KB at 3339.1 KB/sec)
Downloading: http://repo.maven.apache.org/maven2/org/springframework/spring-expression/3.2.11.RELEASE/spring-expression-3.2.11.RELEASE.jar
Downloaded: http://repo.maven.apache.org/maven2/org/springframework/spring-aop/3.2.11.RELEASE/spring-aop-3.2.11.RELEASE.jar
(331 KB at 7025.8 KB/sec)
Downloaded: http://repo.maven.apache.org/maven2/org/springframework/spring-expression/3.2.11.RELEASE/spring-expression-3.2.11.RELEASE.jar
(192 KB at 5184.4 KB/sec)
Downloaded: http://repo.maven.apache.org/maven2/org/springframework/spring-core/3.2.11.RELEASE/spring-core-3.2.11.RELEASE.jar
(865 KB at 17286.4 KB/sec)
Downloaded: http://repo.maven.apache.org/maven2/org/springframework/spring-beans/3.2.11.RELEASE/spring-beans-3.2.11.RELEASE.jar
(599 KB at 7394.4 KB/sec)
Downloaded: http://repo.maven.apache.org/maven2/org/springframework/spring-context/3.2.11.RELEASE/spring-context-3.2.11.RELEASE.jar
(847 KB at 7296.0 KB/sec)
[INFO] 
[INFO] --- maven-clean-plugin:2.5:clean (default-clean) @ activemq-kahadb-store ---
[INFO] 
[INFO] --- maven-enforcer-plugin:1.0.1:enforce (default) @ activemq-kahadb-store ---
[INFO] 
[INFO] --- maven-bundle-plugin:2.3.7:cleanVersions (cleanVersions) @ activemq-kahadb-store
---
[INFO] 
[INFO] --- build-helper-maven-plugin:1.8:add-source (add-source) @ activemq-kahadb-store ---
[INFO] Source directory: <https://builds.apache.org/job/ActiveMQ-Java7/org.apache.activemq$activemq-kahadb-store/ws/target/generated-sources/proto>
added.
[INFO] 
[INFO] --- activemq-protobuf:1.1:compile (default) @ activemq-kahadb-store ---
[INFO] Compiling: <https://builds.apache.org/job/ActiveMQ-Java7/org.apache.activemq$activemq-kahadb-store/ws/src/main/proto/journal-data.proto>
[INFO] 
[INFO] --- maven-remote-resources-plugin:1.3:process (default) @ activemq-kahadb-store ---
[INFO] 
[INFO] --- maven-resources-plugin:2.5:resources (default-resources) @ activemq-kahadb-store
---
[debug] execute contextualize
[INFO] Using 'UTF-8' encoding to copy filtered resources.
[INFO] skip non existing resourceDirectory <https://builds.apache.org/job/ActiveMQ-Java7/org.apache.activemq$activemq-kahadb-store/ws/src/main/resources>
[INFO] Copying 3 resources
[INFO] 
[INFO] --- maven-compiler-plugin:3.1:compile (default-compile) @ activemq-kahadb-store ---
[INFO] Changes detected - recompiling the module!
[INFO] Compiling 93 source files to <https://builds.apache.org/job/ActiveMQ-Java7/org.apache.activemq$activemq-kahadb-store/ws/target/classes>
[INFO] -------------------------------------------------------------
[WARNING] COMPILATION WARNING : 
[INFO] -------------------------------------------------------------
[WARNING] <https://builds.apache.org/job/ActiveMQ-Java7/org.apache.activemq$activemq-kahadb-store/ws/target/generated-sources/proto/org/apache/activemq/store/kahadb/data/KahaAddScheduledJobCommand.java>:
Some input files use unchecked or unsafe operations.
[WARNING] <https://builds.apache.org/job/ActiveMQ-Java7/org.apache.activemq$activemq-kahadb-store/ws/target/generated-sources/proto/org/apache/activemq/store/kahadb/data/KahaAddScheduledJobCommand.java>:
Recompile with -Xlint:unchecked for details.
[INFO] 2 warnings 
[INFO] -------------------------------------------------------------
[INFO] -------------------------------------------------------------
[ERROR] COMPILATION ERROR : 
[INFO] -------------------------------------------------------------
[ERROR] <https://builds.apache.org/job/ActiveMQ-Java7/org.apache.activemq$activemq-kahadb-store/ws/src/main/java/org/apache/activemq/store/kahadb/KahaDBStore.java>:[1011,31]
cannot find symbol
  symbol:   method putIfAbsent(java.lang.String,org.apache.activemq.store.MessageStore)
  location: variable storeCache of type java.util.Map<java.lang.String,org.apache.activemq.store.MessageStore>
[ERROR] <https://builds.apache.org/job/ActiveMQ-Java7/org.apache.activemq$activemq-kahadb-store/ws/src/main/java/org/apache/activemq/store/kahadb/KahaDBStore.java>:[1026,31]
cannot find symbol
  symbol:   method putIfAbsent(java.lang.String,org.apache.activemq.store.TopicMessageStore)
  location: variable storeCache of type java.util.Map<java.lang.String,org.apache.activemq.store.MessageStore>
[INFO] 2 errors 
[INFO] -------------------------------------------------------------

Mime
View raw message