activemq-commits mailing list archives

Site index · List index
Message view « Date » · « Thread »
Top « Date » · « Thread »
From Apache Jenkins Server <jenk...@builds.apache.org>
Subject Build failed in Jenkins: ActiveMQ-Java8 » ActiveMQ :: Unit Tests #443
Date Tue, 11 Aug 2015 15:19:13 GMT
See <https://builds.apache.org/job/ActiveMQ-Java8/org.apache.activemq$activemq-unit-tests/443/changes>

Changes:

[tabish121] [maven-release-plugin] prepare release activemq-5.12.0

[tabish121] [maven-release-plugin] prepare for next development iteration

------------------------------------------
[...truncated 313 lines...]
Running org.apache.activemq.broker.region.cursors.StoreQueueCursorOrderTest
Tests run: 5, Failures: 0, Errors: 0, Skipped: 0, Time elapsed: 11.542 sec - in org.apache.activemq.broker.region.cursors.StoreQueueCursorOrderTest
Running org.apache.activemq.broker.region.group.MessageGroupHashBucketTest
Tests run: 2, Failures: 0, Errors: 0, Skipped: 0, Time elapsed: 0.057 sec - in org.apache.activemq.broker.region.group.MessageGroupHashBucketTest
Running org.apache.activemq.broker.region.group.MessageGroupMapTest
Tests run: 2, Failures: 0, Errors: 0, Skipped: 0, Time elapsed: 0.054 sec - in org.apache.activemq.broker.region.group.MessageGroupMapTest
Running org.apache.activemq.broker.region.group.MessageGroupTest
Tests run: 3, Failures: 0, Errors: 0, Skipped: 0, Time elapsed: 1.388 sec - in org.apache.activemq.broker.region.group.MessageGroupTest
Running org.apache.activemq.broker.scheduler.JobSchedulerBrokerShutdownTest
Tests run: 1, Failures: 0, Errors: 0, Skipped: 0, Time elapsed: 10.411 sec - in org.apache.activemq.broker.scheduler.JobSchedulerBrokerShutdownTest
Running org.apache.activemq.broker.scheduler.JobSchedulerStoreCheckpointTest
Tests run: 1, Failures: 0, Errors: 0, Skipped: 0, Time elapsed: 65.199 sec - in org.apache.activemq.broker.scheduler.JobSchedulerStoreCheckpointTest
Running org.apache.activemq.broker.scheduler.JobSchedulerTxTest
Tests run: 2, Failures: 0, Errors: 0, Skipped: 0, Time elapsed: 17.372 sec - in org.apache.activemq.broker.scheduler.JobSchedulerTxTest
Running org.apache.activemq.broker.scheduler.KahaDBSchedulerIndexRebuildTest
Tests run: 2, Failures: 0, Errors: 0, Skipped: 0, Time elapsed: 46.214 sec - in org.apache.activemq.broker.scheduler.KahaDBSchedulerIndexRebuildTest
Running org.apache.activemq.broker.scheduler.KahaDBSchedulerMissingJournalLogsTest
Tests run: 2, Failures: 0, Errors: 0, Skipped: 0, Time elapsed: 16.787 sec - in org.apache.activemq.broker.scheduler.KahaDBSchedulerMissingJournalLogsTest
Running org.apache.activemq.broker.scheduler.LostScheduledMessagesTest
Tests run: 2, Failures: 0, Errors: 0, Skipped: 0, Time elapsed: 39.226 sec - in org.apache.activemq.broker.scheduler.LostScheduledMessagesTest
Running org.apache.activemq.broker.scheduler.SchedulerDBVersionTest
Tests run: 2, Failures: 0, Errors: 0, Skipped: 1, Time elapsed: 3.237 sec - in org.apache.activemq.broker.scheduler.SchedulerDBVersionTest
Running org.apache.activemq.broker.scheduler.memory.InMemeoryJmsSchedulerTest
Tests run: 6, Failures: 0, Errors: 0, Skipped: 0, Time elapsed: 99.823 sec - in org.apache.activemq.broker.scheduler.memory.InMemeoryJmsSchedulerTest
Running org.apache.activemq.broker.scheduler.memory.InMemoryJmsCronSchedulerTest
Tests run: 2, Failures: 0, Errors: 0, Skipped: 0, Time elapsed: 162.144 sec - in org.apache.activemq.broker.scheduler.memory.InMemoryJmsCronSchedulerTest
Running org.apache.activemq.broker.scheduler.memory.InMemoryJobSchedulerManagementTest
Tests run: 7, Failures: 0, Errors: 0, Skipped: 0, Time elapsed: 75.703 sec - in org.apache.activemq.broker.scheduler.memory.InMemoryJobSchedulerManagementTest
Running org.apache.activemq.broker.scheduler.memory.InMemoryJobSchedulerStoreTest
Tests run: 1, Failures: 0, Errors: 0, Skipped: 0, Time elapsed: 0.354 sec - in org.apache.activemq.broker.scheduler.memory.InMemoryJobSchedulerStoreTest
Running org.apache.activemq.broker.scheduler.memory.InMemoryJobSchedulerTest
Tests run: 10, Failures: 0, Errors: 0, Skipped: 0, Time elapsed: 64.775 sec - in org.apache.activemq.broker.scheduler.memory.InMemoryJobSchedulerTest
Running org.apache.activemq.broker.scheduler.memory.InMemoryJobSchedulerTxTest
Tests run: 2, Failures: 0, Errors: 0, Skipped: 0, Time elapsed: 12.689 sec - in org.apache.activemq.broker.scheduler.memory.InMemoryJobSchedulerTxTest
Running org.apache.activemq.broker.util.DestinationsPluginTest
Tests run: 1, Failures: 0, Errors: 0, Skipped: 0, Time elapsed: 0.85 sec - in org.apache.activemq.broker.util.DestinationsPluginTest
Running org.apache.activemq.broker.util.RedeliveryPluginTest
Tests run: 1, Failures: 0, Errors: 0, Skipped: 0, Time elapsed: 0.392 sec - in org.apache.activemq.broker.util.RedeliveryPluginTest
Running org.apache.activemq.broker.util.TimeStampingBrokerPluginTest
Tests run: 3, Failures: 0, Errors: 0, Skipped: 0, Time elapsed: 2.849 sec - in org.apache.activemq.broker.util.TimeStampingBrokerPluginTest
Running org.apache.activemq.broker.virtual.CompositeQueueTest
Tests run: 1, Failures: 0, Errors: 0, Skipped: 0, Time elapsed: 1.434 sec - in org.apache.activemq.broker.virtual.CompositeQueueTest
Running org.apache.activemq.broker.virtual.DestinationInterceptorDurableSubTest
Tests run: 1, Failures: 0, Errors: 0, Skipped: 0, Time elapsed: 1.59 sec - in org.apache.activemq.broker.virtual.DestinationInterceptorDurableSubTest
Running org.apache.activemq.broker.virtual.MirroredQueueTest
Tests run: 2, Failures: 0, Errors: 0, Skipped: 0, Time elapsed: 1.027 sec - in org.apache.activemq.broker.virtual.MirroredQueueTest
Running org.apache.activemq.broker.virtual.MirroredQueueUsingVirtualTopicQueueTest
Tests run: 2, Failures: 0, Errors: 0, Skipped: 0, Time elapsed: 1.079 sec - in org.apache.activemq.broker.virtual.MirroredQueueUsingVirtualTopicQueueTest
Running org.apache.activemq.broker.virtual.VirtualDestPerfTest
Tests run: 2, Failures: 0, Errors: 0, Skipped: 2, Time elapsed: 0.088 sec - in org.apache.activemq.broker.virtual.VirtualDestPerfTest
Running org.apache.activemq.broker.virtual.VirtualTopicFanoutPerfTest
Tests run: 1, Failures: 0, Errors: 0, Skipped: 1, Time elapsed: 0.068 sec - in org.apache.activemq.broker.virtual.VirtualTopicFanoutPerfTest
Running org.apache.activemq.broker.virtual.VirtualTopicPubSubTest
Tests run: 2, Failures: 0, Errors: 0, Skipped: 0, Time elapsed: 1.142 sec - in org.apache.activemq.broker.virtual.VirtualTopicPubSubTest
Running org.apache.activemq.broker.virtual.VirtualTopicPubSubUsingXBeanTest
Tests run: 2, Failures: 0, Errors: 0, Skipped: 0, Time elapsed: 1.16 sec - in org.apache.activemq.broker.virtual.VirtualTopicPubSubUsingXBeanTest
Running org.apache.activemq.broker.virtual.VirtualTopicSelectorTest
Tests run: 1, Failures: 0, Errors: 0, Skipped: 0, Time elapsed: 1.052 sec - in org.apache.activemq.broker.virtual.VirtualTopicSelectorTest
Running org.apache.activemq.broker.virtual.VirtualTopicsAndDurableSubsTest
Tests run: 29, Failures: 0, Errors: 0, Skipped: 0, Time elapsed: 25.495 sec - in org.apache.activemq.broker.virtual.VirtualTopicsAndDurableSubsTest
Running org.apache.activemq.bugs.AMQ2103Test
Tests run: 2, Failures: 0, Errors: 0, Skipped: 0, Time elapsed: 0.98 sec - in org.apache.activemq.bugs.AMQ2103Test
Running org.apache.activemq.bugs.AMQ2149LevelDBTest
Running org.apache.activemq.bugs.AMQ2383Test
Tests run: 1, Failures: 0, Errors: 0, Skipped: 0, Time elapsed: 0.766 sec - in org.apache.activemq.bugs.AMQ2383Test
Running org.apache.activemq.bugs.AMQ2528Test
Tests run: 1, Failures: 0, Errors: 0, Skipped: 0, Time elapsed: 0.962 sec - in org.apache.activemq.bugs.AMQ2528Test
Running org.apache.activemq.bugs.AMQ2571Test
Tests run: 1, Failures: 0, Errors: 0, Skipped: 0, Time elapsed: 0.793 sec - in org.apache.activemq.bugs.AMQ2571Test
Running org.apache.activemq.bugs.AMQ2585Test
Tests run: 1, Failures: 0, Errors: 0, Skipped: 0, Time elapsed: 1.033 sec - in org.apache.activemq.bugs.AMQ2585Test
Running org.apache.activemq.bugs.AMQ2736Test
Tests run: 1, Failures: 0, Errors: 0, Skipped: 0, Time elapsed: 2.819 sec - in org.apache.activemq.bugs.AMQ2736Test
Running org.apache.activemq.bugs.AMQ2801Test
Tests run: 1, Failures: 0, Errors: 0, Skipped: 0, Time elapsed: 130.376 sec - in org.apache.activemq.bugs.AMQ2801Test
Running org.apache.activemq.bugs.AMQ2902Test
Tests run: 2, Failures: 0, Errors: 0, Skipped: 0, Time elapsed: 0.869 sec - in org.apache.activemq.bugs.AMQ2902Test
Running org.apache.activemq.bugs.AMQ3014Test
Tests run: 2, Failures: 0, Errors: 0, Skipped: 0, Time elapsed: 1.464 sec - in org.apache.activemq.bugs.AMQ3014Test
Running org.apache.activemq.bugs.AMQ3465Test
Tests run: 2, Failures: 0, Errors: 0, Skipped: 0, Time elapsed: 0.921 sec - in org.apache.activemq.bugs.AMQ3465Test
Running org.apache.activemq.bugs.AMQ3537Test
Tests run: 1, Failures: 0, Errors: 0, Skipped: 0, Time elapsed: 0.18 sec - in org.apache.activemq.bugs.AMQ3537Test
Running org.apache.activemq.bugs.AMQ3779Test
Tests run: 1, Failures: 0, Errors: 0, Skipped: 0, Time elapsed: 0.79 sec - in org.apache.activemq.bugs.AMQ3779Test
Running org.apache.activemq.bugs.AMQ3879Test
Tests run: 1, Failures: 0, Errors: 0, Skipped: 0, Time elapsed: 1.453 sec - in org.apache.activemq.bugs.AMQ3879Test
Running org.apache.activemq.bugs.AMQ3903Test
Tests run: 2, Failures: 0, Errors: 0, Skipped: 0, Time elapsed: 0.912 sec - in org.apache.activemq.bugs.AMQ3903Test
Running org.apache.activemq.bugs.AMQ3932Test
Tests run: 3, Failures: 0, Errors: 0, Skipped: 0, Time elapsed: 20.884 sec - in org.apache.activemq.bugs.AMQ3932Test
Running org.apache.activemq.bugs.AMQ3934Test
Tests run: 1, Failures: 0, Errors: 0, Skipped: 0, Time elapsed: 1.033 sec - in org.apache.activemq.bugs.AMQ3934Test
Running org.apache.activemq.bugs.AMQ3961Test
Tests run: 1, Failures: 0, Errors: 0, Skipped: 0, Time elapsed: 7.689 sec - in org.apache.activemq.bugs.AMQ3961Test
Running org.apache.activemq.bugs.AMQ3992Test
Tests run: 1, Failures: 0, Errors: 0, Skipped: 0, Time elapsed: 4.093 sec - in org.apache.activemq.bugs.AMQ3992Test
Running org.apache.activemq.bugs.AMQ4062Test
Tests run: 1, Failures: 0, Errors: 0, Skipped: 0, Time elapsed: 8.095 sec - in org.apache.activemq.bugs.AMQ4062Test
Running org.apache.activemq.bugs.AMQ4083Test
Tests run: 6, Failures: 0, Errors: 0, Skipped: 0, Time elapsed: 56.283 sec - in org.apache.activemq.bugs.AMQ4083Test
Running org.apache.activemq.bugs.AMQ4116Test
Tests run: 2, Failures: 0, Errors: 0, Skipped: 0, Time elapsed: 1.13 sec - in org.apache.activemq.bugs.AMQ4116Test
Running org.apache.activemq.bugs.AMQ4126Test
Tests run: 9, Failures: 0, Errors: 0, Skipped: 0, Time elapsed: 4.358 sec - in org.apache.activemq.bugs.AMQ4126Test
Running org.apache.activemq.bugs.AMQ4133Test
Tests run: 4, Failures: 0, Errors: 0, Skipped: 0, Time elapsed: 2.919 sec - in org.apache.activemq.bugs.AMQ4133Test
Running org.apache.activemq.bugs.AMQ4147Test
Tests run: 2, Failures: 0, Errors: 0, Skipped: 0, Time elapsed: 10.286 sec - in org.apache.activemq.bugs.AMQ4147Test
Running org.apache.activemq.bugs.AMQ4148Test
Tests run: 1, Failures: 0, Errors: 0, Skipped: 0, Time elapsed: 11.008 sec - in org.apache.activemq.bugs.AMQ4148Test
Running org.apache.activemq.bugs.AMQ4157Test
Tests run: 1, Failures: 0, Errors: 0, Skipped: 0, Time elapsed: 10.731 sec - in org.apache.activemq.bugs.AMQ4157Test
Running org.apache.activemq.bugs.AMQ4160Test
Tests run: 3, Failures: 0, Errors: 0, Skipped: 0, Time elapsed: 44.004 sec - in org.apache.activemq.bugs.AMQ4160Test
Running org.apache.activemq.bugs.AMQ4212Test
Tests run: 2, Failures: 0, Errors: 0, Skipped: 0, Time elapsed: 107.213 sec - in org.apache.activemq.bugs.AMQ4212Test
Running org.apache.activemq.bugs.AMQ4213Test
Tests run: 1, Failures: 0, Errors: 0, Skipped: 0, Time elapsed: 0.703 sec - in org.apache.activemq.bugs.AMQ4213Test
Running org.apache.activemq.bugs.AMQ4220Test
Tests run: 1, Failures: 0, Errors: 0, Skipped: 0, Time elapsed: 2.638 sec - in org.apache.activemq.bugs.AMQ4220Test
Running org.apache.activemq.bugs.AMQ4222Test
Tests run: 1, Failures: 0, Errors: 0, Skipped: 0, Time elapsed: 0.965 sec - in org.apache.activemq.bugs.AMQ4222Test
Running org.apache.activemq.bugs.AMQ4323Test
Tests run: 1, Failures: 0, Errors: 0, Skipped: 0, Time elapsed: 38.695 sec - in org.apache.activemq.bugs.AMQ4323Test
Running org.apache.activemq.bugs.AMQ4356Test
Tests run: 1, Failures: 0, Errors: 0, Skipped: 0, Time elapsed: 3.957 sec - in org.apache.activemq.bugs.AMQ4356Test
Running org.apache.activemq.bugs.AMQ4361Test
Tests run: 1, Failures: 0, Errors: 0, Skipped: 0, Time elapsed: 4.118 sec - in org.apache.activemq.bugs.AMQ4361Test
Running org.apache.activemq.bugs.AMQ4368Test
Tests run: 1, Failures: 0, Errors: 0, Skipped: 0, Time elapsed: 12.735 sec - in org.apache.activemq.bugs.AMQ4368Test
Running org.apache.activemq.bugs.AMQ4407Test
Tests run: 1, Failures: 0, Errors: 0, Skipped: 0, Time elapsed: 4.291 sec - in org.apache.activemq.bugs.AMQ4407Test
Running org.apache.activemq.bugs.AMQ4413Test
Tests run: 1, Failures: 0, Errors: 0, Skipped: 0, Time elapsed: 7.181 sec - in org.apache.activemq.bugs.AMQ4413Test
Running org.apache.activemq.bugs.AMQ4469Test
Tests run: 1, Failures: 0, Errors: 0, Skipped: 0, Time elapsed: 5.849 sec - in org.apache.activemq.bugs.AMQ4469Test
Running org.apache.activemq.bugs.AMQ4472Test
Tests run: 1, Failures: 0, Errors: 0, Skipped: 0, Time elapsed: 1.926 sec - in org.apache.activemq.bugs.AMQ4472Test
Running org.apache.activemq.bugs.AMQ4475Test
Tests run: 1, Failures: 0, Errors: 0, Skipped: 0, Time elapsed: 4.261 sec - in org.apache.activemq.bugs.AMQ4475Test
Running org.apache.activemq.bugs.AMQ4485LowLimitLevelDBTest
Running org.apache.activemq.bugs.AMQ4485LowLimitTest
Tests run: 1, Failures: 0, Errors: 1, Skipped: 0, Time elapsed: 0.413 sec <<< FAILURE!
- in org.apache.activemq.bugs.AMQ4485LowLimitTest
testBrokers(org.apache.activemq.bugs.AMQ4485LowLimitTest)  Time elapsed: 0.258 sec  <<<
ERROR!
java.io.IOException: Failed to bind to server socket: tcp://localhost:61600 due to: java.net.BindException:
Address already in use
	at java.net.PlainSocketImpl.socketBind(Native Method)
	at java.net.AbstractPlainSocketImpl.bind(AbstractPlainSocketImpl.java:382)
	at java.net.ServerSocket.bind(ServerSocket.java:375)
	at java.net.ServerSocket.<init>(ServerSocket.java:237)
	at javax.net.DefaultServerSocketFactory.createServerSocket(ServerSocketFactory.java:231)
	at org.apache.activemq.transport.tcp.TcpTransportServer.bind(TcpTransportServer.java:136)
	at org.apache.activemq.transport.tcp.TcpTransportFactory.doBind(TcpTransportFactory.java:58)
	at org.apache.activemq.transport.TransportFactorySupport.bind(TransportFactorySupport.java:40)
	at org.apache.activemq.broker.BrokerService.createTransportConnector(BrokerService.java:2419)
	at org.apache.activemq.broker.BrokerService.addConnector(BrokerService.java:321)
	at org.apache.activemq.bugs.AMQ4485LowLimitTest.createBroker(AMQ4485LowLimitTest.java:98)
	at org.apache.activemq.bugs.AMQ4485LowLimitTest.createBroker(AMQ4485LowLimitTest.java:85)
	at org.apache.activemq.bugs.AMQ4485LowLimitTest.testBrokers(AMQ4485LowLimitTest.java:213)

Running org.apache.activemq.bugs.AMQ4485NetworkOfXBrokersWithNDestsFanoutTransactionTest
Tests run: 1, Failures: 0, Errors: 1, Skipped: 0, Time elapsed: 0.426 sec <<< FAILURE!
- in org.apache.activemq.bugs.AMQ4485NetworkOfXBrokersWithNDestsFanoutTransactionTest
testBrokers(org.apache.activemq.bugs.AMQ4485NetworkOfXBrokersWithNDestsFanoutTransactionTest)
 Time elapsed: 0.273 sec  <<< ERROR!
java.io.IOException: Failed to bind to server socket: tcp://localhost:61600 due to: java.net.BindException:
Address already in use
	at java.net.PlainSocketImpl.socketBind(Native Method)
	at java.net.AbstractPlainSocketImpl.bind(AbstractPlainSocketImpl.java:382)
	at java.net.ServerSocket.bind(ServerSocket.java:375)
	at java.net.ServerSocket.<init>(ServerSocket.java:237)
	at javax.net.DefaultServerSocketFactory.createServerSocket(ServerSocketFactory.java:231)
	at org.apache.activemq.transport.tcp.TcpTransportServer.bind(TcpTransportServer.java:136)
	at org.apache.activemq.transport.tcp.TcpTransportFactory.doBind(TcpTransportFactory.java:58)
	at org.apache.activemq.transport.TransportFactorySupport.bind(TransportFactorySupport.java:40)
	at org.apache.activemq.broker.BrokerService.createTransportConnector(BrokerService.java:2419)
	at org.apache.activemq.broker.BrokerService.addConnector(BrokerService.java:321)
	at org.apache.activemq.bugs.AMQ4485NetworkOfXBrokersWithNDestsFanoutTransactionTest.createBroker(AMQ4485NetworkOfXBrokersWithNDestsFanoutTransactionTest.java:89)
	at org.apache.activemq.bugs.AMQ4485NetworkOfXBrokersWithNDestsFanoutTransactionTest.testBrokers(AMQ4485NetworkOfXBrokersWithNDestsFanoutTransactionTest.java:138)

Running org.apache.activemq.bugs.AMQ4485Test
Tests run: 1, Failures: 0, Errors: 0, Skipped: 0, Time elapsed: 10.554 sec - in org.apache.activemq.bugs.AMQ4485Test
Running org.apache.activemq.bugs.AMQ4487Test
Tests run: 2, Failures: 0, Errors: 0, Skipped: 0, Time elapsed: 16.32 sec - in org.apache.activemq.bugs.AMQ4487Test
Running org.apache.activemq.bugs.AMQ4504Test
Tests run: 1, Failures: 0, Errors: 0, Skipped: 0, Time elapsed: 1.893 sec - in org.apache.activemq.bugs.AMQ4504Test
Running org.apache.activemq.bugs.AMQ4513Test
Tests run: 1, Failures: 0, Errors: 0, Skipped: 0, Time elapsed: 24.17 sec - in org.apache.activemq.bugs.AMQ4513Test
Running org.apache.activemq.bugs.AMQ4517Test
Tests run: 1, Failures: 0, Errors: 0, Skipped: 0, Time elapsed: 1.529 sec - in org.apache.activemq.bugs.AMQ4517Test
Running org.apache.activemq.bugs.AMQ4518Test
Tests run: 1, Failures: 0, Errors: 0, Skipped: 0, Time elapsed: 1.491 sec - in org.apache.activemq.bugs.AMQ4518Test
Running org.apache.activemq.bugs.AMQ4530Test
Tests run: 1, Failures: 0, Errors: 0, Skipped: 0, Time elapsed: 1.012 sec - in org.apache.activemq.bugs.AMQ4530Test
Running org.apache.activemq.bugs.AMQ4531Test
Tests run: 1, Failures: 0, Errors: 0, Skipped: 0, Time elapsed: 1.074 sec - in org.apache.activemq.bugs.AMQ4531Test
Running org.apache.activemq.bugs.AMQ4554Test
Tests run: 1, Failures: 0, Errors: 0, Skipped: 0, Time elapsed: 0.995 sec - in org.apache.activemq.bugs.AMQ4554Test
Running org.apache.activemq.bugs.AMQ4582Test
Tests run: 1, Failures: 0, Errors: 0, Skipped: 0, Time elapsed: 0.926 sec - in org.apache.activemq.bugs.AMQ4582Test
Running org.apache.activemq.bugs.AMQ4595Test
Tests run: 3, Failures: 0, Errors: 0, Skipped: 0, Time elapsed: 65.61 sec - in org.apache.activemq.bugs.AMQ4595Test
Running org.apache.activemq.bugs.AMQ4636Test
Tests run: 3, Failures: 0, Errors: 0, Skipped: 0, Time elapsed: 20.694 sec - in org.apache.activemq.bugs.AMQ4636Test
Running org.apache.activemq.bugs.AMQ4656Test
Tests run: 2, Failures: 0, Errors: 0, Skipped: 0, Time elapsed: 1.172 sec - in org.apache.activemq.bugs.AMQ4656Test
Running org.apache.activemq.bugs.AMQ4671Test
Tests run: 1, Failures: 0, Errors: 0, Skipped: 0, Time elapsed: 0.685 sec - in org.apache.activemq.bugs.AMQ4671Test
Running org.apache.activemq.bugs.AMQ4814Test
Tests run: 1, Failures: 0, Errors: 0, Skipped: 0, Time elapsed: 5.795 sec - in org.apache.activemq.bugs.AMQ4814Test
Running org.apache.activemq.bugs.AMQ4853Test
Tests run: 3, Failures: 0, Errors: 0, Skipped: 2, Time elapsed: 0.683 sec - in org.apache.activemq.bugs.AMQ4853Test
Running org.apache.activemq.bugs.AMQ4887Test
Tests run: 4, Failures: 0, Errors: 0, Skipped: 0, Time elapsed: 3.076 sec - in org.apache.activemq.bugs.AMQ4887Test
Running org.apache.activemq.bugs.AMQ4893Test
Tests run: 4, Failures: 0, Errors: 0, Skipped: 0, Time elapsed: 0.224 sec - in org.apache.activemq.bugs.AMQ4893Test
Running org.apache.activemq.bugs.AMQ4899Test
Tests run: 1, Failures: 0, Errors: 0, Skipped: 0, Time elapsed: 2.495 sec - in org.apache.activemq.bugs.AMQ4899Test
Running org.apache.activemq.bugs.AMQ4930Test
Tests run: 3, Failures: 0, Errors: 0, Skipped: 0, Time elapsed: 25.383 sec - in org.apache.activemq.bugs.AMQ4930Test
Running org.apache.activemq.bugs.AMQ4950Test
Tests run: 1, Failures: 0, Errors: 0, Skipped: 0, Time elapsed: 1.612 sec - in org.apache.activemq.bugs.AMQ4950Test
Running org.apache.activemq.bugs.AMQ4952Test
Tests run: 2, Failures: 1, Errors: 0, Skipped: 0, Time elapsed: 48.19 sec <<< FAILURE!
- in org.apache.activemq.bugs.AMQ4952Test
testConsumerBrokerRestart[enableAudit=false](org.apache.activemq.bugs.AMQ4952Test)  Time elapsed:
16.729 sec  <<< FAILURE!
java.lang.AssertionError: number of messages received expected:<2> but was:<1>
	at org.junit.Assert.fail(Assert.java:88)
	at org.junit.Assert.failNotEquals(Assert.java:743)
	at org.junit.Assert.assertEquals(Assert.java:118)
	at org.junit.Assert.assertEquals(Assert.java:555)
	at org.apache.activemq.bugs.AMQ4952Test.testConsumerBrokerRestart(AMQ4952Test.java:235)

Running org.apache.activemq.bugs.AMQ5035Test
Tests run: 1, Failures: 0, Errors: 0, Skipped: 0, Time elapsed: 3.298 sec - in org.apache.activemq.bugs.AMQ5035Test
Running org.apache.activemq.bugs.AMQ5136Test
Tests run: 2, Failures: 0, Errors: 0, Skipped: 0, Time elapsed: 0.874 sec - in org.apache.activemq.bugs.AMQ5136Test
Running org.apache.activemq.bugs.AMQ5212Test
Tests run: 8, Failures: 0, Errors: 0, Skipped: 0, Time elapsed: 28.145 sec - in org.apache.activemq.bugs.AMQ5212Test
Running org.apache.activemq.bugs.AMQ5266SingleDestTest

Results :

Failed tests: 
  AMQ4952Test.testConsumerBrokerRestart:235 number of messages received expected:<2>
but was:<1>

Tests in error: 
  AMQ4485LowLimitTest>CombinationTestSupport.runBare:113->CombinationTestSupport.runBare:107->testBrokers:213->createBroker:85->createBroker:98
� IO
  AMQ4485NetworkOfXBrokersWithNDestsFanoutTransactionTest>CombinationTestSupport.runBare:113->CombinationTestSupport.runBare:107->testBrokers:138->createBroker:89
� IO

Tests run: 1241, Failures: 1, Errors: 2, Skipped: 6

[JENKINS] Recording test results

Mime
View raw message