activemq-commits mailing list archives

Site index · List index
Message view « Date » · « Thread »
Top « Date » · « Thread »
From Apache Jenkins Server <jenk...@builds.apache.org>
Subject Build failed in Jenkins: ActiveMQ-Java7-All-UnitTests #209
Date Thu, 20 Aug 2015 11:14:47 GMT
See <https://builds.apache.org/job/ActiveMQ-Java7-All-UnitTests/209/changes>

Changes:

[gtully] AMQ-5933 - add test and fix

[tabish121] https://issues.apache.org/jira/browse/AMQ-5935

------------------------------------------
[...truncated 1281 lines...]
[INFO] Reactor Summary:
[INFO] 
[INFO] ActiveMQ .......................................... SUCCESS [6.949s]
[INFO] ActiveMQ :: Client ................................ SUCCESS [2:24.868s]
[INFO] ActiveMQ :: Openwire Legacy Support ............... SUCCESS [3.639s]
[INFO] ActiveMQ :: JAAS .................................. SUCCESS [52.856s]
[INFO] ActiveMQ :: Broker ................................ SUCCESS [1:25.873s]
[INFO] ActiveMQ :: KahaDB Store .......................... SUCCESS [2:19.493s]
[INFO] ActiveMQ :: STOMP Protocol ........................ SUCCESS [11:54.553s]
[INFO] ActiveMQ :: MQTT Protocol ......................... FAILURE [20:16.223s]
[INFO] ActiveMQ :: JDBC Store ............................ SUCCESS [2.033s]
[INFO] ActiveMQ :: LevelDB Store ......................... SUCCESS [5:18.415s]
[INFO] ActiveMQ :: Generic JMS Pool ...................... SUCCESS [43.817s]
[INFO] ActiveMQ :: Pool .................................. SUCCESS [3.369s]
[INFO] ActiveMQ :: RA .................................... SUCCESS [2:34.053s]
[INFO] ActiveMQ :: Spring ................................ SKIPPED
[INFO] ActiveMQ :: AMQP .................................. SKIPPED
[INFO] ActiveMQ :: Console ............................... SUCCESS [5.144s]
[INFO] ActiveMQ :: Partition Management .................. SUCCESS [18.655s]
[INFO] ActiveMQ :: Unit Tests ............................ SKIPPED
[INFO] ------------------------------------------------------------------------
[INFO] BUILD FAILURE
[INFO] ------------------------------------------------------------------------
[INFO] Total time: 49:17.319s
[INFO] Finished at: Thu Aug 20 09:42:53 UTC 2015
[INFO] Final Memory: 71M/1233M
[INFO] ------------------------------------------------------------------------
Waiting for Jenkins to finish collecting data
[ERROR] Failed to execute goal org.apache.maven.plugins:maven-surefire-plugin:2.16:test (default-test)
on project activemq-mqtt: ExecutionException; nested exception is java.util.concurrent.ExecutionException:
java.lang.RuntimeException: The forked VM terminated without saying properly goodbye. VM crash
or System.exit called ?
[ERROR] Command was/bin/sh -c cd <https://builds.apache.org/job/ActiveMQ-Java7-All-UnitTests/ws/activemq-mqtt>
&& /home/jenkins/tools/java/jdk1.7.0_25-32/jre/bin/java -jar <https://builds.apache.org/job/ActiveMQ-Java7-All-UnitTests/ws/activemq-mqtt/target/surefire/surefirebooter5902005902390866825.jar>
<https://builds.apache.org/job/ActiveMQ-Java7-All-UnitTests/ws/activemq-mqtt/target/surefire/surefire3595970324193082961tmp>
<https://builds.apache.org/job/ActiveMQ-Java7-All-UnitTests/ws/activemq-mqtt/target/surefire/surefire_87997383984212468901tmp>
[ERROR] -> [Help 1]
org.apache.maven.lifecycle.LifecycleExecutionException: Failed to execute goal org.apache.maven.plugins:maven-surefire-plugin:2.16:test
(default-test) on project activemq-mqtt: ExecutionException; nested exception is java.util.concurrent.ExecutionException:
java.lang.RuntimeException: The forked VM terminated without saying properly goodbye. VM crash
or System.exit called ?
Command was/bin/sh -c cd <https://builds.apache.org/job/ActiveMQ-Java7-All-UnitTests/ws/activemq-mqtt>
&& /home/jenkins/tools/java/jdk1.7.0_25-32/jre/bin/java -jar <https://builds.apache.org/job/ActiveMQ-Java7-All-UnitTests/ws/activemq-mqtt/target/surefire/surefirebooter5902005902390866825.jar>
<https://builds.apache.org/job/ActiveMQ-Java7-All-UnitTests/ws/activemq-mqtt/target/surefire/surefire3595970324193082961tmp>
<https://builds.apache.org/job/ActiveMQ-Java7-All-UnitTests/ws/activemq-mqtt/target/surefire/surefire_87997383984212468901tmp>
	at org.apache.maven.lifecycle.internal.MojoExecutor.execute(MojoExecutor.java:213)
	at org.apache.maven.lifecycle.internal.MojoExecutor.execute(MojoExecutor.java:153)
	at org.apache.maven.lifecycle.internal.MojoExecutor.execute(MojoExecutor.java:145)
	at org.apache.maven.lifecycle.internal.LifecycleModuleBuilder.buildProject(LifecycleModuleBuilder.java:84)
	at org.apache.maven.lifecycle.internal.LifecycleModuleBuilder.buildProject(LifecycleModuleBuilder.java:59)
	at org.apache.maven.lifecycle.internal.LifecycleStarter.singleThreadedBuild(LifecycleStarter.java:183)
	at org.apache.maven.lifecycle.internal.LifecycleStarter.execute(LifecycleStarter.java:161)
	at org.apache.maven.DefaultMaven.doExecute(DefaultMaven.java:320)
	at org.apache.maven.DefaultMaven.execute(DefaultMaven.java:156)
	at org.jvnet.hudson.maven3.launcher.Maven3Launcher.main(Maven3Launcher.java:117)
	at sun.reflect.NativeMethodAccessorImpl.invoke0(Native Method)
	at sun.reflect.NativeMethodAccessorImpl.invoke(NativeMethodAccessorImpl.java:57)
	at sun.reflect.DelegatingMethodAccessorImpl.invoke(DelegatingMethodAccessorImpl.java:43)
	at java.lang.reflect.Method.invoke(Method.java:606)
	at org.codehaus.plexus.classworlds.launcher.Launcher.launchStandard(Launcher.java:329)
	at org.codehaus.plexus.classworlds.launcher.Launcher.launch(Launcher.java:239)
	at org.jvnet.hudson.maven3.agent.Maven3Main.launch(Maven3Main.java:178)
	at sun.reflect.NativeMethodAccessorImpl.invoke0(Native Method)
	at sun.reflect.NativeMethodAccessorImpl.invoke(NativeMethodAccessorImpl.java:57)
	at sun.reflect.DelegatingMethodAccessorImpl.invoke(DelegatingMethodAccessorImpl.java:43)
	at java.lang.reflect.Method.invoke(Method.java:606)
	at hudson.maven.Maven3Builder.call(Maven3Builder.java:136)
	at hudson.maven.Maven3Builder.call(Maven3Builder.java:71)
	at hudson.remoting.UserRequest.perform(UserRequest.java:118)
	at hudson.remoting.UserRequest.perform(UserRequest.java:48)
	at hudson.remoting.Request$2.run(Request.java:328)
	at hudson.remoting.InterceptingExecutorService$1.call(InterceptingExecutorService.java:72)
	at java.util.concurrent.FutureTask$Sync.innerRun(FutureTask.java:334)
	at java.util.concurrent.FutureTask.run(FutureTask.java:166)
	at java.util.concurrent.ThreadPoolExecutor.runWorker(ThreadPoolExecutor.java:1145)
	at java.util.concurrent.ThreadPoolExecutor$Worker.run(ThreadPoolExecutor.java:615)
	at java.lang.Thread.run(Thread.java:724)
Caused by: org.apache.maven.plugin.MojoFailureException: ExecutionException; nested exception
is java.util.concurrent.ExecutionException: java.lang.RuntimeException: The forked VM terminated
without saying properly goodbye. VM crash or System.exit called ?
Command was/bin/sh -c cd <https://builds.apache.org/job/ActiveMQ-Java7-All-UnitTests/ws/activemq-mqtt>
&& /home/jenkins/tools/java/jdk1.7.0_25-32/jre/bin/java -jar <https://builds.apache.org/job/ActiveMQ-Java7-All-UnitTests/ws/activemq-mqtt/target/surefire/surefirebooter5902005902390866825.jar>
<https://builds.apache.org/job/ActiveMQ-Java7-All-UnitTests/ws/activemq-mqtt/target/surefire/surefire3595970324193082961tmp>
<https://builds.apache.org/job/ActiveMQ-Java7-All-UnitTests/ws/activemq-mqtt/target/surefire/surefire_87997383984212468901tmp>
	at org.apache.maven.plugin.surefire.SurefirePlugin.assertNoException(SurefirePlugin.java:198)
	at org.apache.maven.plugin.surefire.SurefirePlugin.handleSummary(SurefirePlugin.java:188)
	at org.apache.maven.plugin.surefire.AbstractSurefireMojo.executeAfterPreconditionsChecked(AbstractSurefireMojo.java:852)
	at org.apache.maven.plugin.surefire.AbstractSurefireMojo.execute(AbstractSurefireMojo.java:720)
	at org.apache.maven.plugin.DefaultBuildPluginManager.executeMojo(DefaultBuildPluginManager.java:101)
	at org.apache.maven.lifecycle.internal.MojoExecutor.execute(MojoExecutor.java:209)
	... 31 more
Caused by: org.apache.maven.surefire.booter.SurefireBooterForkException: ExecutionException;
nested exception is java.util.concurrent.ExecutionException: java.lang.RuntimeException: The
forked VM terminated without saying properly goodbye. VM crash or System.exit called ?
Command was/bin/sh -c cd <https://builds.apache.org/job/ActiveMQ-Java7-All-UnitTests/ws/activemq-mqtt>
&& /home/jenkins/tools/java/jdk1.7.0_25-32/jre/bin/java -jar <https://builds.apache.org/job/ActiveMQ-Java7-All-UnitTests/ws/activemq-mqtt/target/surefire/surefirebooter5902005902390866825.jar>
<https://builds.apache.org/job/ActiveMQ-Java7-All-UnitTests/ws/activemq-mqtt/target/surefire/surefire3595970324193082961tmp>
<https://builds.apache.org/job/ActiveMQ-Java7-All-UnitTests/ws/activemq-mqtt/target/surefire/surefire_87997383984212468901tmp>
	at org.apache.maven.plugin.surefire.booterclient.ForkStarter.runSuitesForkPerTestSet(ForkStarter.java:316)
	at org.apache.maven.plugin.surefire.booterclient.ForkStarter.run(ForkStarter.java:169)
	at org.apache.maven.plugin.surefire.AbstractSurefireMojo.executeProvider(AbstractSurefireMojo.java:958)
	at org.apache.maven.plugin.surefire.AbstractSurefireMojo.executeAfterPreconditionsChecked(AbstractSurefireMojo.java:822)
	... 34 more
Caused by: java.util.concurrent.ExecutionException: java.lang.RuntimeException: The forked
VM terminated without saying properly goodbye. VM crash or System.exit called ?
Command was/bin/sh -c cd <https://builds.apache.org/job/ActiveMQ-Java7-All-UnitTests/ws/activemq-mqtt>
&& /home/jenkins/tools/java/jdk1.7.0_25-32/jre/bin/java -jar <https://builds.apache.org/job/ActiveMQ-Java7-All-UnitTests/ws/activemq-mqtt/target/surefire/surefirebooter5902005902390866825.jar>
<https://builds.apache.org/job/ActiveMQ-Java7-All-UnitTests/ws/activemq-mqtt/target/surefire/surefire3595970324193082961tmp>
<https://builds.apache.org/job/ActiveMQ-Java7-All-UnitTests/ws/activemq-mqtt/target/surefire/surefire_87997383984212468901tmp>
	at java.util.concurrent.FutureTask$Sync.innerGet(FutureTask.java:252)
	at java.util.concurrent.FutureTask.get(FutureTask.java:111)
	at org.apache.maven.plugin.surefire.booterclient.ForkStarter.runSuitesForkPerTestSet(ForkStarter.java:300)
	... 37 more
Caused by: java.lang.RuntimeException: The forked VM terminated without saying properly goodbye.
VM crash or System.exit called ?
Command was/bin/sh -c cd <https://builds.apache.org/job/ActiveMQ-Java7-All-UnitTests/ws/activemq-mqtt>
&& /home/jenkins/tools/java/jdk1.7.0_25-32/jre/bin/java -jar <https://builds.apache.org/job/ActiveMQ-Java7-All-UnitTests/ws/activemq-mqtt/target/surefire/surefirebooter5902005902390866825.jar>
<https://builds.apache.org/job/ActiveMQ-Java7-All-UnitTests/ws/activemq-mqtt/target/surefire/surefire3595970324193082961tmp>
<https://builds.apache.org/job/ActiveMQ-Java7-All-UnitTests/ws/activemq-mqtt/target/surefire/surefire_87997383984212468901tmp>
	at org.apache.maven.plugin.surefire.booterclient.ForkStarter.fork(ForkStarter.java:485)
	at org.apache.maven.plugin.surefire.booterclient.ForkStarter.fork(ForkStarter.java:352)
	at org.apache.maven.plugin.surefire.booterclient.ForkStarter.access$300(ForkStarter.java:85)
	at org.apache.maven.plugin.surefire.booterclient.ForkStarter$2.call(ForkStarter.java:288)
	at org.apache.maven.plugin.surefire.booterclient.ForkStarter$2.call(ForkStarter.java:283)
	... 5 more
[ERROR] 
[ERROR] Re-run Maven using the -X switch to enable full debug logging.
[ERROR] 
[ERROR] For more information about the errors and possible solutions, please read the following
articles:
[ERROR] [Help 1] http://cwiki.apache.org/confluence/display/MAVEN/MojoFailureException
[ERROR] 
[ERROR] After correcting the problems, you can resume the build with the command
[ERROR]   mvn <goals> -rf :activemq-mqtt
[JENKINS] Archiving <https://builds.apache.org/job/ActiveMQ-Java7-All-UnitTests/ws/activemq-unit-tests/pom.xml>
to org.apache.activemq/activemq-unit-tests/5.13-SNAPSHOT/activemq-unit-tests-5.13-SNAPSHOT.pom
Sending artifact delta relative to ActiveMQ-Java7-All-UnitTests » ActiveMQ :: Unit Tests
#208
Archived 1 artifacts
Archive block size is 32768
Received 1 blocks and 40067 bytes
Compression is 45.0%
Took 4.1 sec
[JENKINS] Archiving <https://builds.apache.org/job/ActiveMQ-Java7-All-UnitTests/ws/activemq-openwire-legacy/pom.xml>
to org.apache.activemq/activemq-openwire-legacy/5.13-SNAPSHOT/activemq-openwire-legacy-5.13-SNAPSHOT.pom
[JENKINS] Archiving <https://builds.apache.org/job/ActiveMQ-Java7-All-UnitTests/ws/activemq-openwire-legacy/target/activemq-openwire-legacy-5.13-SNAPSHOT.jar>
to org.apache.activemq/activemq-openwire-legacy/5.13-SNAPSHOT/activemq-openwire-legacy-5.13-SNAPSHOT.jar
Sending artifact delta relative to ActiveMQ-Java7-All-UnitTests » ActiveMQ :: Openwire Legacy
Support #208
Archived 2 artifacts
Archive block size is 32768
Received 0 blocks and 687394 bytes
Compression is 0.0%
Took 1.5 sec
[JENKINS] Archiving <https://builds.apache.org/job/ActiveMQ-Java7-All-UnitTests/ws/activemq-jdbc-store/pom.xml>
to org.apache.activemq/activemq-jdbc-store/5.13-SNAPSHOT/activemq-jdbc-store-5.13-SNAPSHOT.pom
[JENKINS] Archiving <https://builds.apache.org/job/ActiveMQ-Java7-All-UnitTests/ws/activemq-jdbc-store/target/activemq-jdbc-store-5.13-SNAPSHOT.jar>
to org.apache.activemq/activemq-jdbc-store/5.13-SNAPSHOT/activemq-jdbc-store-5.13-SNAPSHOT.jar
Sending artifact delta relative to ActiveMQ-Java7-All-UnitTests » ActiveMQ :: JDBC Store
#208
Archived 2 artifacts
Archive block size is 32768
Received 0 blocks and 179291 bytes
Compression is 0.0%
Took 0.35 sec
[JENKINS] Archiving <https://builds.apache.org/job/ActiveMQ-Java7-All-UnitTests/ws/activemq-amqp/pom.xml>
to org.apache.activemq/activemq-amqp/5.13-SNAPSHOT/activemq-amqp-5.13-SNAPSHOT.pom
Sending artifact delta relative to ActiveMQ-Java7-All-UnitTests » ActiveMQ :: AMQP #208
Archived 1 artifacts
Archive block size is 32768
Received 0 blocks and 9453 bytes
Compression is 0.0%
Took 91 ms
[JENKINS] Archiving <https://builds.apache.org/job/ActiveMQ-Java7-All-UnitTests/ws/activemq-jms-pool/pom.xml>
to org.apache.activemq/activemq-jms-pool/5.13-SNAPSHOT/activemq-jms-pool-5.13-SNAPSHOT.pom
[JENKINS] Archiving <https://builds.apache.org/job/ActiveMQ-Java7-All-UnitTests/ws/activemq-jms-pool/target/activemq-jms-pool-5.13-SNAPSHOT.jar>
to org.apache.activemq/activemq-jms-pool/5.13-SNAPSHOT/activemq-jms-pool-5.13-SNAPSHOT.jar
Sending artifact delta relative to ActiveMQ-Java7-All-UnitTests » ActiveMQ :: Generic JMS
Pool #208
Archived 2 artifacts
Archive block size is 32768
Received 0 blocks and 57963 bytes
Compression is 0.0%
Took 98 ms
[JENKINS] Archiving <https://builds.apache.org/job/ActiveMQ-Java7-All-UnitTests/ws/activemq-pool/pom.xml>
to org.apache.activemq/activemq-pool/5.13-SNAPSHOT/activemq-pool-5.13-SNAPSHOT.pom
[JENKINS] Archiving <https://builds.apache.org/job/ActiveMQ-Java7-All-UnitTests/ws/activemq-pool/target/activemq-pool-5.13-SNAPSHOT.jar>
to org.apache.activemq/activemq-pool/5.13-SNAPSHOT/activemq-pool-5.13-SNAPSHOT.jar
Sending artifact delta relative to ActiveMQ-Java7-All-UnitTests » ActiveMQ :: Pool #208
Archived 2 artifacts
Archive block size is 32768
Received 0 blocks and 24671 bytes
Compression is 0.0%
Took 88 ms
[JENKINS] Archiving <https://builds.apache.org/job/ActiveMQ-Java7-All-UnitTests/ws/activemq-stomp/pom.xml>
to org.apache.activemq/activemq-stomp/5.13-SNAPSHOT/activemq-stomp-5.13-SNAPSHOT.pom
[JENKINS] Archiving <https://builds.apache.org/job/ActiveMQ-Java7-All-UnitTests/ws/activemq-stomp/target/activemq-stomp-5.13-SNAPSHOT.jar>
to org.apache.activemq/activemq-stomp/5.13-SNAPSHOT/activemq-stomp-5.13-SNAPSHOT.jar
Sending artifact delta relative to ActiveMQ-Java7-All-UnitTests » ActiveMQ :: STOMP Protocol
#208
Archived 2 artifacts
Archive block size is 32768
Received 0 blocks and 112576 bytes
Compression is 0.0%
Took 0.28 sec
[JENKINS] Archiving <https://builds.apache.org/job/ActiveMQ-Java7-All-UnitTests/ws/activemq-mqtt/pom.xml>
to org.apache.activemq/activemq-mqtt/5.13-SNAPSHOT/activemq-mqtt-5.13-SNAPSHOT.pom
Sending artifact delta relative to ActiveMQ-Java7-All-UnitTests » ActiveMQ :: MQTT Protocol
#208
Archived 1 artifacts
Archive block size is 32768
Received 0 blocks and 10494 bytes
Compression is 0.0%
Took 88 ms
[JENKINS] Archiving <https://builds.apache.org/job/ActiveMQ-Java7-All-UnitTests/ws/activemq-console/pom.xml>
to org.apache.activemq/activemq-console/5.13-SNAPSHOT/activemq-console-5.13-SNAPSHOT.pom
[JENKINS] Archiving <https://builds.apache.org/job/ActiveMQ-Java7-All-UnitTests/ws/activemq-console/target/activemq-console-5.13-SNAPSHOT.jar>
to org.apache.activemq/activemq-console/5.13-SNAPSHOT/activemq-console-5.13-SNAPSHOT.jar
Sending artifact delta relative to ActiveMQ-Java7-All-UnitTests » ActiveMQ :: Console #208
Archived 2 artifacts
Archive block size is 32768
Received 0 blocks and 204575 bytes
Compression is 0.0%
Took 0.13 sec
[JENKINS] Archiving <https://builds.apache.org/job/ActiveMQ-Java7-All-UnitTests/ws/activemq-client/pom.xml>
to org.apache.activemq/activemq-client/5.13-SNAPSHOT/activemq-client-5.13-SNAPSHOT.pom
[JENKINS] Archiving <https://builds.apache.org/job/ActiveMQ-Java7-All-UnitTests/ws/activemq-client/target/activemq-client-5.13-SNAPSHOT.jar>
to org.apache.activemq/activemq-client/5.13-SNAPSHOT/activemq-client-5.13-SNAPSHOT.jar
Sending artifact delta relative to ActiveMQ-Java7-All-UnitTests » ActiveMQ :: Client #208
Archived 2 artifacts
Archive block size is 32768
Received 0 blocks and 1306590 bytes
Compression is 0.0%
Took 0.42 sec
[JENKINS] Archiving <https://builds.apache.org/job/ActiveMQ-Java7-All-UnitTests/ws/pom.xml>
to org.apache.activemq/activemq-parent/5.13-SNAPSHOT/activemq-parent-5.13-SNAPSHOT.pom
Sending artifact delta relative to ActiveMQ-Java7-All-UnitTests » ActiveMQ #208
Archived 1 artifacts
Archive block size is 32768
Received 0 blocks and 59560 bytes
Compression is 0.0%
Took 91 ms
[JENKINS] Archiving <https://builds.apache.org/job/ActiveMQ-Java7-All-UnitTests/ws/activemq-broker/pom.xml>
to org.apache.activemq/activemq-broker/5.13-SNAPSHOT/activemq-broker-5.13-SNAPSHOT.pom
[JENKINS] Archiving <https://builds.apache.org/job/ActiveMQ-Java7-All-UnitTests/ws/activemq-broker/target/activemq-broker-5.13-SNAPSHOT.jar>
to org.apache.activemq/activemq-broker/5.13-SNAPSHOT/activemq-broker-5.13-SNAPSHOT.jar
[JENKINS] Archiving <https://builds.apache.org/job/ActiveMQ-Java7-All-UnitTests/ws/activemq-broker/target/activemq-broker-5.13-SNAPSHOT-tests.jar>
to org.apache.activemq/activemq-broker/5.13-SNAPSHOT/activemq-broker-5.13-SNAPSHOT-tests.jar
Sending artifact delta relative to ActiveMQ-Java7-All-UnitTests » ActiveMQ :: Broker #208
Archived 3 artifacts
Archive block size is 32768
Received 0 blocks and 1218496 bytes
Compression is 0.0%
Took 0.42 sec
[JENKINS] Archiving <https://builds.apache.org/job/ActiveMQ-Java7-All-UnitTests/ws/activemq-ra/pom.xml>
to org.apache.activemq/activemq-ra/5.13-SNAPSHOT/activemq-ra-5.13-SNAPSHOT.pom
[JENKINS] Archiving <https://builds.apache.org/job/ActiveMQ-Java7-All-UnitTests/ws/activemq-ra/target/activemq-ra-5.13-SNAPSHOT.jar>
to org.apache.activemq/activemq-ra/5.13-SNAPSHOT/activemq-ra-5.13-SNAPSHOT.jar
[JENKINS] Archiving <https://builds.apache.org/job/ActiveMQ-Java7-All-UnitTests/ws/activemq-ra/target/xbean/activemq-ra.xsd>
to org.apache.activemq/activemq-ra/5.13-SNAPSHOT/activemq-ra-5.13-SNAPSHOT.xsd
[JENKINS] Archiving <https://builds.apache.org/job/ActiveMQ-Java7-All-UnitTests/ws/activemq-ra/target/xbean/activemq-ra.xsd.html>
to org.apache.activemq/activemq-ra/5.13-SNAPSHOT/activemq-ra-5.13-SNAPSHOT-schema.html
[JENKINS] Archiving <https://builds.apache.org/job/ActiveMQ-Java7-All-UnitTests/ws/activemq-ra/target/xbean/activemq-ra.xsd.html>
to org.apache.activemq/activemq-ra/5.13-SNAPSHOT/activemq-ra-5.13-SNAPSHOT.xsd.html
Sending artifact delta relative to ActiveMQ-Java7-All-UnitTests » ActiveMQ :: RA #208
Archived 5 artifacts
Archive block size is 32768
Received 0 blocks and 129069 bytes
Compression is 0.0%
Took 0.18 sec
[JENKINS] Archiving <https://builds.apache.org/job/ActiveMQ-Java7-All-UnitTests/ws/activemq-spring/pom.xml>
to org.apache.activemq/activemq-spring/5.13-SNAPSHOT/activemq-spring-5.13-SNAPSHOT.pom
Sending artifact delta relative to ActiveMQ-Java7-All-UnitTests » ActiveMQ :: Spring #208
Archived 1 artifacts
Archive block size is 32768
Received 0 blocks and 15807 bytes
Compression is 0.0%
Took 0.11 sec
[JENKINS] Archiving <https://builds.apache.org/job/ActiveMQ-Java7-All-UnitTests/ws/activemq-kahadb-store/pom.xml>
to org.apache.activemq/activemq-kahadb-store/5.13-SNAPSHOT/activemq-kahadb-store-5.13-SNAPSHOT.pom
[JENKINS] Archiving <https://builds.apache.org/job/ActiveMQ-Java7-All-UnitTests/ws/activemq-kahadb-store/target/activemq-kahadb-store-5.13-SNAPSHOT.jar>
to org.apache.activemq/activemq-kahadb-store/5.13-SNAPSHOT/activemq-kahadb-store-5.13-SNAPSHOT.jar
Sending artifact delta relative to ActiveMQ-Java7-All-UnitTests » ActiveMQ :: KahaDB Store
#208
Archived 2 artifacts
Archive block size is 32768
Received 0 blocks and 646872 bytes
Compression is 0.0%
Took 0.23 sec
[JENKINS] Archiving <https://builds.apache.org/job/ActiveMQ-Java7-All-UnitTests/ws/activemq-jaas/pom.xml>
to org.apache.activemq/activemq-jaas/5.13-SNAPSHOT/activemq-jaas-5.13-SNAPSHOT.pom
[JENKINS] Archiving <https://builds.apache.org/job/ActiveMQ-Java7-All-UnitTests/ws/activemq-jaas/target/activemq-jaas-5.13-SNAPSHOT.jar>
to org.apache.activemq/activemq-jaas/5.13-SNAPSHOT/activemq-jaas-5.13-SNAPSHOT.jar
Sending artifact delta relative to ActiveMQ-Java7-All-UnitTests » ActiveMQ :: JAAS #208
Archived 2 artifacts
Archive block size is 32768
Received 0 blocks and 41956 bytes
Compression is 0.0%
Took 0.1 sec
[JENKINS] Archiving <https://builds.apache.org/job/ActiveMQ-Java7-All-UnitTests/ws/activemq-partition/pom.xml>
to org.apache.activemq/activemq-partition/5.13-SNAPSHOT/activemq-partition-5.13-SNAPSHOT.pom
[JENKINS] Archiving <https://builds.apache.org/job/ActiveMQ-Java7-All-UnitTests/ws/activemq-partition/target/activemq-partition-5.13-SNAPSHOT.jar>
to org.apache.activemq/activemq-partition/5.13-SNAPSHOT/activemq-partition-5.13-SNAPSHOT.jar
Sending artifact delta relative to ActiveMQ-Java7-All-UnitTests » ActiveMQ :: Partition Management
#208
Archived 2 artifacts
Archive block size is 32768
Received 0 blocks and 30289 bytes
Compression is 0.0%
Took 80 ms
[JENKINS] Archiving <https://builds.apache.org/job/ActiveMQ-Java7-All-UnitTests/ws/activemq-leveldb-store/pom.xml>
to org.apache.activemq/activemq-leveldb-store/5.13-SNAPSHOT/activemq-leveldb-store-5.13-SNAPSHOT.pom
[JENKINS] Archiving <https://builds.apache.org/job/ActiveMQ-Java7-All-UnitTests/ws/activemq-leveldb-store/target/activemq-leveldb-store-5.13-SNAPSHOT.jar>
to org.apache.activemq/activemq-leveldb-store/5.13-SNAPSHOT/activemq-leveldb-store-5.13-SNAPSHOT.jar
Sending artifact delta relative to ActiveMQ-Java7-All-UnitTests » ActiveMQ :: LevelDB Store
#208
Archived 2 artifacts
Archive block size is 32768
Received 0 blocks and 992678 bytes
Compression is 0.0%
Took 0.35 sec
channel stopped
[locks-and-latches] Releasing all the locks
[locks-and-latches] All the locks released

Mime
View raw message