activemq-commits mailing list archives

Site index · List index
Message view « Date » · « Thread »
Top « Date » · « Thread »
From Apache Jenkins Server <jenk...@builds.apache.org>
Subject Build failed in Jenkins: ActiveMQ-Artemis-Master #76
Date Thu, 30 Jul 2015 09:29:28 GMT
See <https://builds.apache.org/job/ActiveMQ-Artemis-Master/76/changes>

Changes:

[clebertsuconic] ARTEMIS-163 First pass on the native AIO refactoring

------------------------------------------
[...truncated 6527 lines...]
[ERROR] <https://builds.apache.org/job/ActiveMQ-Artemis-Master/ws/artemis-server/src/main/java/org/apache/activemq/artemis/core/replication/ReplicatedJournal.java>:95:
warning: no description for @param
[ERROR] * @param record
[ERROR] ^
[ERROR] <https://builds.apache.org/job/ActiveMQ-Artemis-Master/ws/artemis-server/src/main/java/org/apache/activemq/artemis/core/replication/ReplicatedJournal.java>:96:
warning: no description for @param
[ERROR] * @param sync
[ERROR] ^
[ERROR] <https://builds.apache.org/job/ActiveMQ-Artemis-Master/ws/artemis-server/src/main/java/org/apache/activemq/artemis/core/replication/ReplicatedJournal.java>:97:
warning: no description for @throws
[ERROR] * @throws Exception
[ERROR] ^
[ERROR] <https://builds.apache.org/job/ActiveMQ-Artemis-Master/ws/artemis-server/src/main/java/org/apache/activemq/artemis/core/replication/ReplicatedJournal.java>:115:
warning: no description for @param
[ERROR] * @param txID
[ERROR] ^
[ERROR] <https://builds.apache.org/job/ActiveMQ-Artemis-Master/ws/artemis-server/src/main/java/org/apache/activemq/artemis/core/replication/ReplicatedJournal.java>:116:
warning: no description for @param
[ERROR] * @param id
[ERROR] ^
[ERROR] <https://builds.apache.org/job/ActiveMQ-Artemis-Master/ws/artemis-server/src/main/java/org/apache/activemq/artemis/core/replication/ReplicatedJournal.java>:117:
warning: no description for @param
[ERROR] * @param recordType
[ERROR] ^
[ERROR] <https://builds.apache.org/job/ActiveMQ-Artemis-Master/ws/artemis-server/src/main/java/org/apache/activemq/artemis/core/replication/ReplicatedJournal.java>:118:
warning: no description for @param
[ERROR] * @param record
[ERROR] ^
[ERROR] <https://builds.apache.org/job/ActiveMQ-Artemis-Master/ws/artemis-server/src/main/java/org/apache/activemq/artemis/core/replication/ReplicatedJournal.java>:119:
warning: no description for @throws
[ERROR] * @throws Exception
[ERROR] ^
[ERROR] <https://builds.apache.org/job/ActiveMQ-Artemis-Master/ws/artemis-server/src/main/java/org/apache/activemq/artemis/core/replication/ReplicatedJournal.java>:128:
warning: no description for @param
[ERROR] * @param txID
[ERROR] ^
[ERROR] <https://builds.apache.org/job/ActiveMQ-Artemis-Master/ws/artemis-server/src/main/java/org/apache/activemq/artemis/core/replication/ReplicatedJournal.java>:129:
warning: no description for @param
[ERROR] * @param id
[ERROR] ^
[ERROR] <https://builds.apache.org/job/ActiveMQ-Artemis-Master/ws/artemis-server/src/main/java/org/apache/activemq/artemis/core/replication/ReplicatedJournal.java>:130:
warning: no description for @param
[ERROR] * @param recordType
[ERROR] ^
[ERROR] <https://builds.apache.org/job/ActiveMQ-Artemis-Master/ws/artemis-server/src/main/java/org/apache/activemq/artemis/core/replication/ReplicatedJournal.java>:131:
warning: no description for @param
[ERROR] * @param record
[ERROR] ^
[ERROR] <https://builds.apache.org/job/ActiveMQ-Artemis-Master/ws/artemis-server/src/main/java/org/apache/activemq/artemis/core/replication/ReplicatedJournal.java>:132:
warning: no description for @throws
[ERROR] * @throws Exception
[ERROR] ^
[ERROR] <https://builds.apache.org/job/ActiveMQ-Artemis-Master/ws/artemis-server/src/main/java/org/apache/activemq/artemis/core/replication/ReplicatedJournal.java>:149:
warning: no description for @param
[ERROR] * @param txID
[ERROR] ^
[ERROR] <https://builds.apache.org/job/ActiveMQ-Artemis-Master/ws/artemis-server/src/main/java/org/apache/activemq/artemis/core/replication/ReplicatedJournal.java>:150:
warning: no description for @param
[ERROR] * @param sync
[ERROR] ^
[ERROR] <https://builds.apache.org/job/ActiveMQ-Artemis-Master/ws/artemis-server/src/main/java/org/apache/activemq/artemis/core/replication/ReplicatedJournal.java>:151:
warning: no description for @throws
[ERROR] * @throws Exception
[ERROR] ^
[ERROR] <https://builds.apache.org/job/ActiveMQ-Artemis-Master/ws/artemis-server/src/main/java/org/apache/activemq/artemis/core/replication/ReplicatedJournal.java>:186:
warning: no description for @param
[ERROR] * @param id
[ERROR] ^
[ERROR] <https://builds.apache.org/job/ActiveMQ-Artemis-Master/ws/artemis-server/src/main/java/org/apache/activemq/artemis/core/replication/ReplicatedJournal.java>:187:
warning: no description for @param
[ERROR] * @param sync
[ERROR] ^
[ERROR] <https://builds.apache.org/job/ActiveMQ-Artemis-Master/ws/artemis-server/src/main/java/org/apache/activemq/artemis/core/replication/ReplicatedJournal.java>:188:
warning: no description for @throws
[ERROR] * @throws Exception
[ERROR] ^
[ERROR] <https://builds.apache.org/job/ActiveMQ-Artemis-Master/ws/artemis-server/src/main/java/org/apache/activemq/artemis/core/replication/ReplicatedJournal.java>:214:
warning: no description for @param
[ERROR] * @param txID
[ERROR] ^
[ERROR] <https://builds.apache.org/job/ActiveMQ-Artemis-Master/ws/artemis-server/src/main/java/org/apache/activemq/artemis/core/replication/ReplicatedJournal.java>:215:
warning: no description for @param
[ERROR] * @param id
[ERROR] ^
[ERROR] <https://builds.apache.org/job/ActiveMQ-Artemis-Master/ws/artemis-server/src/main/java/org/apache/activemq/artemis/core/replication/ReplicatedJournal.java>:216:
warning: no description for @param
[ERROR] * @param record
[ERROR] ^
[ERROR] <https://builds.apache.org/job/ActiveMQ-Artemis-Master/ws/artemis-server/src/main/java/org/apache/activemq/artemis/core/replication/ReplicatedJournal.java>:217:
warning: no description for @throws
[ERROR] * @throws Exception
[ERROR] ^
[ERROR] <https://builds.apache.org/job/ActiveMQ-Artemis-Master/ws/artemis-server/src/main/java/org/apache/activemq/artemis/core/replication/ReplicatedJournal.java>:226:
warning: no description for @param
[ERROR] * @param txID
[ERROR] ^
[ERROR] <https://builds.apache.org/job/ActiveMQ-Artemis-Master/ws/artemis-server/src/main/java/org/apache/activemq/artemis/core/replication/ReplicatedJournal.java>:227:
warning: no description for @param
[ERROR] * @param id
[ERROR] ^
[ERROR] <https://builds.apache.org/job/ActiveMQ-Artemis-Master/ws/artemis-server/src/main/java/org/apache/activemq/artemis/core/replication/ReplicatedJournal.java>:228:
warning: no description for @param
[ERROR] * @param record
[ERROR] ^
[ERROR] <https://builds.apache.org/job/ActiveMQ-Artemis-Master/ws/artemis-server/src/main/java/org/apache/activemq/artemis/core/replication/ReplicatedJournal.java>:229:
warning: no description for @throws
[ERROR] * @throws Exception
[ERROR] ^
[ERROR] <https://builds.apache.org/job/ActiveMQ-Artemis-Master/ws/artemis-server/src/main/java/org/apache/activemq/artemis/core/replication/ReplicatedJournal.java>:243:
warning: no description for @param
[ERROR] * @param txID
[ERROR] ^
[ERROR] <https://builds.apache.org/job/ActiveMQ-Artemis-Master/ws/artemis-server/src/main/java/org/apache/activemq/artemis/core/replication/ReplicatedJournal.java>:244:
warning: no description for @param
[ERROR] * @param id
[ERROR] ^
[ERROR] <https://builds.apache.org/job/ActiveMQ-Artemis-Master/ws/artemis-server/src/main/java/org/apache/activemq/artemis/core/replication/ReplicatedJournal.java>:245:
warning: no description for @throws
[ERROR] * @throws Exception
[ERROR] ^
[ERROR] <https://builds.apache.org/job/ActiveMQ-Artemis-Master/ws/artemis-server/src/main/java/org/apache/activemq/artemis/core/replication/ReplicatedJournal.java>:259:
warning: no description for @param
[ERROR] * @param txID
[ERROR] ^
[ERROR] <https://builds.apache.org/job/ActiveMQ-Artemis-Master/ws/artemis-server/src/main/java/org/apache/activemq/artemis/core/replication/ReplicatedJournal.java>:260:
warning: no description for @param
[ERROR] * @param transactionData
[ERROR] ^
[ERROR] <https://builds.apache.org/job/ActiveMQ-Artemis-Master/ws/artemis-server/src/main/java/org/apache/activemq/artemis/core/replication/ReplicatedJournal.java>:261:
warning: no description for @param
[ERROR] * @param sync
[ERROR] ^
[ERROR] <https://builds.apache.org/job/ActiveMQ-Artemis-Master/ws/artemis-server/src/main/java/org/apache/activemq/artemis/core/replication/ReplicatedJournal.java>:262:
warning: no description for @throws
[ERROR] * @throws Exception
[ERROR] ^
[ERROR] <https://builds.apache.org/job/ActiveMQ-Artemis-Master/ws/artemis-server/src/main/java/org/apache/activemq/artemis/core/replication/ReplicatedJournal.java>:271:
warning: no description for @param
[ERROR] * @param txID
[ERROR] ^
[ERROR] <https://builds.apache.org/job/ActiveMQ-Artemis-Master/ws/artemis-server/src/main/java/org/apache/activemq/artemis/core/replication/ReplicatedJournal.java>:272:
warning: no description for @param
[ERROR] * @param transactionData
[ERROR] ^
[ERROR] <https://builds.apache.org/job/ActiveMQ-Artemis-Master/ws/artemis-server/src/main/java/org/apache/activemq/artemis/core/replication/ReplicatedJournal.java>:273:
warning: no description for @param
[ERROR] * @param sync
[ERROR] ^
[ERROR] <https://builds.apache.org/job/ActiveMQ-Artemis-Master/ws/artemis-server/src/main/java/org/apache/activemq/artemis/core/replication/ReplicatedJournal.java>:274:
warning: no description for @throws
[ERROR] * @throws Exception
[ERROR] ^
[ERROR] <https://builds.apache.org/job/ActiveMQ-Artemis-Master/ws/artemis-server/src/main/java/org/apache/activemq/artemis/core/replication/ReplicatedJournal.java>:302:
warning: no description for @param
[ERROR] * @param txID
[ERROR] ^
[ERROR] <https://builds.apache.org/job/ActiveMQ-Artemis-Master/ws/artemis-server/src/main/java/org/apache/activemq/artemis/core/replication/ReplicatedJournal.java>:303:
warning: no description for @param
[ERROR] * @param sync
[ERROR] ^
[ERROR] <https://builds.apache.org/job/ActiveMQ-Artemis-Master/ws/artemis-server/src/main/java/org/apache/activemq/artemis/core/replication/ReplicatedJournal.java>:304:
warning: no description for @throws
[ERROR] * @throws Exception
[ERROR] ^
[ERROR] <https://builds.apache.org/job/ActiveMQ-Artemis-Master/ws/artemis-server/src/main/java/org/apache/activemq/artemis/core/replication/ReplicatedJournal.java>:328:
warning: no description for @param
[ERROR] * @param id
[ERROR] ^
[ERROR] <https://builds.apache.org/job/ActiveMQ-Artemis-Master/ws/artemis-server/src/main/java/org/apache/activemq/artemis/core/replication/ReplicatedJournal.java>:329:
warning: no description for @param
[ERROR] * @param recordType
[ERROR] ^
[ERROR] <https://builds.apache.org/job/ActiveMQ-Artemis-Master/ws/artemis-server/src/main/java/org/apache/activemq/artemis/core/replication/ReplicatedJournal.java>:330:
warning: no description for @param
[ERROR] * @param record
[ERROR] ^
[ERROR] <https://builds.apache.org/job/ActiveMQ-Artemis-Master/ws/artemis-server/src/main/java/org/apache/activemq/artemis/core/replication/ReplicatedJournal.java>:331:
warning: no description for @param
[ERROR] * @param sync
[ERROR] ^
[ERROR] <https://builds.apache.org/job/ActiveMQ-Artemis-Master/ws/artemis-server/src/main/java/org/apache/activemq/artemis/core/replication/ReplicatedJournal.java>:332:
warning: no description for @throws
[ERROR] * @throws Exception
[ERROR] ^
[ERROR] <https://builds.apache.org/job/ActiveMQ-Artemis-Master/ws/artemis-server/src/main/java/org/apache/activemq/artemis/core/replication/ReplicatedJournal.java>:341:
warning: no description for @param
[ERROR] * @param id
[ERROR] ^
[ERROR] <https://builds.apache.org/job/ActiveMQ-Artemis-Master/ws/artemis-server/src/main/java/org/apache/activemq/artemis/core/replication/ReplicatedJournal.java>:342:
warning: no description for @param
[ERROR] * @param recordType
[ERROR] ^
[ERROR] <https://builds.apache.org/job/ActiveMQ-Artemis-Master/ws/artemis-server/src/main/java/org/apache/activemq/artemis/core/replication/ReplicatedJournal.java>:343:
warning: no description for @param
[ERROR] * @param record
[ERROR] ^
[ERROR] <https://builds.apache.org/job/ActiveMQ-Artemis-Master/ws/artemis-server/src/main/java/org/apache/activemq/artemis/core/replication/ReplicatedJournal.java>:344:
warning: no description for @param
[ERROR] * @param sync
[ERROR] ^
[ERROR] <https://builds.apache.org/job/ActiveMQ-Artemis-Master/ws/artemis-server/src/main/java/org/apache/activemq/artemis/core/replication/ReplicatedJournal.java>:345:
warning: no description for @throws
[ERROR] * @throws Exception
[ERROR] ^
[ERROR] <https://builds.apache.org/job/ActiveMQ-Artemis-Master/ws/artemis-server/src/main/java/org/apache/activemq/artemis/core/replication/ReplicatedJournal.java>:375:
warning: no description for @param
[ERROR] * @param txID
[ERROR] ^
[ERROR] <https://builds.apache.org/job/ActiveMQ-Artemis-Master/ws/artemis-server/src/main/java/org/apache/activemq/artemis/core/replication/ReplicatedJournal.java>:376:
warning: no description for @param
[ERROR] * @param id
[ERROR] ^
[ERROR] <https://builds.apache.org/job/ActiveMQ-Artemis-Master/ws/artemis-server/src/main/java/org/apache/activemq/artemis/core/replication/ReplicatedJournal.java>:377:
warning: no description for @param
[ERROR] * @param recordType
[ERROR] ^
[ERROR] <https://builds.apache.org/job/ActiveMQ-Artemis-Master/ws/artemis-server/src/main/java/org/apache/activemq/artemis/core/replication/ReplicatedJournal.java>:378:
warning: no description for @param
[ERROR] * @param record
[ERROR] ^
[ERROR] <https://builds.apache.org/job/ActiveMQ-Artemis-Master/ws/artemis-server/src/main/java/org/apache/activemq/artemis/core/replication/ReplicatedJournal.java>:379:
warning: no description for @throws
[ERROR] * @throws Exception
[ERROR] ^
[ERROR] <https://builds.apache.org/job/ActiveMQ-Artemis-Master/ws/artemis-server/src/main/java/org/apache/activemq/artemis/core/replication/ReplicatedJournal.java>:389:
warning: no description for @param
[ERROR] * @param txID
[ERROR] ^
[ERROR] <https://builds.apache.org/job/ActiveMQ-Artemis-Master/ws/artemis-server/src/main/java/org/apache/activemq/artemis/core/replication/ReplicatedJournal.java>:390:
warning: no description for @param
[ERROR] * @param id
[ERROR] ^
[ERROR] <https://builds.apache.org/job/ActiveMQ-Artemis-Master/ws/artemis-server/src/main/java/org/apache/activemq/artemis/core/replication/ReplicatedJournal.java>:391:
warning: no description for @param
[ERROR] * @param recordType
[ERROR] ^
[ERROR] <https://builds.apache.org/job/ActiveMQ-Artemis-Master/ws/artemis-server/src/main/java/org/apache/activemq/artemis/core/replication/ReplicatedJournal.java>:392:
warning: no description for @param
[ERROR] * @param record
[ERROR] ^
[ERROR] <https://builds.apache.org/job/ActiveMQ-Artemis-Master/ws/artemis-server/src/main/java/org/apache/activemq/artemis/core/replication/ReplicatedJournal.java>:393:
warning: no description for @throws
[ERROR] * @throws Exception
[ERROR] ^
[ERROR] <https://builds.apache.org/job/ActiveMQ-Artemis-Master/ws/artemis-server/src/main/java/org/apache/activemq/artemis/core/replication/ReplicatedJournal.java>:409:
warning: no description for @param
[ERROR] * @param committedRecords
[ERROR] ^
[ERROR] <https://builds.apache.org/job/ActiveMQ-Artemis-Master/ws/artemis-server/src/main/java/org/apache/activemq/artemis/core/replication/ReplicatedJournal.java>:410:
warning: no description for @param
[ERROR] * @param preparedTransactions
[ERROR] ^
[ERROR] <https://builds.apache.org/job/ActiveMQ-Artemis-Master/ws/artemis-server/src/main/java/org/apache/activemq/artemis/core/replication/ReplicatedJournal.java>:411:
warning: no description for @param
[ERROR] * @param transactionFailure
[ERROR] ^
[ERROR] <https://builds.apache.org/job/ActiveMQ-Artemis-Master/ws/artemis-server/src/main/java/org/apache/activemq/artemis/core/replication/ReplicatedJournal.java>:413:
warning: no description for @throws
[ERROR] * @throws Exception
[ERROR] ^
[ERROR] <https://builds.apache.org/job/ActiveMQ-Artemis-Master/ws/artemis-server/src/main/java/org/apache/activemq/artemis/core/replication/ReplicatedJournal.java>:424:
warning: no description for @param
[ERROR] * @param reloadManager
[ERROR] ^
[ERROR] <https://builds.apache.org/job/ActiveMQ-Artemis-Master/ws/artemis-server/src/main/java/org/apache/activemq/artemis/core/replication/ReplicatedJournal.java>:426:
warning: no description for @throws
[ERROR] * @throws Exception
[ERROR] ^
[ERROR] <https://builds.apache.org/job/ActiveMQ-Artemis-Master/ws/artemis-server/src/main/java/org/apache/activemq/artemis/core/replication/ReplicatedJournal.java>:435:
warning: no description for @param
[ERROR] * @param pages
[ERROR] ^
[ERROR] <https://builds.apache.org/job/ActiveMQ-Artemis-Master/ws/artemis-server/src/main/java/org/apache/activemq/artemis/core/replication/ReplicatedJournal.java>:444:
warning: no description for @throws
[ERROR] * @throws Exception
[ERROR] ^
[ERROR] <https://builds.apache.org/job/ActiveMQ-Artemis-Master/ws/artemis-server/src/main/java/org/apache/activemq/artemis/core/replication/ReplicatedJournal.java>:453:
warning: no description for @throws
[ERROR] * @throws Exception
[ERROR] ^
[ERROR] <https://builds.apache.org/job/ActiveMQ-Artemis-Master/ws/artemis-server/src/main/java/org/apache/activemq/artemis/core/replication/ReplicatedLargeMessage.java>:33:
warning: no @param for b
[ERROR] Message setDurable(boolean b);
[ERROR] ^
[ERROR] <https://builds.apache.org/job/ActiveMQ-Artemis-Master/ws/artemis-server/src/main/java/org/apache/activemq/artemis/core/replication/ReplicatedLargeMessage.java>:33:
warning: no @return
[ERROR] Message setDurable(boolean b);
[ERROR] ^
[ERROR] <https://builds.apache.org/job/ActiveMQ-Artemis-Master/ws/artemis-server/src/main/java/org/apache/activemq/artemis/core/replication/ReplicatedLargeMessage.java>:38:
warning: no @param for id
[ERROR] Message setMessageID(long id);
[ERROR] ^
[ERROR] <https://builds.apache.org/job/ActiveMQ-Artemis-Master/ws/artemis-server/src/main/java/org/apache/activemq/artemis/core/protocol/core/impl/wireformat/ReplicationSyncFileMessage.java>:30:
error: reference not found
[ERROR] * Message is used to sync {@link org.apache.activemq.artemis.core.journal.SequentialFile}s
to a backup server. The {@link FileType} controls
[ERROR] ^
[ERROR] <https://builds.apache.org/job/ActiveMQ-Artemis-Master/ws/artemis-server/src/main/java/org/apache/activemq/artemis/core/paging/PagingManager.java>:29:
error: reference not found
[ERROR] * | {@link org.apache.activemq.artemis.core.postoffice.PostOffice} |-------&gt;
|{@link PagingManager}|-------&gt; |{@link PagingStore} | ------&gt; | {@link org.apache.activemq.artemis.core.paging.impl.Page}
 | ------&gt; | {@link SequentialFile} |
[ERROR] ^
[ERROR] <https://builds.apache.org/job/ActiveMQ-Artemis-Master/ws/artemis-server/src/main/java/org/apache/activemq/artemis/core/paging/PagingStore.java>:161:
error: reference not found
[ERROR] * Sending is done here to avoid exposing the internal {@link SequentialFile}s.
[ERROR] ^
[ERROR] 
[ERROR] Command line was: /home/jenkins/jenkins-slave/tools/hudson.model.JDK/latest1.8/jre/../bin/javadoc
@options @packages
[ERROR] 
[ERROR] Refer to the generated Javadoc files in '<https://builds.apache.org/job/ActiveMQ-Artemis-Master/ws/artemis-server/target/site/apidocs'>
dir.
[ERROR] -> [Help 1]
[ERROR] 
[ERROR] To see the full stack trace of the errors, re-run Maven with the -e switch.
[ERROR] Re-run Maven using the -X switch to enable full debug logging.
[ERROR] 
[ERROR] For more information about the errors and possible solutions, please read the following
articles:
[ERROR] [Help 1] http://cwiki.apache.org/confluence/display/MAVEN/MojoExecutionException
[ERROR] 
[ERROR] After correcting the problems, you can resume the build with the command
[ERROR]   mvn <goals> -rf :artemis-server
Build step 'Invoke top-level Maven targets' marked build as failure
Performing Post build task...
Could not match :Too many files with unapproved license  : False
Logical operation result is FALSE
Skipping script  : cat ratReport.txt
END OF POST BUILD TASK 	: 0
Recording test results

Mime
View raw message