activemq-commits mailing list archives

Site index · List index
Message view « Date » · « Thread »
Top « Date » · « Thread »
From Apache Jenkins Server <jenk...@builds.apache.org>
Subject Build failed in Jenkins: ActiveMQ-Artemis-Master #1
Date Tue, 09 Jun 2015 08:32:23 GMT
See <https://builds.apache.org/job/ActiveMQ-Artemis-Master/1/>

------------------------------------------
[...truncated 99 lines...]
[INFO] Exclude: **/*.jks
[INFO] Exclude: **/org/apache/activemq/artemis/utils/json/**
[INFO] Exclude: **/org/apache/activemq/artemis/utils/Base64.java
[INFO] Exclude: ratReport.txt
[INFO] 873 resources included (use -debug for more details)
Warning:  org.apache.xerces.jaxp.SAXParserImpl$JAXPSAXParser: Property 'http://www.oracle.com/xml/jaxp/properties/entityExpansionLimit'
is not recognized.
Compiler warnings:
  WARNING:  'org.apache.xerces.jaxp.SAXParserImpl: Property 'http://javax.xml.XMLConstants/property/accessExternalDTD'
is not recognized.'
Warning:  org.apache.xerces.parsers.SAXParser: Feature 'http://javax.xml.XMLConstants/feature/secure-processing'
is not recognized.
Warning:  org.apache.xerces.parsers.SAXParser: Property 'http://javax.xml.XMLConstants/property/accessExternalDTD'
is not recognized.
Warning:  org.apache.xerces.parsers.SAXParser: Property 'http://www.oracle.com/xml/jaxp/properties/entityExpansionLimit'
is not recognized.
[INFO] Rat check: Summary of files. Unapproved: 0 unknown: 0 generated: 0 approved: 847 licence.
[INFO] 
[INFO] --- maven-enforcer-plugin:1.4:enforce (enforce-java) @ artemis-pom ---
[INFO] 
[INFO] --- maven-remote-resources-plugin:1.5:process (default) @ artemis-pom ---
[INFO] 
[INFO] --- maven-checkstyle-plugin:2.12:check (default) @ artemis-pom ---
[INFO] Starting audit...
Audit done.

[INFO] 
[INFO] --- apache-rat-plugin:0.11:check (default) @ artemis-pom ---
[INFO] 72 implicit excludes (use -debug for more details).
[INFO] Exclude: **/*.txt
[INFO] Exclude: **/*.md
[INFO] Exclude: etc/org.eclipse.*
[INFO] Exclude: docs/**/*.json
[INFO] Exclude: docs/**/_book/
[INFO] Exclude: **/target/
[INFO] Exclude: **/META-INF/services/*
[INFO] Exclude: **/*.iml
[INFO] Exclude: **/*.jceks
[INFO] Exclude: **/*.jks
[INFO] Exclude: **/org/apache/activemq/artemis/utils/json/**
[INFO] Exclude: **/org/apache/activemq/artemis/utils/Base64.java
[INFO] Exclude: ratReport.txt
[INFO] 873 resources included (use -debug for more details)
Warning:  org.apache.xerces.jaxp.SAXParserImpl$JAXPSAXParser: Property 'http://www.oracle.com/xml/jaxp/properties/entityExpansionLimit'
is not recognized.
Compiler warnings:
  WARNING:  'org.apache.xerces.jaxp.SAXParserImpl: Property 'http://javax.xml.XMLConstants/property/accessExternalDTD'
is not recognized.'
Warning:  org.apache.xerces.parsers.SAXParser: Feature 'http://javax.xml.XMLConstants/feature/secure-processing'
is not recognized.
Warning:  org.apache.xerces.parsers.SAXParser: Property 'http://javax.xml.XMLConstants/property/accessExternalDTD'
is not recognized.
Warning:  org.apache.xerces.parsers.SAXParser: Property 'http://www.oracle.com/xml/jaxp/properties/entityExpansionLimit'
is not recognized.
[INFO] Rat check: Summary of files. Unapproved: 0 unknown: 0 generated: 0 approved: 847 licence.
[INFO] 
[INFO] --- maven-enforcer-plugin:1.4:enforce (enforce-java) @ artemis-pom ---
[INFO] 
[INFO] --- maven-remote-resources-plugin:1.5:process (default) @ artemis-pom ---
[INFO] 
[INFO] --- maven-checkstyle-plugin:2.12:check (default) @ artemis-pom ---
[INFO] Starting audit...
Audit done.

[INFO] 
[INFO] --- apache-rat-plugin:0.11:check (default) @ artemis-pom ---
[INFO] 72 implicit excludes (use -debug for more details).
[INFO] Exclude: **/*.txt
[INFO] Exclude: **/*.md
[INFO] Exclude: etc/org.eclipse.*
[INFO] Exclude: docs/**/*.json
[INFO] Exclude: docs/**/_book/
[INFO] Exclude: **/target/
[INFO] Exclude: **/META-INF/services/*
[INFO] Exclude: **/*.iml
[INFO] Exclude: **/*.jceks
[INFO] Exclude: **/*.jks
[INFO] Exclude: **/org/apache/activemq/artemis/utils/json/**
[INFO] Exclude: **/org/apache/activemq/artemis/utils/Base64.java
[INFO] Exclude: ratReport.txt
[INFO] 873 resources included (use -debug for more details)
Warning:  org.apache.xerces.jaxp.SAXParserImpl$JAXPSAXParser: Property 'http://www.oracle.com/xml/jaxp/properties/entityExpansionLimit'
is not recognized.
Compiler warnings:
  WARNING:  'org.apache.xerces.jaxp.SAXParserImpl: Property 'http://javax.xml.XMLConstants/property/accessExternalDTD'
is not recognized.'
Warning:  org.apache.xerces.parsers.SAXParser: Feature 'http://javax.xml.XMLConstants/feature/secure-processing'
is not recognized.
Warning:  org.apache.xerces.parsers.SAXParser: Property 'http://javax.xml.XMLConstants/property/accessExternalDTD'
is not recognized.
Warning:  org.apache.xerces.parsers.SAXParser: Property 'http://www.oracle.com/xml/jaxp/properties/entityExpansionLimit'
is not recognized.
[INFO] Rat check: Summary of files. Unapproved: 0 unknown: 0 generated: 0 approved: 847 licence.
[INFO]                                                                         
[INFO] ------------------------------------------------------------------------
[INFO] Building ActiveMQ Artemis Commons 1.0.1-SNAPSHOT
[INFO] ------------------------------------------------------------------------
[INFO] 
[INFO] --- maven-enforcer-plugin:1.4:enforce (enforce-java) @ artemis-commons ---
[INFO] 
[INFO] --- maven-remote-resources-plugin:1.5:process (default) @ artemis-commons ---
[INFO] 
[INFO] --- maven-resources-plugin:2.6:resources (default-resources) @ artemis-commons ---
[INFO] Using 'UTF-8' encoding to copy filtered resources.
[INFO] skip non existing resourceDirectory <https://builds.apache.org/job/ActiveMQ-Artemis-Master/ws/artemis-commons/src/main/resources>
[INFO] Copying 3 resources
[INFO] 
[INFO] --- maven-compiler-plugin:3.2:compile (default-compile) @ artemis-commons ---
[INFO] Changes detected - recompiling the module!
[INFO] Compiling 63 source files to <https://builds.apache.org/job/ActiveMQ-Artemis-Master/ws/artemis-commons/target/classes>
Note: Some input files use unchecked or unsafe operations.
Note: Recompile with -Xlint:unchecked for details.
[INFO] 
[INFO] --- maven-checkstyle-plugin:2.12:check (default) @ artemis-commons ---
[INFO] Starting audit...
Audit done.

[INFO] 
[INFO] --- apache-rat-plugin:0.11:check (default) @ artemis-commons ---
[INFO] 51 implicit excludes (use -debug for more details).
[INFO] Exclude: **/*.txt
[INFO] Exclude: **/*.md
[INFO] Exclude: etc/org.eclipse.*
[INFO] Exclude: docs/**/*.json
[INFO] Exclude: docs/**/_book/
[INFO] Exclude: **/target/
[INFO] Exclude: **/META-INF/services/*
[INFO] Exclude: **/*.iml
[INFO] Exclude: **/*.jceks
[INFO] Exclude: **/*.jks
[INFO] Exclude: **/org/apache/activemq/artemis/utils/json/**
[INFO] Exclude: **/org/apache/activemq/artemis/utils/Base64.java
[INFO] Exclude: ratReport.txt
[INFO] 68 resources included (use -debug for more details)
Warning:  org.apache.xerces.jaxp.SAXParserImpl$JAXPSAXParser: Property 'http://www.oracle.com/xml/jaxp/properties/entityExpansionLimit'
is not recognized.
Compiler warnings:
  WARNING:  'org.apache.xerces.jaxp.SAXParserImpl: Property 'http://javax.xml.XMLConstants/property/accessExternalDTD'
is not recognized.'
Warning:  org.apache.xerces.parsers.SAXParser: Feature 'http://javax.xml.XMLConstants/feature/secure-processing'
is not recognized.
Warning:  org.apache.xerces.parsers.SAXParser: Property 'http://javax.xml.XMLConstants/property/accessExternalDTD'
is not recognized.
Warning:  org.apache.xerces.parsers.SAXParser: Property 'http://www.oracle.com/xml/jaxp/properties/entityExpansionLimit'
is not recognized.
[INFO] Rat check: Summary of files. Unapproved: 0 unknown: 0 generated: 0 approved: 67 licence.
[INFO] 
[INFO] --- maven-enforcer-plugin:1.4:enforce (enforce-java) @ artemis-commons ---
[INFO] 
[INFO] --- maven-remote-resources-plugin:1.5:process (default) @ artemis-commons ---
[INFO] 
[INFO] --- maven-resources-plugin:2.6:resources (default-resources) @ artemis-commons ---
[INFO] Using 'UTF-8' encoding to copy filtered resources.
[INFO] skip non existing resourceDirectory <https://builds.apache.org/job/ActiveMQ-Artemis-Master/ws/artemis-commons/src/main/resources>
[INFO] Copying 3 resources
[INFO] Copying 3 resources
[INFO] 
[INFO] --- maven-compiler-plugin:3.2:compile (default-compile) @ artemis-commons ---
[INFO] Changes detected - recompiling the module!
[INFO] Compiling 65 source files to <https://builds.apache.org/job/ActiveMQ-Artemis-Master/ws/artemis-commons/target/classes>
An exception has occurred in the compiler (1.8.0-internal_bootstrap). Please file a bug at
the Java Developer Connection (http://java.sun.com/webapps/bugreport)  after checking the
Bug Parade for duplicates. Include your program and the following diagnostic in your report.
 Thank you.
java.lang.IllegalStateException: endPosTable already set
	at com.sun.tools.javac.util.DiagnosticSource.setEndPosTable(DiagnosticSource.java:136)
	at com.sun.tools.javac.util.Log.setEndPosTable(Log.java:350)
	at com.sun.tools.javac.main.JavaCompiler.parse(JavaCompiler.java:667)
	at com.sun.tools.javac.main.JavaCompiler.parseFiles(JavaCompiler.java:950)
	at com.sun.tools.javac.processing.JavacProcessingEnvironment$Round.<init>(JavacProcessingEnvironment.java:892)
	at com.sun.tools.javac.processing.JavacProcessingEnvironment$Round.next(JavacProcessingEnvironment.java:921)
	at com.sun.tools.javac.processing.JavacProcessingEnvironment.doProcessing(JavacProcessingEnvironment.java:1187)
	at com.sun.tools.javac.main.JavaCompiler.processAnnotations(JavaCompiler.java:1170)
	at com.sun.tools.javac.main.JavaCompiler.compile(JavaCompiler.java:855)
	at com.sun.tools.javac.main.Main.compile(Main.java:523)
	at com.sun.tools.javac.main.Main.compile(Main.java:381)
	at com.sun.tools.javac.main.Main.compile(Main.java:370)
	at com.google.errorprone.ErrorProneCompiler.run(ErrorProneCompiler.java:220)
	at com.google.errorprone.ErrorProneCompiler.run(ErrorProneCompiler.java:158)
	at com.google.errorprone.ErrorProneCompiler.compile(ErrorProneCompiler.java:87)
	at org.codehaus.plexus.compiler.javac.errorprone.JavacCompilerWithErrorProne$CompilerInvoker.compile(JavacCompilerWithErrorProne.java:219)
	at sun.reflect.NativeMethodAccessorImpl.invoke0(Native Method)
	at sun.reflect.NativeMethodAccessorImpl.invoke(NativeMethodAccessorImpl.java:62)
	at sun.reflect.DelegatingMethodAccessorImpl.invoke(DelegatingMethodAccessorImpl.java:43)
	at java.lang.reflect.Method.invoke(Method.java:483)
	at org.codehaus.plexus.compiler.javac.errorprone.JavacCompilerWithErrorProne.performCompile(JavacCompilerWithErrorProne.java:91)
	at org.apache.maven.plugin.compiler.AbstractCompilerMojo.execute(AbstractCompilerMojo.java:823)
	at org.apache.maven.plugin.compiler.CompilerMojo.execute(CompilerMojo.java:129)
	at org.apache.maven.plugin.DefaultBuildPluginManager.executeMojo(DefaultBuildPluginManager.java:101)
	at org.apache.maven.lifecycle.internal.MojoExecutor.execute(MojoExecutor.java:209)
	at org.apache.maven.lifecycle.internal.MojoExecutor.execute(MojoExecutor.java:153)
	at org.apache.maven.lifecycle.internal.MojoExecutor.execute(MojoExecutor.java:145)
	at org.apache.maven.lifecycle.internal.LifecycleModuleBuilder.buildProject(LifecycleModuleBuilder.java:84)
	at org.apache.maven.lifecycle.internal.LifecycleModuleBuilder.buildProject(LifecycleModuleBuilder.java:59)
	at org.apache.maven.lifecycle.internal.LifecycleStarter.singleThreadedBuild(LifecycleStarter.java:183)
	at org.apache.maven.lifecycle.internal.LifecycleStarter.execute(LifecycleStarter.java:161)
	at org.apache.maven.DefaultMaven.doExecute(DefaultMaven.java:320)
	at org.apache.maven.DefaultMaven.execute(DefaultMaven.java:156)
	at org.apache.maven.cli.MavenCli.execute(MavenCli.java:537)
	at org.apache.maven.cli.MavenCli.doMain(MavenCli.java:196)
	at org.apache.maven.cli.MavenCli.main(MavenCli.java:141)
	at sun.reflect.NativeMethodAccessorImpl.invoke0(Native Method)
	at sun.reflect.NativeMethodAccessorImpl.invoke(NativeMethodAccessorImpl.java:62)
	at sun.reflect.DelegatingMethodAccessorImpl.invoke(DelegatingMethodAccessorImpl.java:43)
	at java.lang.reflect.Method.invoke(Method.java:483)
	at org.codehaus.plexus.classworlds.launcher.Launcher.launchEnhanced(Launcher.java:290)
	at org.codehaus.plexus.classworlds.launcher.Launcher.launch(Launcher.java:230)
	at org.codehaus.plexus.classworlds.launcher.Launcher.mainWithExitCode(Launcher.java:409)
	at org.codehaus.plexus.classworlds.launcher.Launcher.main(Launcher.java:352)
[INFO] ------------------------------------------------------------------------
[INFO] Reactor Summary:
[INFO] 
[INFO] ActiveMQ Artemis Parent ........................... SUCCESS [8.113s]
[INFO] ActiveMQ Artemis Commons .......................... FAILURE [10.643s]
[INFO] ActiveMQ Artemis Selector Implementation .......... SKIPPED
[INFO] ActiveMQ Artemis Native POM ....................... SKIPPED
[INFO] ActiveMQ Artemis Journal .......................... SKIPPED
[INFO] ActiveMQ Artemis Core Client ...................... SKIPPED
[INFO] ActiveMQ Artemis JMS Client ....................... SKIPPED
[INFO] ActiveMQ Artemis Server ........................... SKIPPED
[INFO] artemis-protocols ................................. SKIPPED
[INFO] artemis-proton-plug ............................... SKIPPED
[INFO] artemis-amqp-protocol ............................. SKIPPED
[INFO] artemis-stomp-protocol ............................ SKIPPED
[INFO] artemis-openwire-protocol ......................... SKIPPED
[INFO] artemis-hornetq-protocol .......................... SKIPPED
[INFO] ActiveMQ Artemis DTO .............................. SKIPPED
[INFO] ActiveMQ Artemis Boot ............................. SKIPPED
[INFO] ActiveMQ Artemis Service Extensions ............... SKIPPED
[INFO] ActiveMQ Artemis JMS Server ....................... SKIPPED
[INFO] ActiveMQ Artemis CLI .............................. SKIPPED
[INFO] ActiveMQ Artemis Web .............................. SKIPPED
[INFO] ActiveMQ Artemis RAR POM .......................... SKIPPED
[INFO] ActiveMQ Artemis REST Interface Implementation .... SKIPPED
[INFO] ActiveMQ Artemis Maven Plugin ..................... SKIPPED
[INFO] ActiveMQ Artemis Spring Integration ............... SKIPPED
[INFO] ActiveMQ Artemis Aerogear Integration ............. SKIPPED
[INFO] ActiveMQ Artemis Vert.x Integration ............... SKIPPED
[INFO] ActiveMQ Artemis Tests POM ........................ SKIPPED
[INFO] ActiveMQ Artemis Unit Tests ....................... SKIPPED
[INFO] ActiveMQ Artemis Joram Tests ...................... SKIPPED
[INFO] ActiveMQ Artemis timing Tests ..................... SKIPPED
[INFO] ActiveMQ Artemis JMS Tests ........................ SKIPPED
[INFO] ActiveMQ Artemis Integration Tests ................ SKIPPED
[INFO] ActiveMQ Artemis soak Tests ....................... SKIPPED
[INFO] ActiveMQ Artemis stress Tests ..................... SKIPPED
[INFO] ActiveMQ Artemis performance Tests ................ SKIPPED
[INFO] ActiveMQ Artemis Extra Tests ...................... SKIPPED
[INFO] ------------------------------------------------------------------------
[INFO] BUILD FAILURE
[INFO] ------------------------------------------------------------------------
[INFO] Total time: 19.241s
[INFO] Finished at: Tue Jun 09 08:32:12 UTC 2015
[INFO] Final Memory: 48M/1025M
[INFO] ------------------------------------------------------------------------
[ERROR] Failed to execute goal org.apache.maven.plugins:maven-compiler-plugin:3.2:compile
(default-compile) on project artemis-commons: Compilation failure -> [Help 1]
[ERROR] 
[ERROR] To see the full stack trace of the errors, re-run Maven with the -e switch.
[ERROR] Re-run Maven using the -X switch to enable full debug logging.
[ERROR] 
[ERROR] For more information about the errors and possible solutions, please read the following
articles:
[ERROR] [Help 1] http://cwiki.apache.org/confluence/display/MAVEN/MojoFailureException
[ERROR] 
[ERROR] After correcting the problems, you can resume the build with the command
[ERROR]   mvn <goals> -rf :artemis-commons
Build step 'Invoke top-level Maven targets' marked build as failure
Performing Post build task...
Could not match :Too many files with unapproved license  : False
Logical operation result is FALSE
Skipping script  : cat ratReport.txt
END OF POST BUILD TASK 	: 0
Recording test results

Mime
View raw message