activemq-commits mailing list archives

Site index · List index
Message view « Date » · « Thread »
Top « Date » · « Thread »
From Apache Jenkins Server <jenk...@builds.apache.org>
Subject Build failed in Jenkins: ActiveMQ-Java7-All-UnitTests #127
Date Thu, 28 May 2015 16:03:27 GMT
See <https://builds.apache.org/job/ActiveMQ-Java7-All-UnitTests/127/changes>

Changes:

[tabish121] https://issues.apache.org/jira/browse/AMQ-5799

[gtully] better deal with journal corruption for scheduler store  to report error location
- intermittent failure of KahaDBSchedulerIndexRebuildTest

[tabish121] https://issues.apache.org/jira/browse/AMQ-5413

[robbie] AMQ-5801: add error condition hint via the info map to signal the container-id was
the invalid field

[claus.ibsen] Upgrade to jolokia 1.3.1

------------------------------------------
[...truncated 3954 lines...]
[INFO] ActiveMQ :: JAAS .................................. SUCCESS [31.815s]
[INFO] ActiveMQ :: Broker ................................ SUCCESS [1:21.607s]
[INFO] ActiveMQ :: KahaDB Store .......................... SUCCESS [2:05.115s]
[INFO] ActiveMQ :: STOMP Protocol ........................ SUCCESS [9:24.442s]
[INFO] ActiveMQ :: MQTT Protocol ......................... SUCCESS [11:40.776s]
[INFO] ActiveMQ :: JDBC Store ............................ SUCCESS [1.565s]
[INFO] ActiveMQ :: LevelDB Store ......................... SUCCESS [5:09.318s]
[INFO] ActiveMQ :: Generic JMS Pool ...................... SUCCESS [41.326s]
[INFO] ActiveMQ :: Pool .................................. SUCCESS [2.912s]
[INFO] ActiveMQ :: RA .................................... SUCCESS [2:30.702s]
[INFO] ActiveMQ :: Spring ................................ SUCCESS [1:15.905s]
[INFO] ActiveMQ :: AMQP .................................. SUCCESS [7:37.446s]
[INFO] ActiveMQ :: Console ............................... SUCCESS [2.215s]
[INFO] ActiveMQ :: Partition Management .................. SUCCESS [18.241s]
[INFO] ActiveMQ :: Unit Tests ............................ FAILURE [5:06:35.790s]
[INFO] ------------------------------------------------------------------------
[INFO] BUILD FAILURE
[INFO] ------------------------------------------------------------------------
[INFO] Total time: 5:51:44.599s
[INFO] Finished at: Thu May 28 16:02:45 UTC 2015
[INFO] Final Memory: 114M/1022M
[INFO] ------------------------------------------------------------------------
Waiting for Jenkins to finish collecting data
[ERROR] Failed to execute goal org.apache.maven.plugins:maven-surefire-plugin:2.16:test (default-test)
on project activemq-unit-tests: ExecutionException; nested exception is java.util.concurrent.ExecutionException:
java.lang.RuntimeException: The forked VM terminated without saying properly goodbye. VM crash
or System.exit called ?
[ERROR] Command was/bin/sh -c cd <https://builds.apache.org/job/ActiveMQ-Java7-All-UnitTests/ws/activemq-unit-tests>
&& /home/jenkins/tools/java/jdk1.7.0_25-32/jre/bin/java -Xmx512m -jar <https://builds.apache.org/job/ActiveMQ-Java7-All-UnitTests/ws/activemq-unit-tests/target/surefire/surefirebooter6539887386007560687.jar>
<https://builds.apache.org/job/ActiveMQ-Java7-All-UnitTests/ws/activemq-unit-tests/target/surefire/surefire4174577110335127359tmp>
<https://builds.apache.org/job/ActiveMQ-Java7-All-UnitTests/ws/activemq-unit-tests/target/surefire/surefire_1142582987458188332863tmp>
[ERROR] -> [Help 1]
org.apache.maven.lifecycle.LifecycleExecutionException: Failed to execute goal org.apache.maven.plugins:maven-surefire-plugin:2.16:test
(default-test) on project activemq-unit-tests: ExecutionException; nested exception is java.util.concurrent.ExecutionException:
java.lang.RuntimeException: The forked VM terminated without saying properly goodbye. VM crash
or System.exit called ?
Command was/bin/sh -c cd <https://builds.apache.org/job/ActiveMQ-Java7-All-UnitTests/ws/activemq-unit-tests>
&& /home/jenkins/tools/java/jdk1.7.0_25-32/jre/bin/java -Xmx512m -jar <https://builds.apache.org/job/ActiveMQ-Java7-All-UnitTests/ws/activemq-unit-tests/target/surefire/surefirebooter6539887386007560687.jar>
<https://builds.apache.org/job/ActiveMQ-Java7-All-UnitTests/ws/activemq-unit-tests/target/surefire/surefire4174577110335127359tmp>
<https://builds.apache.org/job/ActiveMQ-Java7-All-UnitTests/ws/activemq-unit-tests/target/surefire/surefire_1142582987458188332863tmp>
	at org.apache.maven.lifecycle.internal.MojoExecutor.execute(MojoExecutor.java:213)
	at org.apache.maven.lifecycle.internal.MojoExecutor.execute(MojoExecutor.java:153)
	at org.apache.maven.lifecycle.internal.MojoExecutor.execute(MojoExecutor.java:145)
	at org.apache.maven.lifecycle.internal.LifecycleModuleBuilder.buildProject(LifecycleModuleBuilder.java:84)
	at org.apache.maven.lifecycle.internal.LifecycleModuleBuilder.buildProject(LifecycleModuleBuilder.java:59)
	at org.apache.maven.lifecycle.internal.LifecycleStarter.singleThreadedBuild(LifecycleStarter.java:183)
	at org.apache.maven.lifecycle.internal.LifecycleStarter.execute(LifecycleStarter.java:161)
	at org.apache.maven.DefaultMaven.doExecute(DefaultMaven.java:320)
	at org.apache.maven.DefaultMaven.execute(DefaultMaven.java:156)
	at org.jvnet.hudson.maven3.launcher.Maven3Launcher.main(Maven3Launcher.java:117)
	at sun.reflect.NativeMethodAccessorImpl.invoke0(Native Method)
	at sun.reflect.NativeMethodAccessorImpl.invoke(NativeMethodAccessorImpl.java:57)
	at sun.reflect.DelegatingMethodAccessorImpl.invoke(DelegatingMethodAccessorImpl.java:43)
	at java.lang.reflect.Method.invoke(Method.java:606)
	at org.codehaus.plexus.classworlds.launcher.Launcher.launchStandard(Launcher.java:329)
	at org.codehaus.plexus.classworlds.launcher.Launcher.launch(Launcher.java:239)
	at org.jvnet.hudson.maven3.agent.Maven3Main.launch(Maven3Main.java:178)
	at sun.reflect.NativeMethodAccessorImpl.invoke0(Native Method)
	at sun.reflect.NativeMethodAccessorImpl.invoke(NativeMethodAccessorImpl.java:57)
	at sun.reflect.DelegatingMethodAccessorImpl.invoke(DelegatingMethodAccessorImpl.java:43)
	at java.lang.reflect.Method.invoke(Method.java:606)
	at hudson.maven.Maven3Builder.call(Maven3Builder.java:136)
	at hudson.maven.Maven3Builder.call(Maven3Builder.java:71)
	at hudson.remoting.UserRequest.perform(UserRequest.java:118)
	at hudson.remoting.UserRequest.perform(UserRequest.java:48)
	at hudson.remoting.Request$2.run(Request.java:328)
	at hudson.remoting.InterceptingExecutorService$1.call(InterceptingExecutorService.java:72)
	at java.util.concurrent.FutureTask$Sync.innerRun(FutureTask.java:334)
	at java.util.concurrent.FutureTask.run(FutureTask.java:166)
	at java.util.concurrent.ThreadPoolExecutor.runWorker(ThreadPoolExecutor.java:1145)
	at java.util.concurrent.ThreadPoolExecutor$Worker.run(ThreadPoolExecutor.java:615)
	at java.lang.Thread.run(Thread.java:724)
Caused by: org.apache.maven.plugin.MojoFailureException: ExecutionException; nested exception
is java.util.concurrent.ExecutionException: java.lang.RuntimeException: The forked VM terminated
without saying properly goodbye. VM crash or System.exit called ?
Command was/bin/sh -c cd <https://builds.apache.org/job/ActiveMQ-Java7-All-UnitTests/ws/activemq-unit-tests>
&& /home/jenkins/tools/java/jdk1.7.0_25-32/jre/bin/java -Xmx512m -jar <https://builds.apache.org/job/ActiveMQ-Java7-All-UnitTests/ws/activemq-unit-tests/target/surefire/surefirebooter6539887386007560687.jar>
<https://builds.apache.org/job/ActiveMQ-Java7-All-UnitTests/ws/activemq-unit-tests/target/surefire/surefire4174577110335127359tmp>
<https://builds.apache.org/job/ActiveMQ-Java7-All-UnitTests/ws/activemq-unit-tests/target/surefire/surefire_1142582987458188332863tmp>
	at org.apache.maven.plugin.surefire.SurefirePlugin.assertNoException(SurefirePlugin.java:198)
	at org.apache.maven.plugin.surefire.SurefirePlugin.handleSummary(SurefirePlugin.java:188)
	at org.apache.maven.plugin.surefire.AbstractSurefireMojo.executeAfterPreconditionsChecked(AbstractSurefireMojo.java:852)
	at org.apache.maven.plugin.surefire.AbstractSurefireMojo.execute(AbstractSurefireMojo.java:720)
	at org.apache.maven.plugin.DefaultBuildPluginManager.executeMojo(DefaultBuildPluginManager.java:101)
	at org.apache.maven.lifecycle.internal.MojoExecutor.execute(MojoExecutor.java:209)
	... 31 more
Caused by: org.apache.maven.surefire.booter.SurefireBooterForkException: ExecutionException;
nested exception is java.util.concurrent.ExecutionException: java.lang.RuntimeException: The
forked VM terminated without saying properly goodbye. VM crash or System.exit called ?
Command was/bin/sh -c cd <https://builds.apache.org/job/ActiveMQ-Java7-All-UnitTests/ws/activemq-unit-tests>
&& /home/jenkins/tools/java/jdk1.7.0_25-32/jre/bin/java -Xmx512m -jar <https://builds.apache.org/job/ActiveMQ-Java7-All-UnitTests/ws/activemq-unit-tests/target/surefire/surefirebooter6539887386007560687.jar>
<https://builds.apache.org/job/ActiveMQ-Java7-All-UnitTests/ws/activemq-unit-tests/target/surefire/surefire4174577110335127359tmp>
<https://builds.apache.org/job/ActiveMQ-Java7-All-UnitTests/ws/activemq-unit-tests/target/surefire/surefire_1142582987458188332863tmp>
	at org.apache.maven.plugin.surefire.booterclient.ForkStarter.runSuitesForkPerTestSet(ForkStarter.java:316)
	at org.apache.maven.plugin.surefire.booterclient.ForkStarter.run(ForkStarter.java:169)
	at org.apache.maven.plugin.surefire.AbstractSurefireMojo.executeProvider(AbstractSurefireMojo.java:958)
	at org.apache.maven.plugin.surefire.AbstractSurefireMojo.executeAfterPreconditionsChecked(AbstractSurefireMojo.java:822)
	... 34 more
Caused by: java.util.concurrent.ExecutionException: java.lang.RuntimeException: The forked
VM terminated without saying properly goodbye. VM crash or System.exit called ?
Command was/bin/sh -c cd <https://builds.apache.org/job/ActiveMQ-Java7-All-UnitTests/ws/activemq-unit-tests>
&& /home/jenkins/tools/java/jdk1.7.0_25-32/jre/bin/java -Xmx512m -jar <https://builds.apache.org/job/ActiveMQ-Java7-All-UnitTests/ws/activemq-unit-tests/target/surefire/surefirebooter6539887386007560687.jar>
<https://builds.apache.org/job/ActiveMQ-Java7-All-UnitTests/ws/activemq-unit-tests/target/surefire/surefire4174577110335127359tmp>
<https://builds.apache.org/job/ActiveMQ-Java7-All-UnitTests/ws/activemq-unit-tests/target/surefire/surefire_1142582987458188332863tmp>
	at java.util.concurrent.FutureTask$Sync.innerGet(FutureTask.java:252)
	at java.util.concurrent.FutureTask.get(FutureTask.java:111)
	at org.apache.maven.plugin.surefire.booterclient.ForkStarter.runSuitesForkPerTestSet(ForkStarter.java:300)
	... 37 more
Caused by: java.lang.RuntimeException: The forked VM terminated without saying properly goodbye.
VM crash or System.exit called ?
Command was/bin/sh -c cd <https://builds.apache.org/job/ActiveMQ-Java7-All-UnitTests/ws/activemq-unit-tests>
&& /home/jenkins/tools/java/jdk1.7.0_25-32/jre/bin/java -Xmx512m -jar <https://builds.apache.org/job/ActiveMQ-Java7-All-UnitTests/ws/activemq-unit-tests/target/surefire/surefirebooter6539887386007560687.jar>
<https://builds.apache.org/job/ActiveMQ-Java7-All-UnitTests/ws/activemq-unit-tests/target/surefire/surefire4174577110335127359tmp>
<https://builds.apache.org/job/ActiveMQ-Java7-All-UnitTests/ws/activemq-unit-tests/target/surefire/surefire_1142582987458188332863tmp>
	at org.apache.maven.plugin.surefire.booterclient.ForkStarter.fork(ForkStarter.java:485)
	at org.apache.maven.plugin.surefire.booterclient.ForkStarter.fork(ForkStarter.java:352)
	at org.apache.maven.plugin.surefire.booterclient.ForkStarter.access$300(ForkStarter.java:85)
	at org.apache.maven.plugin.surefire.booterclient.ForkStarter$2.call(ForkStarter.java:288)
	at org.apache.maven.plugin.surefire.booterclient.ForkStarter$2.call(ForkStarter.java:283)
	... 5 more
[ERROR] 
[ERROR] Re-run Maven using the -X switch to enable full debug logging.
[ERROR] 
[ERROR] For more information about the errors and possible solutions, please read the following
articles:
[ERROR] [Help 1] http://cwiki.apache.org/confluence/display/MAVEN/MojoFailureException
[ERROR] 
[ERROR] After correcting the problems, you can resume the build with the command
[ERROR]   mvn <goals> -rf :activemq-unit-tests
[JENKINS] Archiving <https://builds.apache.org/job/ActiveMQ-Java7-All-UnitTests/ws/activemq-unit-tests/pom.xml>
to org.apache.activemq/activemq-unit-tests/5.12-SNAPSHOT/activemq-unit-tests-5.12-SNAPSHOT.pom
Sending artifact delta relative to ActiveMQ-Java7-All-UnitTests » ActiveMQ :: Unit Tests
#123
Archived 1 artifacts
Archive block size is 32768
Received 1 blocks and 37691 bytes
Compression is 46.5%
Took 2.6 sec
[JENKINS] Archiving <https://builds.apache.org/job/ActiveMQ-Java7-All-UnitTests/ws/activemq-openwire-legacy/pom.xml>
to org.apache.activemq/activemq-openwire-legacy/5.12-SNAPSHOT/activemq-openwire-legacy-5.12-SNAPSHOT.pom
[JENKINS] Archiving <https://builds.apache.org/job/ActiveMQ-Java7-All-UnitTests/ws/activemq-openwire-legacy/target/activemq-openwire-legacy-5.12-SNAPSHOT.jar>
to org.apache.activemq/activemq-openwire-legacy/5.12-SNAPSHOT/activemq-openwire-legacy-5.12-SNAPSHOT.jar
Sending artifact delta relative to ActiveMQ-Java7-All-UnitTests » ActiveMQ :: Openwire Legacy
Support #126
Archived 2 artifacts
Archive block size is 32768
Received 0 blocks and 687388 bytes
Compression is 0.0%
Took 1.4 sec
[JENKINS] Archiving <https://builds.apache.org/job/ActiveMQ-Java7-All-UnitTests/ws/activemq-jdbc-store/pom.xml>
to org.apache.activemq/activemq-jdbc-store/5.12-SNAPSHOT/activemq-jdbc-store-5.12-SNAPSHOT.pom
[JENKINS] Archiving <https://builds.apache.org/job/ActiveMQ-Java7-All-UnitTests/ws/activemq-jdbc-store/target/activemq-jdbc-store-5.12-SNAPSHOT.jar>
to org.apache.activemq/activemq-jdbc-store/5.12-SNAPSHOT/activemq-jdbc-store-5.12-SNAPSHOT.jar
Sending artifact delta relative to ActiveMQ-Java7-All-UnitTests » ActiveMQ :: JDBC Store
#126
Archived 2 artifacts
Archive block size is 32768
Received 0 blocks and 178338 bytes
Compression is 0.0%
Took 0.8 sec
[JENKINS] Archiving <https://builds.apache.org/job/ActiveMQ-Java7-All-UnitTests/ws/activemq-amqp/pom.xml>
to org.apache.activemq/activemq-amqp/5.12-SNAPSHOT/activemq-amqp-5.12-SNAPSHOT.pom
[JENKINS] Archiving <https://builds.apache.org/job/ActiveMQ-Java7-All-UnitTests/ws/activemq-amqp/target/activemq-amqp-5.12-SNAPSHOT.jar>
to org.apache.activemq/activemq-amqp/5.12-SNAPSHOT/activemq-amqp-5.12-SNAPSHOT.jar
Sending artifact delta relative to ActiveMQ-Java7-All-UnitTests » ActiveMQ :: AMQP #125
Archived 2 artifacts
Archive block size is 32768
Received 0 blocks and 152484 bytes
Compression is 0.0%
Took 1 sec
[JENKINS] Archiving <https://builds.apache.org/job/ActiveMQ-Java7-All-UnitTests/ws/activemq-jms-pool/pom.xml>
to org.apache.activemq/activemq-jms-pool/5.12-SNAPSHOT/activemq-jms-pool-5.12-SNAPSHOT.pom
[JENKINS] Archiving <https://builds.apache.org/job/ActiveMQ-Java7-All-UnitTests/ws/activemq-jms-pool/target/activemq-jms-pool-5.12-SNAPSHOT.jar>
to org.apache.activemq/activemq-jms-pool/5.12-SNAPSHOT/activemq-jms-pool-5.12-SNAPSHOT.jar
Sending artifact delta relative to ActiveMQ-Java7-All-UnitTests » ActiveMQ :: Generic JMS
Pool #126
Archived 2 artifacts
Archive block size is 32768
Received 0 blocks and 56306 bytes
Compression is 0.0%
Took 0.74 sec
[JENKINS] Archiving <https://builds.apache.org/job/ActiveMQ-Java7-All-UnitTests/ws/activemq-pool/pom.xml>
to org.apache.activemq/activemq-pool/5.12-SNAPSHOT/activemq-pool-5.12-SNAPSHOT.pom
[JENKINS] Archiving <https://builds.apache.org/job/ActiveMQ-Java7-All-UnitTests/ws/activemq-pool/target/activemq-pool-5.12-SNAPSHOT.jar>
to org.apache.activemq/activemq-pool/5.12-SNAPSHOT/activemq-pool-5.12-SNAPSHOT.jar
Sending artifact delta relative to ActiveMQ-Java7-All-UnitTests » ActiveMQ :: Pool #126
Archived 2 artifacts
Archive block size is 32768
Received 0 blocks and 23939 bytes
Compression is 0.0%
Took 0.66 sec
[JENKINS] Archiving <https://builds.apache.org/job/ActiveMQ-Java7-All-UnitTests/ws/activemq-stomp/pom.xml>
to org.apache.activemq/activemq-stomp/5.12-SNAPSHOT/activemq-stomp-5.12-SNAPSHOT.pom
[JENKINS] Archiving <https://builds.apache.org/job/ActiveMQ-Java7-All-UnitTests/ws/activemq-stomp/target/activemq-stomp-5.12-SNAPSHOT.jar>
to org.apache.activemq/activemq-stomp/5.12-SNAPSHOT/activemq-stomp-5.12-SNAPSHOT.jar
Sending artifact delta relative to ActiveMQ-Java7-All-UnitTests » ActiveMQ :: STOMP Protocol
#126
Archived 2 artifacts
Archive block size is 32768
Received 0 blocks and 110158 bytes
Compression is 0.0%
Took 0.55 sec
[JENKINS] Archiving <https://builds.apache.org/job/ActiveMQ-Java7-All-UnitTests/ws/activemq-mqtt/pom.xml>
to org.apache.activemq/activemq-mqtt/5.12-SNAPSHOT/activemq-mqtt-5.12-SNAPSHOT.pom
[JENKINS] Archiving <https://builds.apache.org/job/ActiveMQ-Java7-All-UnitTests/ws/activemq-mqtt/target/activemq-mqtt-5.12-SNAPSHOT.jar>
to org.apache.activemq/activemq-mqtt/5.12-SNAPSHOT/activemq-mqtt-5.12-SNAPSHOT.jar
Sending artifact delta relative to ActiveMQ-Java7-All-UnitTests » ActiveMQ :: MQTT Protocol
#126
Archived 2 artifacts
Archive block size is 32768
Received 0 blocks and 109677 bytes
Compression is 0.0%
Took 1.2 sec
[JENKINS] Archiving <https://builds.apache.org/job/ActiveMQ-Java7-All-UnitTests/ws/activemq-console/pom.xml>
to org.apache.activemq/activemq-console/5.12-SNAPSHOT/activemq-console-5.12-SNAPSHOT.pom
[JENKINS] Archiving <https://builds.apache.org/job/ActiveMQ-Java7-All-UnitTests/ws/activemq-console/target/activemq-console-5.12-SNAPSHOT.jar>
to org.apache.activemq/activemq-console/5.12-SNAPSHOT/activemq-console-5.12-SNAPSHOT.jar
Sending artifact delta relative to ActiveMQ-Java7-All-UnitTests » ActiveMQ :: Console #126
Archived 2 artifacts
Archive block size is 32768
Received 0 blocks and 201999 bytes
Compression is 0.0%
Took 0.6 sec
[JENKINS] Archiving <https://builds.apache.org/job/ActiveMQ-Java7-All-UnitTests/ws/activemq-client/pom.xml>
to org.apache.activemq/activemq-client/5.12-SNAPSHOT/activemq-client-5.12-SNAPSHOT.pom
[JENKINS] Archiving <https://builds.apache.org/job/ActiveMQ-Java7-All-UnitTests/ws/activemq-client/target/activemq-client-5.12-SNAPSHOT.jar>
to org.apache.activemq/activemq-client/5.12-SNAPSHOT/activemq-client-5.12-SNAPSHOT.jar
Sending artifact delta relative to ActiveMQ-Java7-All-UnitTests » ActiveMQ :: Client #126
Archived 2 artifacts
Archive block size is 32768
Received 0 blocks and 1196592 bytes
Compression is 0.0%
Took 2.3 sec
[JENKINS] Archiving <https://builds.apache.org/job/ActiveMQ-Java7-All-UnitTests/ws/pom.xml>
to org.apache.activemq/activemq-parent/5.12-SNAPSHOT/activemq-parent-5.12-SNAPSHOT.pom
Sending artifact delta relative to ActiveMQ-Java7-All-UnitTests » ActiveMQ #126
Archived 1 artifacts
Archive block size is 32768
Received 0 blocks and 59390 bytes
Compression is 0.0%
Took 0.54 sec
[JENKINS] Archiving <https://builds.apache.org/job/ActiveMQ-Java7-All-UnitTests/ws/activemq-broker/pom.xml>
to org.apache.activemq/activemq-broker/5.12-SNAPSHOT/activemq-broker-5.12-SNAPSHOT.pom
[JENKINS] Archiving <https://builds.apache.org/job/ActiveMQ-Java7-All-UnitTests/ws/activemq-broker/target/activemq-broker-5.12-SNAPSHOT.jar>
to org.apache.activemq/activemq-broker/5.12-SNAPSHOT/activemq-broker-5.12-SNAPSHOT.jar
[JENKINS] Archiving <https://builds.apache.org/job/ActiveMQ-Java7-All-UnitTests/ws/activemq-broker/target/activemq-broker-5.12-SNAPSHOT-tests.jar>
to org.apache.activemq/activemq-broker/5.12-SNAPSHOT/activemq-broker-5.12-SNAPSHOT-tests.jar
Sending artifact delta relative to ActiveMQ-Java7-All-UnitTests » ActiveMQ :: Broker #126
Archived 3 artifacts
Archive block size is 32768
Received 0 blocks and 1163395 bytes
Compression is 0.0%
Took 2.5 sec
[JENKINS] Archiving <https://builds.apache.org/job/ActiveMQ-Java7-All-UnitTests/ws/activemq-ra/pom.xml>
to org.apache.activemq/activemq-ra/5.12-SNAPSHOT/activemq-ra-5.12-SNAPSHOT.pom
[JENKINS] Archiving <https://builds.apache.org/job/ActiveMQ-Java7-All-UnitTests/ws/activemq-ra/target/activemq-ra-5.12-SNAPSHOT.jar>
to org.apache.activemq/activemq-ra/5.12-SNAPSHOT/activemq-ra-5.12-SNAPSHOT.jar
[JENKINS] Archiving <https://builds.apache.org/job/ActiveMQ-Java7-All-UnitTests/ws/activemq-ra/target/xbean/activemq-ra.xsd>
to org.apache.activemq/activemq-ra/5.12-SNAPSHOT/activemq-ra-5.12-SNAPSHOT.xsd
[JENKINS] Archiving <https://builds.apache.org/job/ActiveMQ-Java7-All-UnitTests/ws/activemq-ra/target/xbean/activemq-ra.xsd.html>
to org.apache.activemq/activemq-ra/5.12-SNAPSHOT/activemq-ra-5.12-SNAPSHOT-schema.html
[JENKINS] Archiving <https://builds.apache.org/job/ActiveMQ-Java7-All-UnitTests/ws/activemq-ra/target/xbean/activemq-ra.xsd.html>
to org.apache.activemq/activemq-ra/5.12-SNAPSHOT/activemq-ra-5.12-SNAPSHOT.xsd.html
Sending artifact delta relative to ActiveMQ-Java7-All-UnitTests » ActiveMQ :: RA #126
Archived 5 artifacts
Archive block size is 32768
Received 0 blocks and 128014 bytes
Compression is 0.0%
Took 0.83 sec
[JENKINS] Archiving <https://builds.apache.org/job/ActiveMQ-Java7-All-UnitTests/ws/activemq-spring/pom.xml>
to org.apache.activemq/activemq-spring/5.12-SNAPSHOT/activemq-spring-5.12-SNAPSHOT.pom
[JENKINS] Archiving <https://builds.apache.org/job/ActiveMQ-Java7-All-UnitTests/ws/activemq-spring/target/activemq-spring-5.12-SNAPSHOT.jar>
to org.apache.activemq/activemq-spring/5.12-SNAPSHOT/activemq-spring-5.12-SNAPSHOT.jar
[JENKINS] Archiving <https://builds.apache.org/job/ActiveMQ-Java7-All-UnitTests/ws/activemq-spring/target/classes/activemq.xsd>
to org.apache.activemq/activemq-spring/5.12-SNAPSHOT/activemq-spring-5.12-SNAPSHOT.xsd
[JENKINS] Archiving <https://builds.apache.org/job/ActiveMQ-Java7-All-UnitTests/ws/activemq-spring/target/classes/activemq.xsd.html>
to org.apache.activemq/activemq-spring/5.12-SNAPSHOT/activemq-spring-5.12-SNAPSHOT-schema.html
Sending artifact delta relative to ActiveMQ-Java7-All-UnitTests » ActiveMQ :: Spring #126
Archived 4 artifacts
Archive block size is 32768
Received 21 blocks and 210924 bytes
Compression is 76.5%
Took 1.6 sec
[JENKINS] Archiving <https://builds.apache.org/job/ActiveMQ-Java7-All-UnitTests/ws/activemq-kahadb-store/pom.xml>
to org.apache.activemq/activemq-kahadb-store/5.12-SNAPSHOT/activemq-kahadb-store-5.12-SNAPSHOT.pom
[JENKINS] Archiving <https://builds.apache.org/job/ActiveMQ-Java7-All-UnitTests/ws/activemq-kahadb-store/target/activemq-kahadb-store-5.12-SNAPSHOT.jar>
to org.apache.activemq/activemq-kahadb-store/5.12-SNAPSHOT/activemq-kahadb-store-5.12-SNAPSHOT.jar
Sending artifact delta relative to ActiveMQ-Java7-All-UnitTests » ActiveMQ :: KahaDB Store
#126
Archived 2 artifacts
Archive block size is 32768
Received 0 blocks and 642133 bytes
Compression is 0.0%
Took 1.9 sec
[JENKINS] Archiving <https://builds.apache.org/job/ActiveMQ-Java7-All-UnitTests/ws/activemq-jaas/pom.xml>
to org.apache.activemq/activemq-jaas/5.12-SNAPSHOT/activemq-jaas-5.12-SNAPSHOT.pom
[JENKINS] Archiving <https://builds.apache.org/job/ActiveMQ-Java7-All-UnitTests/ws/activemq-jaas/target/activemq-jaas-5.12-SNAPSHOT.jar>
to org.apache.activemq/activemq-jaas/5.12-SNAPSHOT/activemq-jaas-5.12-SNAPSHOT.jar
Sending artifact delta relative to ActiveMQ-Java7-All-UnitTests » ActiveMQ :: JAAS #126
Archived 2 artifacts
Archive block size is 32768
Received 0 blocks and 37981 bytes
Compression is 0.0%
Took 0.49 sec
[JENKINS] Archiving <https://builds.apache.org/job/ActiveMQ-Java7-All-UnitTests/ws/activemq-partition/pom.xml>
to org.apache.activemq/activemq-partition/5.12-SNAPSHOT/activemq-partition-5.12-SNAPSHOT.pom
[JENKINS] Archiving <https://builds.apache.org/job/ActiveMQ-Java7-All-UnitTests/ws/activemq-partition/target/activemq-partition-5.12-SNAPSHOT.jar>
to org.apache.activemq/activemq-partition/5.12-SNAPSHOT/activemq-partition-5.12-SNAPSHOT.jar
Sending artifact delta relative to ActiveMQ-Java7-All-UnitTests » ActiveMQ :: Partition Management
#126
Archived 2 artifacts
Archive block size is 32768
Received 0 blocks and 28979 bytes
Compression is 0.0%
Took 1.8 sec
[JENKINS] Archiving <https://builds.apache.org/job/ActiveMQ-Java7-All-UnitTests/ws/activemq-leveldb-store/pom.xml>
to org.apache.activemq/activemq-leveldb-store/5.12-SNAPSHOT/activemq-leveldb-store-5.12-SNAPSHOT.pom
[JENKINS] Archiving <https://builds.apache.org/job/ActiveMQ-Java7-All-UnitTests/ws/activemq-leveldb-store/target/activemq-leveldb-store-5.12-SNAPSHOT.jar>
to org.apache.activemq/activemq-leveldb-store/5.12-SNAPSHOT/activemq-leveldb-store-5.12-SNAPSHOT.jar
Sending artifact delta relative to ActiveMQ-Java7-All-UnitTests » ActiveMQ :: LevelDB Store
#126
Archived 2 artifacts
Archive block size is 32768
Received 0 blocks and 991376 bytes
Compression is 0.0%
Took 3.6 sec
channel stopped
[locks-and-latches] Releasing all the locks
[locks-and-latches] All the locks released

Mime
View raw message