activemq-commits mailing list archives

Site index · List index
Message view « Date » · « Thread »
Top « Date » · « Thread »
From Apache Jenkins Server <jenk...@builds.apache.org>
Subject Build failed in Jenkins: ActiveMQ-Java8 » ActiveMQ :: Unit Tests #336
Date Mon, 27 Apr 2015 14:28:07 GMT
See <https://builds.apache.org/job/ActiveMQ-Java8/org.apache.activemq$activemq-unit-tests/336/>

------------------------------------------
[...truncated 2711 lines...]
testGuestSendFails {destination=queue://USERS.FOO, password=password, userName=guest}(org.apache.activemq.security.SimpleAuthenticationPluginTest)
 Time elapsed: 0.124 sec  <<< ERROR!
org.springframework.beans.factory.CannotLoadBeanClassException: Cannot find class [org.jasypt.spring.properties.EncryptablePropertyPlaceholderConfigurer]
for bean with name 'propertyConfigurer' defined in class path resource [org/apache/activemq/security/simple-auth-broker.xml];
nested exception is java.lang.ClassNotFoundException: org.jasypt.spring.properties.EncryptablePropertyPlaceholderConfigurer
	at java.net.URLClassLoader$1.run(URLClassLoader.java:372)
	at java.net.URLClassLoader$1.run(URLClassLoader.java:361)
	at java.security.AccessController.doPrivileged(Native Method)
	at java.net.URLClassLoader.findClass(URLClassLoader.java:360)
	at java.lang.ClassLoader.loadClass(ClassLoader.java:424)
	at sun.misc.Launcher$AppClassLoader.loadClass(Launcher.java:308)
	at java.lang.ClassLoader.loadClass(ClassLoader.java:357)
	at org.springframework.util.ClassUtils.forName(ClassUtils.java:265)
	at org.springframework.beans.factory.support.AbstractBeanDefinition.resolveBeanClass(AbstractBeanDefinition.java:419)
	at org.springframework.beans.factory.support.AbstractBeanFactory.doResolveBeanClass(AbstractBeanFactory.java:1299)
	at org.springframework.beans.factory.support.AbstractBeanFactory.resolveBeanClass(AbstractBeanFactory.java:1270)
	at org.springframework.beans.factory.support.AbstractAutowireCapableBeanFactory.predictBeanType(AbstractAutowireCapableBeanFactory.java:575)
	at org.springframework.beans.factory.support.AbstractBeanFactory.isFactoryBean(AbstractBeanFactory.java:1347)
	at org.springframework.beans.factory.support.AbstractBeanFactory.isFactoryBean(AbstractBeanFactory.java:913)
	at org.springframework.beans.factory.support.DefaultListableBeanFactory.preInstantiateSingletons(DefaultListableBeanFactory.java:617)
	at org.springframework.context.support.AbstractApplicationContext.finishBeanFactoryInitialization(AbstractApplicationContext.java:934)
	at org.springframework.context.support.AbstractApplicationContext.refresh(AbstractApplicationContext.java:479)
	at org.apache.xbean.spring.context.ResourceXmlApplicationContext.<init>(ResourceXmlApplicationContext.java:64)
	at org.apache.xbean.spring.context.ResourceXmlApplicationContext.<init>(ResourceXmlApplicationContext.java:52)
	at org.apache.activemq.xbean.XBeanBrokerFactory$1.<init>(XBeanBrokerFactory.java:104)
	at org.apache.activemq.xbean.XBeanBrokerFactory.createApplicationContext(XBeanBrokerFactory.java:104)
	at org.apache.activemq.xbean.XBeanBrokerFactory.createBroker(XBeanBrokerFactory.java:67)
	at org.apache.activemq.broker.BrokerFactory.createBroker(BrokerFactory.java:71)
	at org.apache.activemq.broker.BrokerFactory.createBroker(BrokerFactory.java:54)
	at org.apache.activemq.security.SimpleAuthenticationPluginTest.createBroker(SimpleAuthenticationPluginTest.java:71)
	at org.apache.activemq.security.SimpleAuthenticationPluginTest.createBroker(SimpleAuthenticationPluginTest.java:66)

testGuestSendFails {destination=topic://USERS.FOO, password=password, userName=guest}(org.apache.activemq.security.SimpleAuthenticationPluginTest)
 Time elapsed: 0.072 sec  <<< ERROR!
org.springframework.beans.factory.CannotLoadBeanClassException: Cannot find class [org.jasypt.spring.properties.EncryptablePropertyPlaceholderConfigurer]
for bean with name 'propertyConfigurer' defined in class path resource [org/apache/activemq/security/simple-auth-broker.xml];
nested exception is java.lang.ClassNotFoundException: org.jasypt.spring.properties.EncryptablePropertyPlaceholderConfigurer
	at java.net.URLClassLoader$1.run(URLClassLoader.java:372)
	at java.net.URLClassLoader$1.run(URLClassLoader.java:361)
	at java.security.AccessController.doPrivileged(Native Method)
	at java.net.URLClassLoader.findClass(URLClassLoader.java:360)
	at java.lang.ClassLoader.loadClass(ClassLoader.java:424)
	at sun.misc.Launcher$AppClassLoader.loadClass(Launcher.java:308)
	at java.lang.ClassLoader.loadClass(ClassLoader.java:357)
	at org.springframework.util.ClassUtils.forName(ClassUtils.java:265)
	at org.springframework.beans.factory.support.AbstractBeanDefinition.resolveBeanClass(AbstractBeanDefinition.java:419)
	at org.springframework.beans.factory.support.AbstractBeanFactory.doResolveBeanClass(AbstractBeanFactory.java:1299)
	at org.springframework.beans.factory.support.AbstractBeanFactory.resolveBeanClass(AbstractBeanFactory.java:1270)
	at org.springframework.beans.factory.support.AbstractAutowireCapableBeanFactory.predictBeanType(AbstractAutowireCapableBeanFactory.java:575)
	at org.springframework.beans.factory.support.AbstractBeanFactory.isFactoryBean(AbstractBeanFactory.java:1347)
	at org.springframework.beans.factory.support.AbstractBeanFactory.isFactoryBean(AbstractBeanFactory.java:913)
	at org.springframework.beans.factory.support.DefaultListableBeanFactory.preInstantiateSingletons(DefaultListableBeanFactory.java:617)
	at org.springframework.context.support.AbstractApplicationContext.finishBeanFactoryInitialization(AbstractApplicationContext.java:934)
	at org.springframework.context.support.AbstractApplicationContext.refresh(AbstractApplicationContext.java:479)
	at org.apache.xbean.spring.context.ResourceXmlApplicationContext.<init>(ResourceXmlApplicationContext.java:64)
	at org.apache.xbean.spring.context.ResourceXmlApplicationContext.<init>(ResourceXmlApplicationContext.java:52)
	at org.apache.activemq.xbean.XBeanBrokerFactory$1.<init>(XBeanBrokerFactory.java:104)
	at org.apache.activemq.xbean.XBeanBrokerFactory.createApplicationContext(XBeanBrokerFactory.java:104)
	at org.apache.activemq.xbean.XBeanBrokerFactory.createBroker(XBeanBrokerFactory.java:67)
	at org.apache.activemq.broker.BrokerFactory.createBroker(BrokerFactory.java:71)
	at org.apache.activemq.broker.BrokerFactory.createBroker(BrokerFactory.java:54)
	at org.apache.activemq.security.SimpleAuthenticationPluginTest.createBroker(SimpleAuthenticationPluginTest.java:71)
	at org.apache.activemq.security.SimpleAuthenticationPluginTest.createBroker(SimpleAuthenticationPluginTest.java:66)

testGuestSendSucceeds {password=password, destination=queue://GUEST.BAR, userName=guest}(org.apache.activemq.security.SimpleAuthenticationPluginTest)
 Time elapsed: 0.086 sec  <<< ERROR!
org.springframework.beans.factory.CannotLoadBeanClassException: Cannot find class [org.jasypt.spring.properties.EncryptablePropertyPlaceholderConfigurer]
for bean with name 'propertyConfigurer' defined in class path resource [org/apache/activemq/security/simple-auth-broker.xml];
nested exception is java.lang.ClassNotFoundException: org.jasypt.spring.properties.EncryptablePropertyPlaceholderConfigurer
	at java.net.URLClassLoader$1.run(URLClassLoader.java:372)
	at java.net.URLClassLoader$1.run(URLClassLoader.java:361)
	at java.security.AccessController.doPrivileged(Native Method)
	at java.net.URLClassLoader.findClass(URLClassLoader.java:360)
	at java.lang.ClassLoader.loadClass(ClassLoader.java:424)
	at sun.misc.Launcher$AppClassLoader.loadClass(Launcher.java:308)
	at java.lang.ClassLoader.loadClass(ClassLoader.java:357)
	at org.springframework.util.ClassUtils.forName(ClassUtils.java:265)
	at org.springframework.beans.factory.support.AbstractBeanDefinition.resolveBeanClass(AbstractBeanDefinition.java:419)
	at org.springframework.beans.factory.support.AbstractBeanFactory.doResolveBeanClass(AbstractBeanFactory.java:1299)
	at org.springframework.beans.factory.support.AbstractBeanFactory.resolveBeanClass(AbstractBeanFactory.java:1270)
	at org.springframework.beans.factory.support.AbstractAutowireCapableBeanFactory.predictBeanType(AbstractAutowireCapableBeanFactory.java:575)
	at org.springframework.beans.factory.support.AbstractBeanFactory.isFactoryBean(AbstractBeanFactory.java:1347)
	at org.springframework.beans.factory.support.AbstractBeanFactory.isFactoryBean(AbstractBeanFactory.java:913)
	at org.springframework.beans.factory.support.DefaultListableBeanFactory.preInstantiateSingletons(DefaultListableBeanFactory.java:617)
	at org.springframework.context.support.AbstractApplicationContext.finishBeanFactoryInitialization(AbstractApplicationContext.java:934)
	at org.springframework.context.support.AbstractApplicationContext.refresh(AbstractApplicationContext.java:479)
	at org.apache.xbean.spring.context.ResourceXmlApplicationContext.<init>(ResourceXmlApplicationContext.java:64)
	at org.apache.xbean.spring.context.ResourceXmlApplicationContext.<init>(ResourceXmlApplicationContext.java:52)
	at org.apache.activemq.xbean.XBeanBrokerFactory$1.<init>(XBeanBrokerFactory.java:104)
	at org.apache.activemq.xbean.XBeanBrokerFactory.createApplicationContext(XBeanBrokerFactory.java:104)
	at org.apache.activemq.xbean.XBeanBrokerFactory.createBroker(XBeanBrokerFactory.java:67)
	at org.apache.activemq.broker.BrokerFactory.createBroker(BrokerFactory.java:71)
	at org.apache.activemq.broker.BrokerFactory.createBroker(BrokerFactory.java:54)
	at org.apache.activemq.security.SimpleAuthenticationPluginTest.createBroker(SimpleAuthenticationPluginTest.java:71)
	at org.apache.activemq.security.SimpleAuthenticationPluginTest.createBroker(SimpleAuthenticationPluginTest.java:66)

testGuestSendSucceeds {destination=topic://GUEST.BAR, password=password, userName=guest}(org.apache.activemq.security.SimpleAuthenticationPluginTest)
 Time elapsed: 0.084 sec  <<< ERROR!
org.springframework.beans.factory.CannotLoadBeanClassException: Cannot find class [org.jasypt.spring.properties.EncryptablePropertyPlaceholderConfigurer]
for bean with name 'propertyConfigurer' defined in class path resource [org/apache/activemq/security/simple-auth-broker.xml];
nested exception is java.lang.ClassNotFoundException: org.jasypt.spring.properties.EncryptablePropertyPlaceholderConfigurer
	at java.net.URLClassLoader$1.run(URLClassLoader.java:372)
	at java.net.URLClassLoader$1.run(URLClassLoader.java:361)
	at java.security.AccessController.doPrivileged(Native Method)
	at java.net.URLClassLoader.findClass(URLClassLoader.java:360)
	at java.lang.ClassLoader.loadClass(ClassLoader.java:424)
	at sun.misc.Launcher$AppClassLoader.loadClass(Launcher.java:308)
	at java.lang.ClassLoader.loadClass(ClassLoader.java:357)
	at org.springframework.util.ClassUtils.forName(ClassUtils.java:265)
	at org.springframework.beans.factory.support.AbstractBeanDefinition.resolveBeanClass(AbstractBeanDefinition.java:419)
	at org.springframework.beans.factory.support.AbstractBeanFactory.doResolveBeanClass(AbstractBeanFactory.java:1299)
	at org.springframework.beans.factory.support.AbstractBeanFactory.resolveBeanClass(AbstractBeanFactory.java:1270)
	at org.springframework.beans.factory.support.AbstractAutowireCapableBeanFactory.predictBeanType(AbstractAutowireCapableBeanFactory.java:575)
	at org.springframework.beans.factory.support.AbstractBeanFactory.isFactoryBean(AbstractBeanFactory.java:1347)
	at org.springframework.beans.factory.support.AbstractBeanFactory.isFactoryBean(AbstractBeanFactory.java:913)
	at org.springframework.beans.factory.support.DefaultListableBeanFactory.preInstantiateSingletons(DefaultListableBeanFactory.java:617)
	at org.springframework.context.support.AbstractApplicationContext.finishBeanFactoryInitialization(AbstractApplicationContext.java:934)
	at org.springframework.context.support.AbstractApplicationContext.refresh(AbstractApplicationContext.java:479)
	at org.apache.xbean.spring.context.ResourceXmlApplicationContext.<init>(ResourceXmlApplicationContext.java:64)
	at org.apache.xbean.spring.context.ResourceXmlApplicationContext.<init>(ResourceXmlApplicationContext.java:52)
	at org.apache.activemq.xbean.XBeanBrokerFactory$1.<init>(XBeanBrokerFactory.java:104)
	at org.apache.activemq.xbean.XBeanBrokerFactory.createApplicationContext(XBeanBrokerFactory.java:104)
	at org.apache.activemq.xbean.XBeanBrokerFactory.createBroker(XBeanBrokerFactory.java:67)
	at org.apache.activemq.broker.BrokerFactory.createBroker(BrokerFactory.java:71)
	at org.apache.activemq.broker.BrokerFactory.createBroker(BrokerFactory.java:54)
	at org.apache.activemq.security.SimpleAuthenticationPluginTest.createBroker(SimpleAuthenticationPluginTest.java:71)
	at org.apache.activemq.security.SimpleAuthenticationPluginTest.createBroker(SimpleAuthenticationPluginTest.java:66)

Running org.apache.activemq.security.SimpleAuthorizationMapTest
Tests run: 5, Failures: 0, Errors: 0, Skipped: 0, Time elapsed: 0.213 sec - in org.apache.activemq.security.SimpleAuthorizationMapTest
Running org.apache.activemq.security.SimpleSecurityBrokerSystemTest
Tests run: 60, Failures: 0, Errors: 0, Skipped: 0, Time elapsed: 19.728 sec - in org.apache.activemq.security.SimpleSecurityBrokerSystemTest
Running org.apache.activemq.security.XBeanSecurityTest
Tests run: 29, Failures: 0, Errors: 0, Skipped: 0, Time elapsed: 14.39 sec - in org.apache.activemq.security.XBeanSecurityTest
Running org.apache.activemq.security.XBeanSecurityWithGuestTest
Tests run: 7, Failures: 0, Errors: 0, Skipped: 0, Time elapsed: 3.011 sec - in org.apache.activemq.security.XBeanSecurityWithGuestTest
Running org.apache.activemq.selector.SelectorParserTest
Tests run: 3, Failures: 0, Errors: 0, Skipped: 0, Time elapsed: 0.232 sec - in org.apache.activemq.selector.SelectorParserTest
Running org.apache.activemq.selector.SelectorTest
Tests run: 21, Failures: 0, Errors: 0, Skipped: 0, Time elapsed: 0.448 sec - in org.apache.activemq.selector.SelectorTest
Running org.apache.activemq.selector.UnknownHandlingSelectorTest
Tests run: 7, Failures: 0, Errors: 0, Skipped: 0, Time elapsed: 0.181 sec - in org.apache.activemq.selector.UnknownHandlingSelectorTest
Running org.apache.activemq.spring.ActiveMQConnectionFactoryFactoryBeanTest
Tests run: 6, Failures: 0, Errors: 0, Skipped: 0, Time elapsed: 0.15 sec - in org.apache.activemq.spring.ActiveMQConnectionFactoryFactoryBeanTest
Running org.apache.activemq.spring.SpringTest
Tests run: 7, Failures: 0, Errors: 0, Skipped: 0, Time elapsed: 14.671 sec - in org.apache.activemq.spring.SpringTest
Running org.apache.activemq.store.LevelDBStorePerDestinationTest
Tests run: 6, Failures: 0, Errors: 0, Skipped: 0, Time elapsed: 271.466 sec - in org.apache.activemq.store.LevelDBStorePerDestinationTest
Running org.apache.activemq.store.SharedFileLockerTest
Tests run: 2, Failures: 0, Errors: 0, Skipped: 0, Time elapsed: 1.329 sec - in org.apache.activemq.store.SharedFileLockerTest
Running org.apache.activemq.store.jdbc.DatabaseLockerConfigTest
Tests run: 4, Failures: 0, Errors: 0, Skipped: 0, Time elapsed: 0.191 sec - in org.apache.activemq.store.jdbc.DatabaseLockerConfigTest
Running org.apache.activemq.store.jdbc.JDBCIOExceptionHandlerMockeryTest
Tests run: 1, Failures: 0, Errors: 0, Skipped: 0, Time elapsed: 1.929 sec - in org.apache.activemq.store.jdbc.JDBCIOExceptionHandlerMockeryTest
Running org.apache.activemq.store.jdbc.JDBCIOExceptionHandlerTest
Tests run: 4, Failures: 0, Errors: 0, Skipped: 0, Time elapsed: 62.448 sec - in org.apache.activemq.store.jdbc.JDBCIOExceptionHandlerTest
Running org.apache.activemq.store.jdbc.JDBCLockTablePrefixTest
Tests run: 1, Failures: 0, Errors: 0, Skipped: 0, Time elapsed: 18.355 sec - in org.apache.activemq.store.jdbc.JDBCLockTablePrefixTest
Running org.apache.activemq.store.jdbc.JDBCStoreAutoCommitTest
Tests run: 3, Failures: 0, Errors: 0, Skipped: 0, Time elapsed: 18.432 sec - in org.apache.activemq.store.jdbc.JDBCStoreAutoCommitTest
Running org.apache.activemq.store.jdbc.JDBCTablePrefixAssignedTest
Tests run: 1, Failures: 0, Errors: 0, Skipped: 0, Time elapsed: 10.055 sec - in org.apache.activemq.store.jdbc.JDBCTablePrefixAssignedTest
Running org.apache.activemq.store.jdbc.LeaseDatabaseLockerTest
Tests run: 5, Failures: 0, Errors: 0, Skipped: 0, Time elapsed: 64.749 sec - in org.apache.activemq.store.jdbc.LeaseDatabaseLockerTest
Running org.apache.activemq.store.kahadb.CustomLockerTest
Tests run: 1, Failures: 0, Errors: 0, Skipped: 0, Time elapsed: 2.012 sec - in org.apache.activemq.store.kahadb.CustomLockerTest
Running org.apache.activemq.store.kahadb.KahaDBIndexLocationTest
Tests run: 2, Failures: 0, Errors: 0, Skipped: 0, Time elapsed: 6.317 sec - in org.apache.activemq.store.kahadb.KahaDBIndexLocationTest
Running org.apache.activemq.store.kahadb.KahaDBPersistenceAdapterTest
Tests run: 2, Failures: 0, Errors: 0, Skipped: 0, Time elapsed: 2.825 sec - in org.apache.activemq.store.kahadb.KahaDBPersistenceAdapterTest
Running org.apache.activemq.store.kahadb.KahaDBStoreBrokerTest
Tests run: 127, Failures: 0, Errors: 0, Skipped: 0, Time elapsed: 139.729 sec - in org.apache.activemq.store.kahadb.KahaDBStoreBrokerTest
Running org.apache.activemq.store.kahadb.KahaDBStoreOrderTest
Tests run: 2, Failures: 0, Errors: 0, Skipped: 0, Time elapsed: 5.865 sec - in org.apache.activemq.store.kahadb.KahaDBStoreOrderTest
Running org.apache.activemq.store.kahadb.NoSpaceIOTest
Tests run: 1, Failures: 0, Errors: 0, Skipped: 1, Time elapsed: 0.058 sec - in org.apache.activemq.store.kahadb.NoSpaceIOTest
Running org.apache.activemq.store.kahadb.PBMesssagesTest
Tests run: 1, Failures: 0, Errors: 0, Skipped: 0, Time elapsed: 0.083 sec - in org.apache.activemq.store.kahadb.PBMesssagesTest
Running org.apache.activemq.store.kahadb.TempKahaDBStoreBrokerTest
Tests run: 127, Failures: 0, Errors: 0, Skipped: 0, Time elapsed: 193.564 sec - in org.apache.activemq.store.kahadb.TempKahaDBStoreBrokerTest
Running org.apache.activemq.store.kahadb.plist.KahaDBFilePendingMessageCursorTest
Tests run: 3, Failures: 0, Errors: 0, Skipped: 0, Time elapsed: 5.184 sec - in org.apache.activemq.store.kahadb.plist.KahaDBFilePendingMessageCursorTest
Running org.apache.activemq.store.leveldb.LevelDBNegativeQueueTest

Results :

Failed tests: 
  BrokerTest>CombinationTestSupport.runBare:107->testQueueBrowserWith2ConsumersInterleaved:271
m2 is null for index: 3
  AMQ2149LevelDBTest>AMQ2149Test.testQueueTransactionalOrderWithRestart:412->AMQ2149Test.doTestTransactionalOrderWithRestart:435->AMQ2149Test.verifyOrderedMessageReceipt:549
No timeout waiting for senders/receivers to complete

Tests in error: 
  KahaDBSchedulerIndexRebuildTest.testIndexRebuildsAfterSomeJobsExpire:144->createBroker:188
? Runtime
  AMQ5567Test>CombinationTestSupport.runBare:107->BrokerTestSupport.setUp:86 ? IO
  AMQ5567Test>CombinationTestSupport.runBare:107->BrokerTestSupport.setUp:86 ? IO
  SimpleAuthenticationPluginNoUsersTest>CombinationTestSupport.runBare:113->CombinationTestSupport.runBare:107->setUp:36->JmsTestSupport.setUp:128->createBroker:41->createBroker:46
? CannotLoadBeanClass
  SimpleAuthenticationPluginSeparatorTest>CombinationTestSupport.runBare:107->SimpleAuthenticationPluginTest.setUp:57->JmsTestSupport.setUp:128->createBroker:37->SimpleAuthenticationPluginTest.createBroker:71
? CannotLoadBeanClass
  SimpleAuthenticationPluginSeparatorTest>CombinationTestSupport.runBare:107->SimpleAuthenticationPluginTest.setUp:57->JmsTestSupport.setUp:128->createBroker:37->SimpleAuthenticationPluginTest.createBroker:71
? CannotLoadBeanClass
  SimpleAuthenticationPluginSeparatorTest>CombinationTestSupport.runBare:107->SimpleAuthenticationPluginTest.setUp:57->JmsTestSupport.setUp:128->createBroker:37->SimpleAuthenticationPluginTest.createBroker:71
? CannotLoadBeanClass
  SimpleAuthenticationPluginSeparatorTest>CombinationTestSupport.runBare:107->SimpleAuthenticationPluginTest.setUp:57->JmsTestSupport.setUp:128->createBroker:37->SimpleAuthenticationPluginTest.createBroker:71
? CannotLoadBeanClass
  SimpleAuthenticationPluginSeparatorTest>CombinationTestSupport.runBare:107->SimpleAuthenticationPluginTest.setUp:57->JmsTestSupport.setUp:128->createBroker:37->SimpleAuthenticationPluginTest.createBroker:71
? CannotLoadBeanClass
  SimpleAuthenticationPluginSeparatorTest>CombinationTestSupport.runBare:107->SimpleAuthenticationPluginTest.setUp:57->JmsTestSupport.setUp:128->createBroker:37->SimpleAuthenticationPluginTest.createBroker:71
? CannotLoadBeanClass
  SimpleAuthenticationPluginSeparatorTest>CombinationTestSupport.runBare:107->SimpleAuthenticationPluginTest.setUp:57->JmsTestSupport.setUp:128->createBroker:37->SimpleAuthenticationPluginTest.createBroker:71
? CannotLoadBeanClass
  SimpleAuthenticationPluginSeparatorTest>CombinationTestSupport.runBare:107->SimpleAuthenticationPluginTest.setUp:57->JmsTestSupport.setUp:128->createBroker:37->SimpleAuthenticationPluginTest.createBroker:71
? CannotLoadBeanClass
  SimpleAuthenticationPluginSeparatorTest>CombinationTestSupport.runBare:107->SimpleAuthenticationPluginTest.setUp:57->JmsTestSupport.setUp:128->createBroker:37->SimpleAuthenticationPluginTest.createBroker:71
? CannotLoadBeanClass
  SimpleAuthenticationPluginSeparatorTest>CombinationTestSupport.runBare:107->SimpleAuthenticationPluginTest.setUp:57->JmsTestSupport.setUp:128->createBroker:37->SimpleAuthenticationPluginTest.createBroker:71
? CannotLoadBeanClass
  SimpleAuthenticationPluginSeparatorTest>CombinationTestSupport.runBare:107->SimpleAuthenticationPluginTest.setUp:57->JmsTestSupport.setUp:128->createBroker:37->SimpleAuthenticationPluginTest.createBroker:71
? CannotLoadBeanClass
  SimpleAuthenticationPluginSeparatorTest>CombinationTestSupport.runBare:107->SimpleAuthenticationPluginTest.setUp:57->JmsTestSupport.setUp:128->createBroker:37->SimpleAuthenticationPluginTest.createBroker:71
? CannotLoadBeanClass
  SimpleAuthenticationPluginSeparatorTest>CombinationTestSupport.runBare:107->SimpleAuthenticationPluginTest.setUp:57->JmsTestSupport.setUp:128->createBroker:37->SimpleAuthenticationPluginTest.createBroker:71
? CannotLoadBeanClass
  SimpleAuthenticationPluginSeparatorTest>CombinationTestSupport.runBare:107->SimpleAuthenticationPluginTest.setUp:57->JmsTestSupport.setUp:128->createBroker:37->SimpleAuthenticationPluginTest.createBroker:71
? CannotLoadBeanClass
  SimpleAuthenticationPluginSeparatorTest>CombinationTestSupport.runBare:107->SimpleAuthenticationPluginTest.setUp:57->JmsTestSupport.setUp:128->createBroker:37->SimpleAuthenticationPluginTest.createBroker:71
? CannotLoadBeanClass
  SimpleAuthenticationPluginSeparatorTest>CombinationTestSupport.runBare:107->SimpleAuthenticationPluginTest.setUp:57->JmsTestSupport.setUp:128->createBroker:37->SimpleAuthenticationPluginTest.createBroker:71
? CannotLoadBeanClass
  SimpleAuthenticationPluginSeparatorTest>CombinationTestSupport.runBare:107->SimpleAuthenticationPluginTest.setUp:57->JmsTestSupport.setUp:128->createBroker:37->SimpleAuthenticationPluginTest.createBroker:71
? CannotLoadBeanClass
  SimpleAuthenticationPluginSeparatorTest>CombinationTestSupport.runBare:107->SimpleAuthenticationPluginTest.setUp:57->JmsTestSupport.setUp:128->createBroker:37->SimpleAuthenticationPluginTest.createBroker:71
? CannotLoadBeanClass
  SimpleAuthenticationPluginSeparatorTest>CombinationTestSupport.runBare:107->SimpleAuthenticationPluginTest.setUp:57->JmsTestSupport.setUp:128->createBroker:37->SimpleAuthenticationPluginTest.createBroker:71
? CannotLoadBeanClass
  SimpleAuthenticationPluginSeparatorTest>CombinationTestSupport.runBare:107->SimpleAuthenticationPluginTest.setUp:57->JmsTestSupport.setUp:128->createBroker:37->SimpleAuthenticationPluginTest.createBroker:71
? CannotLoadBeanClass
  SimpleAuthenticationPluginSeparatorTest>CombinationTestSupport.runBare:107->SimpleAuthenticationPluginTest.setUp:57->JmsTestSupport.setUp:128->createBroker:37->SimpleAuthenticationPluginTest.createBroker:71
? CannotLoadBeanClass
  SimpleAuthenticationPluginSeparatorTest>CombinationTestSupport.runBare:107->SimpleAuthenticationPluginTest.setUp:57->JmsTestSupport.setUp:128->createBroker:37->SimpleAuthenticationPluginTest.createBroker:71
? CannotLoadBeanClass
  SimpleAuthenticationPluginSeparatorTest>CombinationTestSupport.runBare:107->SimpleAuthenticationPluginTest.setUp:57->JmsTestSupport.setUp:128->createBroker:37->SimpleAuthenticationPluginTest.createBroker:71
? CannotLoadBeanClass
  SimpleAuthenticationPluginSeparatorTest>CombinationTestSupport.runBare:107->SimpleAuthenticationPluginTest.setUp:57->JmsTestSupport.setUp:128->createBroker:37->SimpleAuthenticationPluginTest.createBroker:71
? CannotLoadBeanClass
  SimpleAuthenticationPluginSeparatorTest>CombinationTestSupport.runBare:107->SimpleAuthenticationPluginTest.setUp:57->JmsTestSupport.setUp:128->createBroker:37->SimpleAuthenticationPluginTest.createBroker:71
? CannotLoadBeanClass
  SimpleAuthenticationPluginSeparatorTest>CombinationTestSupport.runBare:107->SimpleAuthenticationPluginTest.setUp:57->JmsTestSupport.setUp:128->createBroker:37->SimpleAuthenticationPluginTest.createBroker:71
? CannotLoadBeanClass
  SimpleAuthenticationPluginSeparatorTest>CombinationTestSupport.runBare:107->SimpleAuthenticationPluginTest.setUp:57->JmsTestSupport.setUp:128->createBroker:37->SimpleAuthenticationPluginTest.createBroker:71
? CannotLoadBeanClass
  SimpleAuthenticationPluginSeparatorTest>CombinationTestSupport.runBare:107->SimpleAuthenticationPluginTest.setUp:57->JmsTestSupport.setUp:128->createBroker:37->SimpleAuthenticationPluginTest.createBroker:71
? CannotLoadBeanClass
  SimpleAuthenticationPluginSeparatorTest>CombinationTestSupport.runBare:107->SimpleAuthenticationPluginTest.setUp:57->JmsTestSupport.setUp:128->createBroker:37->SimpleAuthenticationPluginTest.createBroker:71
? CannotLoadBeanClass
  SimpleAuthenticationPluginTest>CombinationTestSupport.runBare:107->setUp:57->JmsTestSupport.setUp:128->createBroker:66->createBroker:71
? CannotLoadBeanClass
  SimpleAuthenticationPluginTest>CombinationTestSupport.runBare:107->setUp:57->JmsTestSupport.setUp:128->createBroker:66->createBroker:71
? CannotLoadBeanClass
  SimpleAuthenticationPluginTest>CombinationTestSupport.runBare:107->setUp:57->JmsTestSupport.setUp:128->createBroker:66->createBroker:71
? CannotLoadBeanClass
  SimpleAuthenticationPluginTest>CombinationTestSupport.runBare:107->setUp:57->JmsTestSupport.setUp:128->createBroker:66->createBroker:71
? CannotLoadBeanClass
  SimpleAuthenticationPluginTest>CombinationTestSupport.runBare:107->setUp:57->JmsTestSupport.setUp:128->createBroker:66->createBroker:71
? CannotLoadBeanClass
  SimpleAuthenticationPluginTest>CombinationTestSupport.runBare:107->setUp:57->JmsTestSupport.setUp:128->createBroker:66->createBroker:71
? CannotLoadBeanClass
  SimpleAuthenticationPluginTest>CombinationTestSupport.runBare:107->setUp:57->JmsTestSupport.setUp:128->createBroker:66->createBroker:71
? CannotLoadBeanClass
  SimpleAuthenticationPluginTest>CombinationTestSupport.runBare:107->setUp:57->JmsTestSupport.setUp:128->createBroker:66->createBroker:71
? CannotLoadBeanClass
  SimpleAuthenticationPluginTest>CombinationTestSupport.runBare:107->setUp:57->JmsTestSupport.setUp:128->createBroker:66->createBroker:71
? CannotLoadBeanClass
  SimpleAuthenticationPluginTest>CombinationTestSupport.runBare:107->setUp:57->JmsTestSupport.setUp:128->createBroker:66->createBroker:71
? CannotLoadBeanClass
  SimpleAuthenticationPluginTest>CombinationTestSupport.runBare:107->setUp:57->JmsTestSupport.setUp:128->createBroker:66->createBroker:71
? CannotLoadBeanClass
  SimpleAuthenticationPluginTest>CombinationTestSupport.runBare:107->setUp:57->JmsTestSupport.setUp:128->createBroker:66->createBroker:71
? CannotLoadBeanClass
  SimpleAuthenticationPluginTest>CombinationTestSupport.runBare:107->setUp:57->JmsTestSupport.setUp:128->createBroker:66->createBroker:71
? CannotLoadBeanClass
  SimpleAuthenticationPluginTest>CombinationTestSupport.runBare:107->setUp:57->JmsTestSupport.setUp:128->createBroker:66->createBroker:71
? CannotLoadBeanClass
  SimpleAuthenticationPluginTest>CombinationTestSupport.runBare:107->setUp:57->JmsTestSupport.setUp:128->createBroker:66->createBroker:71
? CannotLoadBeanClass
  SimpleAuthenticationPluginTest>CombinationTestSupport.runBare:107->setUp:57->JmsTestSupport.setUp:128->createBroker:66->createBroker:71
? CannotLoadBeanClass
  SimpleAuthenticationPluginTest>CombinationTestSupport.runBare:107->setUp:57->JmsTestSupport.setUp:128->createBroker:66->createBroker:71
? CannotLoadBeanClass
  SimpleAuthenticationPluginTest>CombinationTestSupport.runBare:107->setUp:57->JmsTestSupport.setUp:128->createBroker:66->createBroker:71
? CannotLoadBeanClass
  SimpleAuthenticationPluginTest>CombinationTestSupport.runBare:107->setUp:57->JmsTestSupport.setUp:128->createBroker:66->createBroker:71
? CannotLoadBeanClass
  SimpleAuthenticationPluginTest>CombinationTestSupport.runBare:107->setUp:57->JmsTestSupport.setUp:128->createBroker:66->createBroker:71
? CannotLoadBeanClass
  SimpleAuthenticationPluginTest>CombinationTestSupport.runBare:107->setUp:57->JmsTestSupport.setUp:128->createBroker:66->createBroker:71
? CannotLoadBeanClass
  SimpleAuthenticationPluginTest>CombinationTestSupport.runBare:107->setUp:57->JmsTestSupport.setUp:128->createBroker:66->createBroker:71
? CannotLoadBeanClass
  SimpleAuthenticationPluginTest>CombinationTestSupport.runBare:107->setUp:57->JmsTestSupport.setUp:128->createBroker:66->createBroker:71
? CannotLoadBeanClass
  SimpleAuthenticationPluginTest>CombinationTestSupport.runBare:107->setUp:57->JmsTestSupport.setUp:128->createBroker:66->createBroker:71
? CannotLoadBeanClass
  SimpleAuthenticationPluginTest>CombinationTestSupport.runBare:107->setUp:57->JmsTestSupport.setUp:128->createBroker:66->createBroker:71
? CannotLoadBeanClass
  SimpleAuthenticationPluginTest>CombinationTestSupport.runBare:107->setUp:57->JmsTestSupport.setUp:128->createBroker:66->createBroker:71
? CannotLoadBeanClass
  SimpleAuthenticationPluginTest>CombinationTestSupport.runBare:107->setUp:57->JmsTestSupport.setUp:128->createBroker:66->createBroker:71
? CannotLoadBeanClass
  SimpleAuthenticationPluginTest>CombinationTestSupport.runBare:107->setUp:57->JmsTestSupport.setUp:128->createBroker:66->createBroker:71
? CannotLoadBeanClass
  SimpleAuthenticationPluginTest>CombinationTestSupport.runBare:107->setUp:57->JmsTestSupport.setUp:128->createBroker:66->createBroker:71
? CannotLoadBeanClass
  SimpleAuthenticationPluginTest>CombinationTestSupport.runBare:107->setUp:57->JmsTestSupport.setUp:128->createBroker:66->createBroker:71
? CannotLoadBeanClass
  SimpleAuthenticationPluginTest>CombinationTestSupport.runBare:107->setUp:57->JmsTestSupport.setUp:128->createBroker:66->createBroker:71
? CannotLoadBeanClass
  SimpleAuthenticationPluginTest>CombinationTestSupport.runBare:107->setUp:57->JmsTestSupport.setUp:128->createBroker:66->createBroker:71
? CannotLoadBeanClass
  SimpleAuthenticationPluginTest>CombinationTestSupport.runBare:107->setUp:57->JmsTestSupport.setUp:128->createBroker:66->createBroker:71
? CannotLoadBeanClass

Tests run: 2419, Failures: 1, Errors: 65, Skipped: 10

[JENKINS] Recording test results

Mime
View raw message