activemq-commits mailing list archives

Site index · List index
Message view « Date » · « Thread »
Top « Date » · « Thread »
From Apache Jenkins Server <jenk...@builds.apache.org>
Subject Build failed in Jenkins: ActiveMQ-Java7 #622
Date Wed, 04 Mar 2015 13:14:19 GMT
See <https://builds.apache.org/job/ActiveMQ-Java7/622/changes>

Changes:

[gtully] https://issues.apache.org/jira/browse/AMQ-5630 - add rejectDurableConsumers boolen
attribute - when true, requests to create durable subscriptions will fail with a JMSException
- not allowed

[tabish121] https://issues.apache.org/jira/browse/AMQ-5593

[tabish121] https://issues.apache.org/jira/browse/AMQ-5631

[tabish121] https://issues.apache.org/jira/browse/AMQ-5632

[tabish121] https://issues.apache.org/jira/browse/AMQ-5628

[tabish121] https://issues.apache.org/jira/browse/AMQ-5629

[tabish121] https://issues.apache.org/jira/browse/AMQ-5621

------------------------------------------
[...truncated 3178 lines...]
Tests run: 3, Failures: 0, Errors: 0, Skipped: 0, Time elapsed: 16.732 sec - in org.apache.activemq.camel.component.ActiveMQRouteTest
Running org.apache.activemq.camel.component.InvokeRequestReplyUsingJmsReplyToHeaderTest
Tests run: 1, Failures: 0, Errors: 0, Skipped: 0, Time elapsed: 3.516 sec - in org.apache.activemq.camel.component.InvokeRequestReplyUsingJmsReplyToHeaderTest
Running org.apache.activemq.camel.component.broker.BrokerComponentXMLConfigTest
Tests run: 2, Failures: 0, Errors: 0, Skipped: 0, Time elapsed: 6.252 sec - in org.apache.activemq.camel.component.broker.BrokerComponentXMLConfigTest
Running org.apache.activemq.camel.component.ActiveMQReplyToHeaderUsingConverterTest
Tests run: 1, Failures: 0, Errors: 0, Skipped: 0, Time elapsed: 2.549 sec - in org.apache.activemq.camel.component.ActiveMQReplyToHeaderUsingConverterTest
Running org.apache.activemq.camel.component.AutoExposeQueuesInCamelTest
Tests run: 2, Failures: 0, Errors: 0, Skipped: 0, Time elapsed: 6.664 sec - in org.apache.activemq.camel.component.AutoExposeQueuesInCamelTest
Running org.apache.activemq.camel.component.ActiveMQJmsHeaderRouteTest
Tests run: 1, Failures: 0, Errors: 0, Skipped: 0, Time elapsed: 2.533 sec - in org.apache.activemq.camel.component.ActiveMQJmsHeaderRouteTest

Results :

Tests run: 35, Failures: 0, Errors: 0, Skipped: 0

[JENKINS] Recording test results
[INFO] 
[INFO] --- maven-bundle-plugin:2.3.7:bundle (default-bundle) @ activemq-camel ---
[WARNING] Bundle org.apache.activemq:activemq-camel:bundle:5.12-SNAPSHOT : Unknown directive
version: in Export-Package, allowed directives are uses:,mandatory:,include:,exclude:,-import:,
and 'x-*'.
[INFO] 
[INFO] --- maven-site-plugin:3.1:attach-descriptor (attach-descriptor) @ activemq-camel ---
[INFO] 
[INFO] --- ianal-maven-plugin:1.0-alpha-1:verify-legal-files (default) @ activemq-camel ---
[INFO] Checking legal files in: activemq-camel-5.12-SNAPSHOT.jar
[INFO] 
[INFO] --- maven-install-plugin:2.3.1:install (default-install) @ activemq-camel ---
[INFO] Installing <https://builds.apache.org/job/ActiveMQ-Java7/ws/activemq-camel/target/activemq-camel-5.12-SNAPSHOT.jar>
to /home/jenkins/jenkins-slave/maven-repositories/1/org/apache/activemq/activemq-camel/5.12-SNAPSHOT/activemq-camel-5.12-SNAPSHOT.jar
[INFO] Installing <https://builds.apache.org/job/ActiveMQ-Java7/ws/activemq-camel/pom.xml>
to /home/jenkins/jenkins-slave/maven-repositories/1/org/apache/activemq/activemq-camel/5.12-SNAPSHOT/activemq-camel-5.12-SNAPSHOT.pom
[INFO] Installing <https://builds.apache.org/job/ActiveMQ-Java7/ws/activemq-camel/target/generated/camel/components/META-INF/services/org/apache/camel/component.properties>
to /home/jenkins/jenkins-slave/maven-repositories/1/org/apache/activemq/activemq-camel/5.12-SNAPSHOT/activemq-camel-5.12-SNAPSHOT-camelComponent.properties
[INFO] 
[INFO] --- maven-bundle-plugin:2.3.7:install (default-install) @ activemq-camel ---
[INFO] Installing org/apache/activemq/activemq-camel/5.12-SNAPSHOT/activemq-camel-5.12-SNAPSHOT.jar
[INFO] Writing OBR metadata
[INFO] 
[INFO] --- maven-enforcer-plugin:1.0.1:enforce (default) @ activemq-camel ---
[INFO] 
[INFO] --- maven-bundle-plugin:2.3.7:cleanVersions (cleanVersions) @ activemq-camel ---
[WARNING] Failed to getClass for org.apache.maven.plugin.source.SourceJarMojo
[INFO] 
[INFO] --- maven-source-plugin:2.1.2:jar (default-cli) @ activemq-camel ---
[INFO] META-INF already added, skipping
[INFO] META-INF already added, skipping
[INFO] META-INF/NOTICE already added, skipping
[INFO] META-INF/DEPENDENCIES already added, skipping
[INFO] META-INF/LICENSE already added, skipping
[INFO] Building jar: <https://builds.apache.org/job/ActiveMQ-Java7/ws/activemq-camel/target/activemq-camel-5.12-SNAPSHOT-sources.jar>
[INFO] META-INF already added, skipping
[INFO] META-INF already added, skipping
[INFO] META-INF/NOTICE already added, skipping
[INFO] META-INF/DEPENDENCIES already added, skipping
[INFO] META-INF/LICENSE already added, skipping
[INFO]                                                                         
[INFO] ------------------------------------------------------------------------
[INFO] Building ActiveMQ :: HTTP Protocol Support 5.12-SNAPSHOT
[INFO] ------------------------------------------------------------------------
[INFO] 
[INFO] --- maven-clean-plugin:2.5:clean (default-clean) @ activemq-http ---
[INFO] Deleting <https://builds.apache.org/job/ActiveMQ-Java7/ws/activemq-http/target>
[INFO] 
[INFO] --- maven-enforcer-plugin:1.0.1:enforce (default) @ activemq-http ---
[INFO] 
[INFO] --- maven-bundle-plugin:2.3.7:cleanVersions (cleanVersions) @ activemq-http ---
[INFO] 
[INFO] --- maven-remote-resources-plugin:1.3:process (default) @ activemq-http ---
[INFO] 
[INFO] --- maven-resources-plugin:2.5:resources (default-resources) @ activemq-http ---
[debug] execute contextualize
[INFO] Using 'UTF-8' encoding to copy filtered resources.
[INFO] Copying 6 resources
[INFO] Copying 3 resources
[INFO] 
[INFO] --- maven-compiler-plugin:3.1:compile (default-compile) @ activemq-http ---
[INFO] Changes detected - recompiling the module!
[INFO] Compiling 32 source files to <https://builds.apache.org/job/ActiveMQ-Java7/ws/activemq-http/target/classes>
[INFO] 
[INFO] --- maven-bundle-plugin:2.3.7:manifest (bundle-manifest) @ activemq-http ---
[WARNING] Manifest org.apache.activemq:activemq-http:jar:5.12-SNAPSHOT : Superfluous export-package
instructions: [org.apache.activemq.transport.https*]
[WARNING] Manifest org.apache.activemq:activemq-http:jar:5.12-SNAPSHOT : Did not find matching
referal for !org.apache.activemq.transport.util
[WARNING] Manifest org.apache.activemq:activemq-http:jar:5.12-SNAPSHOT : Did not find matching
referal for !org.apache.activemq.transport.ws*
[WARNING] Manifest org.apache.activemq:activemq-http:jar:5.12-SNAPSHOT : Did not find matching
referal for !org.apache.activemq.transport.xstream
[INFO] 
[INFO] --- maven-resources-plugin:2.5:testResources (default-testResources) @ activemq-http
---
[debug] execute contextualize
[INFO] Using 'UTF-8' encoding to copy filtered resources.
[INFO] Copying 9 resources
[INFO] Copying 3 resources
[INFO] 
[INFO] --- maven-compiler-plugin:3.1:testCompile (default-testCompile) @ activemq-http ---
[INFO] Changes detected - recompiling the module!
[INFO] Compiling 26 source files to <https://builds.apache.org/job/ActiveMQ-Java7/ws/activemq-http/target/test-classes>
[INFO] 
[INFO] --- maven-surefire-plugin:2.16:test (default-test) @ activemq-http ---
[INFO] Surefire report directory: <https://builds.apache.org/job/ActiveMQ-Java7/ws/activemq-http/target/surefire-reports>

-------------------------------------------------------
 T E S T S
-------------------------------------------------------

-------------------------------------------------------
 T E S T S
-------------------------------------------------------
Running org.apache.activemq.bugs.AMQ2764Test
Tests run: 2, Failures: 0, Errors: 0, Skipped: 0, Time elapsed: 23.767 sec - in org.apache.activemq.bugs.AMQ2764Test
Running org.apache.activemq.transport.discovery.http.HttpDiscoveryTest
Tests run: 1, Failures: 0, Errors: 0, Skipped: 0, Time elapsed: 1.181 sec - in org.apache.activemq.transport.discovery.http.HttpDiscoveryTest
Running org.apache.activemq.transport.http.HttpJMSMessageTest
Tests run: 32, Failures: 0, Errors: 0, Skipped: 0, Time elapsed: 11.016 sec - in org.apache.activemq.transport.http.HttpJMSMessageTest
Running org.apache.activemq.transport.http.HttpJmsSendAndReceiveWithCompressionTest
Tests run: 1, Failures: 0, Errors: 0, Skipped: 0, Time elapsed: 3.747 sec - in org.apache.activemq.transport.http.HttpJmsSendAndReceiveWithCompressionTest
Running org.apache.activemq.transport.http.HttpJmsSendAndReceiveTest
Tests run: 1, Failures: 0, Errors: 0, Skipped: 0, Time elapsed: 3.645 sec - in org.apache.activemq.transport.http.HttpJmsSendAndReceiveTest
Running org.apache.activemq.transport.http.HttpSendCompressedMessagesTest
Tests run: 8, Failures: 0, Errors: 0, Skipped: 0, Time elapsed: 4.563 sec - in org.apache.activemq.transport.http.HttpSendCompressedMessagesTest
Running org.apache.activemq.transport.http.HttpJMSMessagesWithCompressionTest
Tests run: 5, Failures: 0, Errors: 0, Skipped: 0, Time elapsed: 3.007 sec - in org.apache.activemq.transport.http.HttpJMSMessagesWithCompressionTest
Running org.apache.activemq.transport.http.HttpTransportBrokerTest
Tests run: 129, Failures: 0, Errors: 0, Skipped: 0, Time elapsed: 68.105 sec - in org.apache.activemq.transport.http.HttpTransportBrokerTest
Running org.apache.activemq.transport.ws.WSTransportLinkStealingTest
Tests run: 1, Failures: 0, Errors: 0, Skipped: 0, Time elapsed: 0.872 sec - in org.apache.activemq.transport.ws.WSTransportLinkStealingTest
Running org.apache.activemq.transport.ws.WSTransportTest
Tests run: 3, Failures: 0, Errors: 0, Skipped: 2, Time elapsed: 1.374 sec - in org.apache.activemq.transport.ws.WSTransportTest
Running org.apache.activemq.transport.https.HttpsNeedClientAuthBrokerTest
Tests run: 129, Failures: 0, Errors: 0, Skipped: 0, Time elapsed: 98.067 sec - in org.apache.activemq.transport.https.HttpsNeedClientAuthBrokerTest
Running org.apache.activemq.transport.https.HttpsTransportBrokerTest
Tests run: 129, Failures: 0, Errors: 0, Skipped: 0, Time elapsed: 80.422 sec - in org.apache.activemq.transport.https.HttpsTransportBrokerTest
Running org.apache.activemq.transport.https.HttpsNeedClientAuthSendAndReceiveTest
Tests run: 1, Failures: 0, Errors: 0, Skipped: 0, Time elapsed: 5.953 sec - in org.apache.activemq.transport.https.HttpsNeedClientAuthSendAndReceiveTest
Running org.apache.activemq.transport.https.HttpsJmsSendAndReceiveEmbeddedSslConfigTest
Tests run: 1, Failures: 0, Errors: 0, Skipped: 0, Time elapsed: 2.953 sec - in org.apache.activemq.transport.https.HttpsJmsSendAndReceiveEmbeddedSslConfigTest
Running org.apache.activemq.transport.https.HttpsJmsSendAndReceiveTest
Tests run: 1, Failures: 0, Errors: 0, Skipped: 0, Time elapsed: 4.193 sec - in org.apache.activemq.transport.https.HttpsJmsSendAndReceiveTest
Running org.apache.activemq.transport.https.HttpsWantClientAuthSendAndReceiveTest
Tests run: 1, Failures: 0, Errors: 0, Skipped: 0, Time elapsed: 4.935 sec - in org.apache.activemq.transport.https.HttpsWantClientAuthSendAndReceiveTest
Running org.apache.activemq.transport.https.HttpsJmsSendAndReceiveConfigurationSslConfigTest
Tests run: 1, Failures: 0, Errors: 0, Skipped: 0, Time elapsed: 4.894 sec - in org.apache.activemq.transport.https.HttpsJmsSendAndReceiveConfigurationSslConfigTest
Running org.apache.activemq.transport.xstream.XStreamWireFormatTest
Tests run: 7, Failures: 0, Errors: 0, Skipped: 0, Time elapsed: 0.291 sec - in org.apache.activemq.transport.xstream.XStreamWireFormatTest
Running org.apache.activemq.transport.wss.WSSTransportTest
Tests run: 3, Failures: 0, Errors: 0, Skipped: 2, Time elapsed: 1.489 sec - in org.apache.activemq.transport.wss.WSSTransportTest
Running org.apache.activemq.transport.wss.WSSTransportLinkStealingTest
Tests run: 1, Failures: 0, Errors: 0, Skipped: 0, Time elapsed: 1.082 sec - in org.apache.activemq.transport.wss.WSSTransportLinkStealingTest
Running org.apache.activemq.TwoBrokerTopicSendReceiveUsingHttpTest
Tests run: 1, Failures: 0, Errors: 0, Skipped: 0, Time elapsed: 9.732 sec - in org.apache.activemq.TwoBrokerTopicSendReceiveUsingHttpTest

Results :

Tests run: 458, Failures: 0, Errors: 0, Skipped: 4

[JENKINS] Recording test results
[INFO] 
[INFO] --- maven-jar-plugin:2.4:jar (default-jar) @ activemq-http ---
[INFO] Building jar: <https://builds.apache.org/job/ActiveMQ-Java7/ws/activemq-http/target/activemq-http-5.12-SNAPSHOT.jar>
[INFO] 
[INFO] --- maven-site-plugin:3.1:attach-descriptor (attach-descriptor) @ activemq-http ---
[INFO] 
[INFO] --- ianal-maven-plugin:1.0-alpha-1:verify-legal-files (default) @ activemq-http ---
[INFO] Checking legal files in: activemq-http-5.12-SNAPSHOT.jar
[INFO] 
[INFO] --- maven-install-plugin:2.3.1:install (default-install) @ activemq-http ---
[INFO] Installing <https://builds.apache.org/job/ActiveMQ-Java7/ws/activemq-http/target/activemq-http-5.12-SNAPSHOT.jar>
to /home/jenkins/jenkins-slave/maven-repositories/1/org/apache/activemq/activemq-http/5.12-SNAPSHOT/activemq-http-5.12-SNAPSHOT.jar
[INFO] Installing <https://builds.apache.org/job/ActiveMQ-Java7/ws/activemq-http/pom.xml>
to /home/jenkins/jenkins-slave/maven-repositories/1/org/apache/activemq/activemq-http/5.12-SNAPSHOT/activemq-http-5.12-SNAPSHOT.pom
[INFO] 
[INFO] --- maven-enforcer-plugin:1.0.1:enforce (default) @ activemq-http ---
[INFO] 
[INFO] --- maven-bundle-plugin:2.3.7:cleanVersions (cleanVersions) @ activemq-http ---
[WARNING] Failed to getClass for org.apache.maven.plugin.source.SourceJarMojo
[INFO] 
[INFO] --- maven-source-plugin:2.1.2:jar (default-cli) @ activemq-http ---
[INFO] META-INF already added, skipping
[INFO] META-INF already added, skipping
[INFO] META-INF/NOTICE already added, skipping
[INFO] META-INF/DEPENDENCIES already added, skipping
[INFO] META-INF/LICENSE already added, skipping
[INFO] Building jar: <https://builds.apache.org/job/ActiveMQ-Java7/ws/activemq-http/target/activemq-http-5.12-SNAPSHOT-sources.jar>
[INFO] META-INF already added, skipping
[INFO] META-INF already added, skipping
[INFO] META-INF/NOTICE already added, skipping
[INFO] META-INF/DEPENDENCIES already added, skipping
[INFO] META-INF/LICENSE already added, skipping
Build timed out (after 575 minutes). Marking the build as aborted.
Sending e-mails to: commits@activemq.apache.org
Sending e-mails to: commits@activemq.apache.org
[locks-and-latches] Releasing all the locks
[locks-and-latches] All the locks released
ERROR: Failed to parse POMs
hudson.remoting.ChannelClosedException: channel is already closed
	at hudson.remoting.Channel.send(Channel.java:540)
	at hudson.remoting.ProxyOutputStream._write(ProxyOutputStream.java:163)
	at hudson.remoting.ProxyOutputStream.write(ProxyOutputStream.java:109)
	at hudson.remoting.RemoteOutputStream.write(RemoteOutputStream.java:110)
	at java.io.BufferedOutputStream.flushBuffer(BufferedOutputStream.java:82)
	at java.io.BufferedOutputStream.write(BufferedOutputStream.java:126)
	at java.io.FilterOutputStream.write(FilterOutputStream.java:97)
	at hudson.remoting.ChunkedOutputStream.sendFrame(ChunkedOutputStream.java:93)
	at hudson.remoting.ChunkedOutputStream.drain(ChunkedOutputStream.java:89)
	at hudson.remoting.ChunkedOutputStream.write(ChunkedOutputStream.java:58)
	at java.io.OutputStream.write(OutputStream.java:75)
	at hudson.remoting.ChunkedCommandTransport.writeBlock(ChunkedCommandTransport.java:39)
	at hudson.remoting.AbstractSynchronousByteArrayCommandTransport.write(AbstractSynchronousByteArrayCommandTransport.java:45)
	at hudson.remoting.Channel.send(Channel.java:544)
	at hudson.remoting.Request.call(Request.java:186)
	at hudson.remoting.Channel.call(Channel.java:742)
	at hudson.maven.ProcessCache$MavenProcess.call(ProcessCache.java:161)
	at hudson.maven.MavenModuleSetBuild$MavenModuleSetBuildExecution.doRun(MavenModuleSetBuild.java:840)
	at hudson.model.AbstractBuild$AbstractBuildExecution.run(AbstractBuild.java:529)
	at hudson.model.Run.execute(Run.java:1706)
	at hudson.maven.MavenModuleSetBuild.run(MavenModuleSetBuild.java:529)
	at hudson.model.ResourceController.execute(ResourceController.java:88)
	at hudson.model.Executor.run(Executor.java:232)
Caused by: hudson.remoting.Channel$OrderlyShutdown: java.util.concurrent.TimeoutException:
Ping started on 1425461204478 hasn't completed at 1425461444479
	at hudson.remoting.Channel$CloseCommand.execute(Channel.java:954)
	at hudson.remoting.Channel$2.handle(Channel.java:474)
	at hudson.remoting.SynchronousCommandTransport$ReaderThread.run(SynchronousCommandTransport.java:60)
Caused by: Command close created at
	at hudson.remoting.Command.<init>(Command.java:56)
	at hudson.remoting.Channel$CloseCommand.<init>(Channel.java:948)
	at hudson.remoting.Channel$CloseCommand.<init>(Channel.java:946)
	at hudson.remoting.Channel.close(Channel.java:1029)
	at hudson.slaves.ChannelPinger$1.onDead(ChannelPinger.java:110)
	at hudson.remoting.PingThread.ping(PingThread.java:120)
	at hudson.remoting.PingThread.run(PingThread.java:81)
Caused by: java.util.concurrent.TimeoutException: Ping started on 1425461204478 hasn't completed
at 1425461444479
	... 2 more
FATAL: channel is already closed
hudson.remoting.ChannelClosedException: channel is already closed
	at hudson.remoting.Channel.send(Channel.java:540)
	at hudson.remoting.Request.call(Request.java:129)
	at hudson.remoting.Channel.call(Channel.java:742)
	at hudson.Launcher$RemoteLauncher.kill(Launcher.java:918)
	at hudson.model.AbstractBuild$AbstractBuildExecution.run(AbstractBuild.java:552)
	at hudson.model.Run.execute(Run.java:1706)
	at hudson.maven.MavenModuleSetBuild.run(MavenModuleSetBuild.java:529)
	at hudson.model.ResourceController.execute(ResourceController.java:88)
	at hudson.model.Executor.run(Executor.java:232)
Caused by: hudson.remoting.Channel$OrderlyShutdown: java.util.concurrent.TimeoutException:
Ping started on 1425461204478 hasn't completed at 1425461444479
	at hudson.remoting.Channel$CloseCommand.execute(Channel.java:954)
	at hudson.remoting.Channel$2.handle(Channel.java:474)
	at hudson.remoting.SynchronousCommandTransport$ReaderThread.run(SynchronousCommandTransport.java:60)
Caused by: Command close created at
	at hudson.remoting.Command.<init>(Command.java:56)
	at hudson.remoting.Channel$CloseCommand.<init>(Channel.java:948)
	at hudson.remoting.Channel$CloseCommand.<init>(Channel.java:946)
	at hudson.remoting.Channel.close(Channel.java:1029)
	at hudson.slaves.ChannelPinger$1.onDead(ChannelPinger.java:110)
	at hudson.remoting.PingThread.ping(PingThread.java:120)
	at hudson.remoting.PingThread.run(PingThread.java:81)
Caused by: java.util.concurrent.TimeoutException: Ping started on 1425461204478 hasn't completed
at 1425461444479
	... 2 more

Mime
View raw message