activemq-commits mailing list archives

Site index · List index
Message view « Date » · « Thread »
Top « Date » · « Thread »
From Apache Jenkins Server <jenk...@builds.apache.org>
Subject Build failed in Jenkins: ActiveMQ-Java7-All-UnitTests #27
Date Mon, 16 Feb 2015 16:47:59 GMT
See <https://builds.apache.org/job/ActiveMQ-Java7-All-UnitTests/27/>

------------------------------------------
[...truncated 3323 lines...]
Running org.apache.activemq.security.XBeanSecurityTest
Tests run: 29, Failures: 0, Errors: 0, Skipped: 0, Time elapsed: 13.085 sec - in org.apache.activemq.security.XBeanSecurityTest
Running org.apache.activemq.security.XBeanSecurityWithGuestNoCredentialsOnlyTest
Tests run: 5, Failures: 0, Errors: 0, Skipped: 0, Time elapsed: 2.579 sec - in org.apache.activemq.security.XBeanSecurityWithGuestNoCredentialsOnlyTest
Running org.apache.activemq.security.XBeanSecurityWithGuestTest
Tests run: 7, Failures: 0, Errors: 0, Skipped: 0, Time elapsed: 2.862 sec - in org.apache.activemq.security.XBeanSecurityWithGuestTest
Running org.apache.activemq.security.XBeanSslContextTest
Tests run: 1, Failures: 0, Errors: 0, Skipped: 0, Time elapsed: 2.213 sec - in org.apache.activemq.security.XBeanSslContextTest
Running org.apache.activemq.selector.SelectorParserTest
Tests run: 3, Failures: 0, Errors: 0, Skipped: 0, Time elapsed: 0.223 sec - in org.apache.activemq.selector.SelectorParserTest
Running org.apache.activemq.selector.SelectorTest
Tests run: 21, Failures: 0, Errors: 0, Skipped: 0, Time elapsed: 0.48 sec - in org.apache.activemq.selector.SelectorTest
Running org.apache.activemq.selector.UnknownHandlingSelectorTest
Tests run: 7, Failures: 0, Errors: 0, Skipped: 0, Time elapsed: 0.175 sec - in org.apache.activemq.selector.UnknownHandlingSelectorTest
Running org.apache.activemq.spring.ActiveMQConnectionFactoryFactoryBeanTest
Tests run: 6, Failures: 0, Errors: 0, Skipped: 0, Time elapsed: 0.214 sec - in org.apache.activemq.spring.ActiveMQConnectionFactoryFactoryBeanTest
Running org.apache.activemq.spring.Spring2XmlNamespacesTest
Tests run: 1, Failures: 0, Errors: 0, Skipped: 0, Time elapsed: 3.853 sec - in org.apache.activemq.spring.Spring2XmlNamespacesTest
Running org.apache.activemq.spring.Spring2XmlNamespacesWithoutRemoteSchemaTest
Tests run: 1, Failures: 0, Errors: 0, Skipped: 0, Time elapsed: 2.86 sec - in org.apache.activemq.spring.Spring2XmlNamespacesWithoutRemoteSchemaTest
Running org.apache.activemq.spring.SpringTest
Tests run: 7, Failures: 0, Errors: 0, Skipped: 0, Time elapsed: 11.567 sec - in org.apache.activemq.spring.SpringTest
Running org.apache.activemq.store.AutoStorePerDestinationTest
Tests run: 6, Failures: 0, Errors: 0, Skipped: 0, Time elapsed: 34.323 sec - in org.apache.activemq.store.AutoStorePerDestinationTest
Running org.apache.activemq.store.LevelDBStorePerDestinationTest
Tests run: 6, Failures: 0, Errors: 0, Skipped: 0, Time elapsed: 27.087 sec - in org.apache.activemq.store.LevelDBStorePerDestinationTest
Running org.apache.activemq.store.StorePerDestinationTest
Tests run: 6, Failures: 0, Errors: 0, Skipped: 0, Time elapsed: 33.412 sec - in org.apache.activemq.store.StorePerDestinationTest
Running org.apache.activemq.store.jdbc.DatabaseLockerConfigTest
Tests run: 4, Failures: 0, Errors: 0, Skipped: 0, Time elapsed: 0.184 sec - in org.apache.activemq.store.jdbc.DatabaseLockerConfigTest
Running org.apache.activemq.store.jdbc.JDBCCommitExceptionTest
Tests run: 1, Failures: 0, Errors: 0, Skipped: 0, Time elapsed: 3.344 sec - in org.apache.activemq.store.jdbc.JDBCCommitExceptionTest
Running org.apache.activemq.store.jdbc.JDBCIOExceptionHandlerMockeryTest
Tests run: 1, Failures: 0, Errors: 0, Skipped: 0, Time elapsed: 1.848 sec - in org.apache.activemq.store.jdbc.JDBCIOExceptionHandlerMockeryTest
Running org.apache.activemq.store.jdbc.JDBCIOExceptionHandlerTest
Tests run: 4, Failures: 0, Errors: 0, Skipped: 0, Time elapsed: 23.694 sec - in org.apache.activemq.store.jdbc.JDBCIOExceptionHandlerTest
Running org.apache.activemq.store.jdbc.JDBCLockTablePrefixTest
Tests run: 1, Failures: 0, Errors: 0, Skipped: 0, Time elapsed: 3.098 sec - in org.apache.activemq.store.jdbc.JDBCLockTablePrefixTest
Running org.apache.activemq.store.jdbc.JDBCMessagePriorityTest
Tests run: 24, Failures: 0, Errors: 0, Skipped: 0, Time elapsed: 212.747 sec - in org.apache.activemq.store.jdbc.JDBCMessagePriorityTest
Running org.apache.activemq.store.jdbc.JDBCNegativeQueueTest
Tests run: 4, Failures: 0, Errors: 0, Skipped: 0, Time elapsed: 182.15 sec - in org.apache.activemq.store.jdbc.JDBCNegativeQueueTest
Running org.apache.activemq.store.jdbc.JDBCNetworkBrokerDetachTest
Tests run: 2, Failures: 0, Errors: 0, Skipped: 0, Time elapsed: 14.097 sec - in org.apache.activemq.store.jdbc.JDBCNetworkBrokerDetachTest
Running org.apache.activemq.store.jdbc.JDBCPersistenceAdapterTest
Tests run: 3, Failures: 0, Errors: 0, Skipped: 0, Time elapsed: 3.403 sec - in org.apache.activemq.store.jdbc.JDBCPersistenceAdapterTest
Running org.apache.activemq.store.jdbc.JDBCStoreAutoCommitTest
Tests run: 3, Failures: 0, Errors: 0, Skipped: 0, Time elapsed: 2.924 sec - in org.apache.activemq.store.jdbc.JDBCStoreAutoCommitTest
Running org.apache.activemq.store.jdbc.JDBCStoreBrokerTest
Tests run: 129, Failures: 0, Errors: 0, Skipped: 0, Time elapsed: 44.183 sec - in org.apache.activemq.store.jdbc.JDBCStoreBrokerTest
Running org.apache.activemq.store.jdbc.JDBCStoreOrderTest
Tests run: 2, Failures: 0, Errors: 0, Skipped: 0, Time elapsed: 6.153 sec - in org.apache.activemq.store.jdbc.JDBCStoreOrderTest
Running org.apache.activemq.store.jdbc.JDBCTablePrefixAssignedTest
Tests run: 1, Failures: 0, Errors: 0, Skipped: 0, Time elapsed: 2.794 sec - in org.apache.activemq.store.jdbc.JDBCTablePrefixAssignedTest
Running org.apache.activemq.store.jdbc.JDBCXACommitExceptionTest
Tests run: 2, Failures: 0, Errors: 0, Skipped: 0, Time elapsed: 3.894 sec - in org.apache.activemq.store.jdbc.JDBCXACommitExceptionTest
Running org.apache.activemq.store.jdbc.LeaseDatabaseLockerTest
Tests run: 5, Failures: 0, Errors: 0, Skipped: 0, Time elapsed: 49.739 sec - in org.apache.activemq.store.jdbc.LeaseDatabaseLockerTest
Running org.apache.activemq.store.kahadb.CustomLockerTest
Tests run: 1, Failures: 0, Errors: 0, Skipped: 0, Time elapsed: 2.138 sec - in org.apache.activemq.store.kahadb.CustomLockerTest
Running org.apache.activemq.store.kahadb.KahaDBFastEnqueueTest
Tests run: 3, Failures: 0, Errors: 0, Skipped: 0, Time elapsed: 13.125 sec - in org.apache.activemq.store.kahadb.KahaDBFastEnqueueTest
Running org.apache.activemq.store.kahadb.KahaDBIndexLocationTest
Tests run: 2, Failures: 0, Errors: 0, Skipped: 0, Time elapsed: 5.227 sec - in org.apache.activemq.store.kahadb.KahaDBIndexLocationTest
Running org.apache.activemq.store.kahadb.KahaDBMessagePriorityTest

Results :

Failed tests: 
  DuplexNetworkMBeanTest.testMbeanPresenceOnBrokerRestart:94 expected:<1> but was:<0>
  NetworkRestartTest>CombinationTestSupport.runBare:113->CombinationTestSupport.runBare:107->testConnectorReAdd:84
null

Tests in error: 
  KahaDBSchedulerIndexRebuildTest.testIndexRebuildsAfterSomeJobsExpire:144->createBroker:188
» Runtime
  AMQ2580Test>CombinationTestSupport.runBare:107->setUp:59->initDurableBroker:186->TestSupport.setDefaultPersistenceAdapter:179->TestSupport.setPersistenceAdapter:201
» NullPointer

Tests run: 3359, Failures: 2, Errors: 1, Skipped: 10

[JENKINS] Recording test results
[INFO] ------------------------------------------------------------------------
[INFO] Reactor Summary:
[INFO] 
[INFO] ActiveMQ .......................................... SUCCESS [3.751s]
[INFO] ActiveMQ :: Client ................................ SUCCESS [2:14.241s]
[INFO] ActiveMQ :: Openwire Legacy Support ............... SUCCESS [2.820s]
[INFO] ActiveMQ :: JAAS .................................. SUCCESS [33.150s]
[INFO] ActiveMQ :: Broker ................................ SUCCESS [1:20.813s]
[INFO] ActiveMQ :: KahaDB Store .......................... SUCCESS [1:37.583s]
[INFO] ActiveMQ :: STOMP Protocol ........................ SUCCESS [17:34.361s]
[INFO] ActiveMQ :: MQTT Protocol ......................... SUCCESS [12:58.671s]
[INFO] ActiveMQ :: JDBC Store ............................ SUCCESS [1.655s]
[INFO] ActiveMQ :: LevelDB Store ......................... SUCCESS [3:18.452s]
[INFO] ActiveMQ :: Generic JMS Pool ...................... SUCCESS [1:29.839s]
[INFO] ActiveMQ :: Pool .................................. SUCCESS [3.280s]
[INFO] ActiveMQ :: RA .................................... SUCCESS [2:24.431s]
[INFO] ActiveMQ :: Spring ................................ SUCCESS [1:03.232s]
[INFO] ActiveMQ :: AMQP .................................. SUCCESS [10:26.283s]
[INFO] ActiveMQ :: Console ............................... SUCCESS [2.531s]
[INFO] ActiveMQ :: Partition Management .................. SUCCESS [18.834s]
[INFO] ActiveMQ :: Unit Tests ............................ FAILURE [3:44:30.888s]
[INFO] ------------------------------------------------------------------------
[INFO] BUILD FAILURE
[INFO] ------------------------------------------------------------------------
[INFO] Total time: 4:40:28.372s
[INFO] Finished at: Mon Feb 16 16:47:42 UTC 2015
[INFO] Final Memory: 109M/1019M
[INFO] ------------------------------------------------------------------------
Waiting for Jenkins to finish collecting data
[ERROR] Failed to execute goal org.apache.maven.plugins:maven-surefire-plugin:2.16:test (default-test)
on project activemq-unit-tests: ExecutionException; nested exception is java.util.concurrent.ExecutionException:
java.lang.RuntimeException: The forked VM terminated without saying properly goodbye. VM crash
or System.exit called ?
[ERROR] Command was/bin/sh -c cd <https://builds.apache.org/job/ActiveMQ-Java7-All-UnitTests/ws/activemq-unit-tests>
&& /home/jenkins/tools/java/jdk1.7.0_25-32/jre/bin/java -Xmx512m -jar <https://builds.apache.org/job/ActiveMQ-Java7-All-UnitTests/ws/activemq-unit-tests/target/surefire/surefirebooter3919823989713014946.jar>
<https://builds.apache.org/job/ActiveMQ-Java7-All-UnitTests/ws/activemq-unit-tests/target/surefire/surefire3155813144021998190tmp>
<https://builds.apache.org/job/ActiveMQ-Java7-All-UnitTests/ws/activemq-unit-tests/target/surefire/surefire_444959115178403501351tmp>
[ERROR] -> [Help 1]
org.apache.maven.lifecycle.LifecycleExecutionException: Failed to execute goal org.apache.maven.plugins:maven-surefire-plugin:2.16:test
(default-test) on project activemq-unit-tests: ExecutionException; nested exception is java.util.concurrent.ExecutionException:
java.lang.RuntimeException: The forked VM terminated without saying properly goodbye. VM crash
or System.exit called ?
Command was/bin/sh -c cd <https://builds.apache.org/job/ActiveMQ-Java7-All-UnitTests/ws/activemq-unit-tests>
&& /home/jenkins/tools/java/jdk1.7.0_25-32/jre/bin/java -Xmx512m -jar <https://builds.apache.org/job/ActiveMQ-Java7-All-UnitTests/ws/activemq-unit-tests/target/surefire/surefirebooter3919823989713014946.jar>
<https://builds.apache.org/job/ActiveMQ-Java7-All-UnitTests/ws/activemq-unit-tests/target/surefire/surefire3155813144021998190tmp>
<https://builds.apache.org/job/ActiveMQ-Java7-All-UnitTests/ws/activemq-unit-tests/target/surefire/surefire_444959115178403501351tmp>
	at org.apache.maven.lifecycle.internal.MojoExecutor.execute(MojoExecutor.java:213)
	at org.apache.maven.lifecycle.internal.MojoExecutor.execute(MojoExecutor.java:153)
	at org.apache.maven.lifecycle.internal.MojoExecutor.execute(MojoExecutor.java:145)
	at org.apache.maven.lifecycle.internal.LifecycleModuleBuilder.buildProject(LifecycleModuleBuilder.java:84)
	at org.apache.maven.lifecycle.internal.LifecycleModuleBuilder.buildProject(LifecycleModuleBuilder.java:59)
	at org.apache.maven.lifecycle.internal.LifecycleStarter.singleThreadedBuild(LifecycleStarter.java:183)
	at org.apache.maven.lifecycle.internal.LifecycleStarter.execute(LifecycleStarter.java:161)
	at org.apache.maven.DefaultMaven.doExecute(DefaultMaven.java:320)
	at org.apache.maven.DefaultMaven.execute(DefaultMaven.java:156)
	at org.jvnet.hudson.maven3.launcher.Maven3Launcher.main(Maven3Launcher.java:117)
	at sun.reflect.NativeMethodAccessorImpl.invoke0(Native Method)
	at sun.reflect.NativeMethodAccessorImpl.invoke(NativeMethodAccessorImpl.java:57)
	at sun.reflect.DelegatingMethodAccessorImpl.invoke(DelegatingMethodAccessorImpl.java:43)
	at java.lang.reflect.Method.invoke(Method.java:606)
	at org.codehaus.plexus.classworlds.launcher.Launcher.launchStandard(Launcher.java:329)
	at org.codehaus.plexus.classworlds.launcher.Launcher.launch(Launcher.java:239)
	at org.jvnet.hudson.maven3.agent.Maven3Main.launch(Maven3Main.java:178)
	at sun.reflect.NativeMethodAccessorImpl.invoke0(Native Method)
	at sun.reflect.NativeMethodAccessorImpl.invoke(NativeMethodAccessorImpl.java:57)
	at sun.reflect.DelegatingMethodAccessorImpl.invoke(DelegatingMethodAccessorImpl.java:43)
	at java.lang.reflect.Method.invoke(Method.java:606)
	at hudson.maven.Maven3Builder.call(Maven3Builder.java:136)
	at hudson.maven.Maven3Builder.call(Maven3Builder.java:71)
	at hudson.remoting.UserRequest.perform(UserRequest.java:118)
	at hudson.remoting.UserRequest.perform(UserRequest.java:48)
	at hudson.remoting.Request$2.run(Request.java:328)
	at hudson.remoting.InterceptingExecutorService$1.call(InterceptingExecutorService.java:72)
	at java.util.concurrent.FutureTask$Sync.innerRun(FutureTask.java:334)
	at java.util.concurrent.FutureTask.run(FutureTask.java:166)
	at java.util.concurrent.ThreadPoolExecutor.runWorker(ThreadPoolExecutor.java:1145)
	at java.util.concurrent.ThreadPoolExecutor$Worker.run(ThreadPoolExecutor.java:615)
	at java.lang.Thread.run(Thread.java:724)
Caused by: org.apache.maven.plugin.MojoFailureException: ExecutionException; nested exception
is java.util.concurrent.ExecutionException: java.lang.RuntimeException: The forked VM terminated
without saying properly goodbye. VM crash or System.exit called ?
Command was/bin/sh -c cd <https://builds.apache.org/job/ActiveMQ-Java7-All-UnitTests/ws/activemq-unit-tests>
&& /home/jenkins/tools/java/jdk1.7.0_25-32/jre/bin/java -Xmx512m -jar <https://builds.apache.org/job/ActiveMQ-Java7-All-UnitTests/ws/activemq-unit-tests/target/surefire/surefirebooter3919823989713014946.jar>
<https://builds.apache.org/job/ActiveMQ-Java7-All-UnitTests/ws/activemq-unit-tests/target/surefire/surefire3155813144021998190tmp>
<https://builds.apache.org/job/ActiveMQ-Java7-All-UnitTests/ws/activemq-unit-tests/target/surefire/surefire_444959115178403501351tmp>
	at org.apache.maven.plugin.surefire.SurefirePlugin.assertNoException(SurefirePlugin.java:198)
	at org.apache.maven.plugin.surefire.SurefirePlugin.handleSummary(SurefirePlugin.java:188)
	at org.apache.maven.plugin.surefire.AbstractSurefireMojo.executeAfterPreconditionsChecked(AbstractSurefireMojo.java:852)
	at org.apache.maven.plugin.surefire.AbstractSurefireMojo.execute(AbstractSurefireMojo.java:720)
	at org.apache.maven.plugin.DefaultBuildPluginManager.executeMojo(DefaultBuildPluginManager.java:101)
	at org.apache.maven.lifecycle.internal.MojoExecutor.execute(MojoExecutor.java:209)
	... 31 more
Caused by: org.apache.maven.surefire.booter.SurefireBooterForkException: ExecutionException;
nested exception is java.util.concurrent.ExecutionException: java.lang.RuntimeException: The
forked VM terminated without saying properly goodbye. VM crash or System.exit called ?
Command was/bin/sh -c cd <https://builds.apache.org/job/ActiveMQ-Java7-All-UnitTests/ws/activemq-unit-tests>
&& /home/jenkins/tools/java/jdk1.7.0_25-32/jre/bin/java -Xmx512m -jar <https://builds.apache.org/job/ActiveMQ-Java7-All-UnitTests/ws/activemq-unit-tests/target/surefire/surefirebooter3919823989713014946.jar>
<https://builds.apache.org/job/ActiveMQ-Java7-All-UnitTests/ws/activemq-unit-tests/target/surefire/surefire3155813144021998190tmp>
<https://builds.apache.org/job/ActiveMQ-Java7-All-UnitTests/ws/activemq-unit-tests/target/surefire/surefire_444959115178403501351tmp>
	at org.apache.maven.plugin.surefire.booterclient.ForkStarter.runSuitesForkPerTestSet(ForkStarter.java:316)
	at org.apache.maven.plugin.surefire.booterclient.ForkStarter.run(ForkStarter.java:169)
	at org.apache.maven.plugin.surefire.AbstractSurefireMojo.executeProvider(AbstractSurefireMojo.java:958)
	at org.apache.maven.plugin.surefire.AbstractSurefireMojo.executeAfterPreconditionsChecked(AbstractSurefireMojo.java:822)
	... 34 more
Caused by: java.util.concurrent.ExecutionException: java.lang.RuntimeException: The forked
VM terminated without saying properly goodbye. VM crash or System.exit called ?
Command was/bin/sh -c cd <https://builds.apache.org/job/ActiveMQ-Java7-All-UnitTests/ws/activemq-unit-tests>
&& /home/jenkins/tools/java/jdk1.7.0_25-32/jre/bin/java -Xmx512m -jar <https://builds.apache.org/job/ActiveMQ-Java7-All-UnitTests/ws/activemq-unit-tests/target/surefire/surefirebooter3919823989713014946.jar>
<https://builds.apache.org/job/ActiveMQ-Java7-All-UnitTests/ws/activemq-unit-tests/target/surefire/surefire3155813144021998190tmp>
<https://builds.apache.org/job/ActiveMQ-Java7-All-UnitTests/ws/activemq-unit-tests/target/surefire/surefire_444959115178403501351tmp>
	at java.util.concurrent.FutureTask$Sync.innerGet(FutureTask.java:252)
	at java.util.concurrent.FutureTask.get(FutureTask.java:111)
	at org.apache.maven.plugin.surefire.booterclient.ForkStarter.runSuitesForkPerTestSet(ForkStarter.java:300)
	... 37 more
Caused by: java.lang.RuntimeException: The forked VM terminated without saying properly goodbye.
VM crash or System.exit called ?
Command was/bin/sh -c cd <https://builds.apache.org/job/ActiveMQ-Java7-All-UnitTests/ws/activemq-unit-tests>
&& /home/jenkins/tools/java/jdk1.7.0_25-32/jre/bin/java -Xmx512m -jar <https://builds.apache.org/job/ActiveMQ-Java7-All-UnitTests/ws/activemq-unit-tests/target/surefire/surefirebooter3919823989713014946.jar>
<https://builds.apache.org/job/ActiveMQ-Java7-All-UnitTests/ws/activemq-unit-tests/target/surefire/surefire3155813144021998190tmp>
<https://builds.apache.org/job/ActiveMQ-Java7-All-UnitTests/ws/activemq-unit-tests/target/surefire/surefire_444959115178403501351tmp>
	at org.apache.maven.plugin.surefire.booterclient.ForkStarter.fork(ForkStarter.java:485)
	at org.apache.maven.plugin.surefire.booterclient.ForkStarter.fork(ForkStarter.java:352)
	at org.apache.maven.plugin.surefire.booterclient.ForkStarter.access$300(ForkStarter.java:85)
	at org.apache.maven.plugin.surefire.booterclient.ForkStarter$2.call(ForkStarter.java:288)
	at org.apache.maven.plugin.surefire.booterclient.ForkStarter$2.call(ForkStarter.java:283)
	... 5 more
[ERROR] 
[ERROR] Re-run Maven using the -X switch to enable full debug logging.
[ERROR] 
[ERROR] For more information about the errors and possible solutions, please read the following
articles:
[ERROR] [Help 1] http://cwiki.apache.org/confluence/display/MAVEN/MojoFailureException
[ERROR] 
[ERROR] After correcting the problems, you can resume the build with the command
[ERROR]   mvn <goals> -rf :activemq-unit-tests
[JENKINS] Archiving <https://builds.apache.org/job/ActiveMQ-Java7-All-UnitTests/ws/activemq-unit-tests/pom.xml>
to org.apache.activemq/activemq-unit-tests/5.12-SNAPSHOT/activemq-unit-tests-5.12-SNAPSHOT.pom
Sending artifact delta relative to ActiveMQ-Java7-All-UnitTests » ActiveMQ :: Unit Tests
#25
Archived 1 artifacts
Archive block size is 32768
Received 1 blocks and 37642 bytes
Compression is 46.5%
Took 0.31 sec
[JENKINS] Archiving <https://builds.apache.org/job/ActiveMQ-Java7-All-UnitTests/ws/activemq-openwire-legacy/pom.xml>
to org.apache.activemq/activemq-openwire-legacy/5.12-SNAPSHOT/activemq-openwire-legacy-5.12-SNAPSHOT.pom
[JENKINS] Archiving <https://builds.apache.org/job/ActiveMQ-Java7-All-UnitTests/ws/activemq-openwire-legacy/target/activemq-openwire-legacy-5.12-SNAPSHOT.jar>
to org.apache.activemq/activemq-openwire-legacy/5.12-SNAPSHOT/activemq-openwire-legacy-5.12-SNAPSHOT.jar
No artifacts from ActiveMQ-Java7-All-UnitTests » ActiveMQ :: Openwire Legacy Support #26
to compare, so performing full copy of artifacts
[JENKINS] Archiving <https://builds.apache.org/job/ActiveMQ-Java7-All-UnitTests/ws/activemq-jdbc-store/pom.xml>
to org.apache.activemq/activemq-jdbc-store/5.12-SNAPSHOT/activemq-jdbc-store-5.12-SNAPSHOT.pom
[JENKINS] Archiving <https://builds.apache.org/job/ActiveMQ-Java7-All-UnitTests/ws/activemq-jdbc-store/target/activemq-jdbc-store-5.12-SNAPSHOT.jar>
to org.apache.activemq/activemq-jdbc-store/5.12-SNAPSHOT/activemq-jdbc-store-5.12-SNAPSHOT.jar
No artifacts from ActiveMQ-Java7-All-UnitTests » ActiveMQ :: JDBC Store #26 to compare, so
performing full copy of artifacts
[JENKINS] Archiving <https://builds.apache.org/job/ActiveMQ-Java7-All-UnitTests/ws/activemq-amqp/pom.xml>
to org.apache.activemq/activemq-amqp/5.12-SNAPSHOT/activemq-amqp-5.12-SNAPSHOT.pom
[JENKINS] Archiving <https://builds.apache.org/job/ActiveMQ-Java7-All-UnitTests/ws/activemq-amqp/target/activemq-amqp-5.12-SNAPSHOT.jar>
to org.apache.activemq/activemq-amqp/5.12-SNAPSHOT/activemq-amqp-5.12-SNAPSHOT.jar
No artifacts from ActiveMQ-Java7-All-UnitTests » ActiveMQ :: AMQP #26 to compare, so performing
full copy of artifacts
[JENKINS] Archiving <https://builds.apache.org/job/ActiveMQ-Java7-All-UnitTests/ws/activemq-jms-pool/pom.xml>
to org.apache.activemq/activemq-jms-pool/5.12-SNAPSHOT/activemq-jms-pool-5.12-SNAPSHOT.pom
[JENKINS] Archiving <https://builds.apache.org/job/ActiveMQ-Java7-All-UnitTests/ws/activemq-jms-pool/target/activemq-jms-pool-5.12-SNAPSHOT.jar>
to org.apache.activemq/activemq-jms-pool/5.12-SNAPSHOT/activemq-jms-pool-5.12-SNAPSHOT.jar
No artifacts from ActiveMQ-Java7-All-UnitTests » ActiveMQ :: Generic JMS Pool #26 to compare,
so performing full copy of artifacts
[JENKINS] Archiving <https://builds.apache.org/job/ActiveMQ-Java7-All-UnitTests/ws/activemq-pool/pom.xml>
to org.apache.activemq/activemq-pool/5.12-SNAPSHOT/activemq-pool-5.12-SNAPSHOT.pom
[JENKINS] Archiving <https://builds.apache.org/job/ActiveMQ-Java7-All-UnitTests/ws/activemq-pool/target/activemq-pool-5.12-SNAPSHOT.jar>
to org.apache.activemq/activemq-pool/5.12-SNAPSHOT/activemq-pool-5.12-SNAPSHOT.jar
No artifacts from ActiveMQ-Java7-All-UnitTests » ActiveMQ :: Pool #26 to compare, so performing
full copy of artifacts
[JENKINS] Archiving <https://builds.apache.org/job/ActiveMQ-Java7-All-UnitTests/ws/activemq-stomp/pom.xml>
to org.apache.activemq/activemq-stomp/5.12-SNAPSHOT/activemq-stomp-5.12-SNAPSHOT.pom
[JENKINS] Archiving <https://builds.apache.org/job/ActiveMQ-Java7-All-UnitTests/ws/activemq-stomp/target/activemq-stomp-5.12-SNAPSHOT.jar>
to org.apache.activemq/activemq-stomp/5.12-SNAPSHOT/activemq-stomp-5.12-SNAPSHOT.jar
No artifacts from ActiveMQ-Java7-All-UnitTests » ActiveMQ :: STOMP Protocol #26 to compare,
so performing full copy of artifacts
[JENKINS] Archiving <https://builds.apache.org/job/ActiveMQ-Java7-All-UnitTests/ws/activemq-mqtt/pom.xml>
to org.apache.activemq/activemq-mqtt/5.12-SNAPSHOT/activemq-mqtt-5.12-SNAPSHOT.pom
[JENKINS] Archiving <https://builds.apache.org/job/ActiveMQ-Java7-All-UnitTests/ws/activemq-mqtt/target/activemq-mqtt-5.12-SNAPSHOT.jar>
to org.apache.activemq/activemq-mqtt/5.12-SNAPSHOT/activemq-mqtt-5.12-SNAPSHOT.jar
No artifacts from ActiveMQ-Java7-All-UnitTests » ActiveMQ :: MQTT Protocol #26 to compare,
so performing full copy of artifacts
[JENKINS] Archiving <https://builds.apache.org/job/ActiveMQ-Java7-All-UnitTests/ws/activemq-console/pom.xml>
to org.apache.activemq/activemq-console/5.12-SNAPSHOT/activemq-console-5.12-SNAPSHOT.pom
[JENKINS] Archiving <https://builds.apache.org/job/ActiveMQ-Java7-All-UnitTests/ws/activemq-console/target/activemq-console-5.12-SNAPSHOT.jar>
to org.apache.activemq/activemq-console/5.12-SNAPSHOT/activemq-console-5.12-SNAPSHOT.jar
No artifacts from ActiveMQ-Java7-All-UnitTests » ActiveMQ :: Console #26 to compare, so performing
full copy of artifacts
[JENKINS] Archiving <https://builds.apache.org/job/ActiveMQ-Java7-All-UnitTests/ws/activemq-client/pom.xml>
to org.apache.activemq/activemq-client/5.12-SNAPSHOT/activemq-client-5.12-SNAPSHOT.pom
[JENKINS] Archiving <https://builds.apache.org/job/ActiveMQ-Java7-All-UnitTests/ws/activemq-client/target/activemq-client-5.12-SNAPSHOT.jar>
to org.apache.activemq/activemq-client/5.12-SNAPSHOT/activemq-client-5.12-SNAPSHOT.jar
No artifacts from ActiveMQ-Java7-All-UnitTests » ActiveMQ :: Client #26 to compare, so performing
full copy of artifacts
[JENKINS] Archiving <https://builds.apache.org/job/ActiveMQ-Java7-All-UnitTests/ws/pom.xml>
to org.apache.activemq/activemq-parent/5.12-SNAPSHOT/activemq-parent-5.12-SNAPSHOT.pom
No artifacts from ActiveMQ-Java7-All-UnitTests » ActiveMQ #26 to compare, so performing full
copy of artifacts
[JENKINS] Archiving <https://builds.apache.org/job/ActiveMQ-Java7-All-UnitTests/ws/activemq-broker/pom.xml>
to org.apache.activemq/activemq-broker/5.12-SNAPSHOT/activemq-broker-5.12-SNAPSHOT.pom
[JENKINS] Archiving <https://builds.apache.org/job/ActiveMQ-Java7-All-UnitTests/ws/activemq-broker/target/activemq-broker-5.12-SNAPSHOT.jar>
to org.apache.activemq/activemq-broker/5.12-SNAPSHOT/activemq-broker-5.12-SNAPSHOT.jar
[JENKINS] Archiving <https://builds.apache.org/job/ActiveMQ-Java7-All-UnitTests/ws/activemq-broker/target/activemq-broker-5.12-SNAPSHOT-tests.jar>
to org.apache.activemq/activemq-broker/5.12-SNAPSHOT/activemq-broker-5.12-SNAPSHOT-tests.jar
No artifacts from ActiveMQ-Java7-All-UnitTests » ActiveMQ :: Broker #26 to compare, so performing
full copy of artifacts
[JENKINS] Archiving <https://builds.apache.org/job/ActiveMQ-Java7-All-UnitTests/ws/activemq-ra/pom.xml>
to org.apache.activemq/activemq-ra/5.12-SNAPSHOT/activemq-ra-5.12-SNAPSHOT.pom
[JENKINS] Archiving <https://builds.apache.org/job/ActiveMQ-Java7-All-UnitTests/ws/activemq-ra/target/activemq-ra-5.12-SNAPSHOT.jar>
to org.apache.activemq/activemq-ra/5.12-SNAPSHOT/activemq-ra-5.12-SNAPSHOT.jar
[JENKINS] Archiving <https://builds.apache.org/job/ActiveMQ-Java7-All-UnitTests/ws/activemq-ra/target/xbean/activemq-ra.xsd>
to org.apache.activemq/activemq-ra/5.12-SNAPSHOT/activemq-ra-5.12-SNAPSHOT.xsd
[JENKINS] Archiving <https://builds.apache.org/job/ActiveMQ-Java7-All-UnitTests/ws/activemq-ra/target/xbean/activemq-ra.xsd.html>
to org.apache.activemq/activemq-ra/5.12-SNAPSHOT/activemq-ra-5.12-SNAPSHOT-schema.html
[JENKINS] Archiving <https://builds.apache.org/job/ActiveMQ-Java7-All-UnitTests/ws/activemq-ra/target/xbean/activemq-ra.xsd.html>
to org.apache.activemq/activemq-ra/5.12-SNAPSHOT/activemq-ra-5.12-SNAPSHOT.xsd.html
No artifacts from ActiveMQ-Java7-All-UnitTests » ActiveMQ :: RA #26 to compare, so performing
full copy of artifacts
[JENKINS] Archiving <https://builds.apache.org/job/ActiveMQ-Java7-All-UnitTests/ws/activemq-spring/pom.xml>
to org.apache.activemq/activemq-spring/5.12-SNAPSHOT/activemq-spring-5.12-SNAPSHOT.pom
[JENKINS] Archiving <https://builds.apache.org/job/ActiveMQ-Java7-All-UnitTests/ws/activemq-spring/target/activemq-spring-5.12-SNAPSHOT.jar>
to org.apache.activemq/activemq-spring/5.12-SNAPSHOT/activemq-spring-5.12-SNAPSHOT.jar
[JENKINS] Archiving <https://builds.apache.org/job/ActiveMQ-Java7-All-UnitTests/ws/activemq-spring/target/classes/activemq.xsd>
to org.apache.activemq/activemq-spring/5.12-SNAPSHOT/activemq-spring-5.12-SNAPSHOT.xsd
[JENKINS] Archiving <https://builds.apache.org/job/ActiveMQ-Java7-All-UnitTests/ws/activemq-spring/target/classes/activemq.xsd.html>
to org.apache.activemq/activemq-spring/5.12-SNAPSHOT/activemq-spring-5.12-SNAPSHOT-schema.html
No artifacts from ActiveMQ-Java7-All-UnitTests » ActiveMQ :: Spring #26 to compare, so performing
full copy of artifacts
[JENKINS] Archiving <https://builds.apache.org/job/ActiveMQ-Java7-All-UnitTests/ws/activemq-kahadb-store/pom.xml>
to org.apache.activemq/activemq-kahadb-store/5.12-SNAPSHOT/activemq-kahadb-store-5.12-SNAPSHOT.pom
[JENKINS] Archiving <https://builds.apache.org/job/ActiveMQ-Java7-All-UnitTests/ws/activemq-kahadb-store/target/activemq-kahadb-store-5.12-SNAPSHOT.jar>
to org.apache.activemq/activemq-kahadb-store/5.12-SNAPSHOT/activemq-kahadb-store-5.12-SNAPSHOT.jar
No artifacts from ActiveMQ-Java7-All-UnitTests » ActiveMQ :: KahaDB Store #26 to compare,
so performing full copy of artifacts
[JENKINS] Archiving <https://builds.apache.org/job/ActiveMQ-Java7-All-UnitTests/ws/activemq-jaas/pom.xml>
to org.apache.activemq/activemq-jaas/5.12-SNAPSHOT/activemq-jaas-5.12-SNAPSHOT.pom
[JENKINS] Archiving <https://builds.apache.org/job/ActiveMQ-Java7-All-UnitTests/ws/activemq-jaas/target/activemq-jaas-5.12-SNAPSHOT.jar>
to org.apache.activemq/activemq-jaas/5.12-SNAPSHOT/activemq-jaas-5.12-SNAPSHOT.jar
No artifacts from ActiveMQ-Java7-All-UnitTests » ActiveMQ :: JAAS #26 to compare, so performing
full copy of artifacts
[JENKINS] Archiving <https://builds.apache.org/job/ActiveMQ-Java7-All-UnitTests/ws/activemq-partition/pom.xml>
to org.apache.activemq/activemq-partition/5.12-SNAPSHOT/activemq-partition-5.12-SNAPSHOT.pom
[JENKINS] Archiving <https://builds.apache.org/job/ActiveMQ-Java7-All-UnitTests/ws/activemq-partition/target/activemq-partition-5.12-SNAPSHOT.jar>
to org.apache.activemq/activemq-partition/5.12-SNAPSHOT/activemq-partition-5.12-SNAPSHOT.jar
No artifacts from ActiveMQ-Java7-All-UnitTests » ActiveMQ :: Partition Management #26 to
compare, so performing full copy of artifacts
[JENKINS] Archiving <https://builds.apache.org/job/ActiveMQ-Java7-All-UnitTests/ws/activemq-leveldb-store/pom.xml>
to org.apache.activemq/activemq-leveldb-store/5.12-SNAPSHOT/activemq-leveldb-store-5.12-SNAPSHOT.pom
[JENKINS] Archiving <https://builds.apache.org/job/ActiveMQ-Java7-All-UnitTests/ws/activemq-leveldb-store/target/activemq-leveldb-store-5.12-SNAPSHOT.jar>
to org.apache.activemq/activemq-leveldb-store/5.12-SNAPSHOT/activemq-leveldb-store-5.12-SNAPSHOT.jar
No artifacts from ActiveMQ-Java7-All-UnitTests » ActiveMQ :: LevelDB Store #26 to compare,
so performing full copy of artifacts
channel stopped
[locks-and-latches] Releasing all the locks
[locks-and-latches] All the locks released

Mime
View raw message