activemq-commits mailing list archives

Site index · List index
Message view « Date » · « Thread »
Top « Date » · « Thread »
From Apache Jenkins Server <jenk...@builds.apache.org>
Subject Build failed in Jenkins: ActiveMQ-Java7 #467
Date Sun, 05 Oct 2014 06:08:26 GMT
See <https://builds.apache.org/job/ActiveMQ-Java7/467/>

------------------------------------------
[...truncated 5475 lines...]
Archived 3 artifacts
Archive block size is 32768
Received 0 blocks and 24898 bytes
Compression is 0.0%
Took 0.13 sec
[JENKINS] Archiving <https://builds.apache.org/job/ActiveMQ-Java7/ws/activemq-mqtt/pom.xml>
to org.apache.activemq/activemq-mqtt/5.11-SNAPSHOT/activemq-mqtt-5.11-SNAPSHOT.pom
[JENKINS] Archiving <https://builds.apache.org/job/ActiveMQ-Java7/ws/activemq-mqtt/target/activemq-mqtt-5.11-SNAPSHOT.jar>
to org.apache.activemq/activemq-mqtt/5.11-SNAPSHOT/activemq-mqtt-5.11-SNAPSHOT.jar
[JENKINS] Archiving <https://builds.apache.org/job/ActiveMQ-Java7/ws/activemq-mqtt/target/activemq-mqtt-5.11-SNAPSHOT-sources.jar>
to org.apache.activemq/activemq-mqtt/5.11-SNAPSHOT/activemq-mqtt-5.11-SNAPSHOT-sources.jar
Sending artifact delta relative to ActiveMQ-Java7 » ActiveMQ :: MQTT Protocol #466
Archived 3 artifacts
Archive block size is 32768
Received 0 blocks and 161750 bytes
Compression is 0.0%
Took 0.11 sec
[JENKINS] Archiving <https://builds.apache.org/job/ActiveMQ-Java7/ws/activemq-shiro/pom.xml>
to org.apache.activemq/activemq-shiro/5.11-SNAPSHOT/activemq-shiro-5.11-SNAPSHOT.pom
[JENKINS] Archiving <https://builds.apache.org/job/ActiveMQ-Java7/ws/activemq-shiro/target/activemq-shiro-5.11-SNAPSHOT.jar>
to org.apache.activemq/activemq-shiro/5.11-SNAPSHOT/activemq-shiro-5.11-SNAPSHOT.jar
[JENKINS] Archiving <https://builds.apache.org/job/ActiveMQ-Java7/ws/activemq-shiro/target/activemq-shiro-5.11-SNAPSHOT-sources.jar>
to org.apache.activemq/activemq-shiro/5.11-SNAPSHOT/activemq-shiro-5.11-SNAPSHOT-sources.jar
Sending artifact delta relative to ActiveMQ-Java7 » ActiveMQ :: Shiro #466
Archived 3 artifacts
Archive block size is 32768
Received 0 blocks and 98807 bytes
Compression is 0.0%
Took 0.11 sec
[JENKINS] Archiving <https://builds.apache.org/job/ActiveMQ-Java7/ws/activemq-console/pom.xml>
to org.apache.activemq/activemq-console/5.11-SNAPSHOT/activemq-console-5.11-SNAPSHOT.pom
[JENKINS] Archiving <https://builds.apache.org/job/ActiveMQ-Java7/ws/activemq-console/target/activemq-console-5.11-SNAPSHOT.jar>
to org.apache.activemq/activemq-console/5.11-SNAPSHOT/activemq-console-5.11-SNAPSHOT.jar
[JENKINS] Archiving <https://builds.apache.org/job/ActiveMQ-Java7/ws/activemq-console/target/activemq-console-5.11-SNAPSHOT-sources.jar>
to org.apache.activemq/activemq-console/5.11-SNAPSHOT/activemq-console-5.11-SNAPSHOT-sources.jar
Sending artifact delta relative to ActiveMQ-Java7 » ActiveMQ :: Console #466
Archived 3 artifacts
Archive block size is 32768
Received 0 blocks and 325181 bytes
Compression is 0.0%
Took 2 sec
[JENKINS] Archiving <https://builds.apache.org/job/ActiveMQ-Java7/ws/activemq-camel/pom.xml>
to org.apache.activemq/activemq-camel/5.11-SNAPSHOT/activemq-camel-5.11-SNAPSHOT.pom
[JENKINS] Archiving <https://builds.apache.org/job/ActiveMQ-Java7/ws/activemq-camel/target/activemq-camel-5.11-SNAPSHOT.jar>
to org.apache.activemq/activemq-camel/5.11-SNAPSHOT/activemq-camel-5.11-SNAPSHOT.jar
[JENKINS] Archiving <https://builds.apache.org/job/ActiveMQ-Java7/ws/activemq-camel/target/activemq-camel-5.11-SNAPSHOT-sources.jar>
to org.apache.activemq/activemq-camel/5.11-SNAPSHOT/activemq-camel-5.11-SNAPSHOT-sources.jar
Sending artifact delta relative to ActiveMQ-Java7 » ActiveMQ :: Camel #466
Archived 3 artifacts
Archive block size is 32768
Received 0 blocks and 109430 bytes
Compression is 0.0%
Took 92 ms
[JENKINS] Archiving <https://builds.apache.org/job/ActiveMQ-Java7/ws/activemq-blueprint/pom.xml>
to org.apache.activemq/activemq-blueprint/5.11-SNAPSHOT/activemq-blueprint-5.11-SNAPSHOT.pom
[JENKINS] Archiving <https://builds.apache.org/job/ActiveMQ-Java7/ws/activemq-blueprint/target/activemq-blueprint-5.11-SNAPSHOT.jar>
to org.apache.activemq/activemq-blueprint/5.11-SNAPSHOT/activemq-blueprint-5.11-SNAPSHOT.jar
[JENKINS] Archiving <https://builds.apache.org/job/ActiveMQ-Java7/ws/activemq-blueprint/target/activemq-blueprint-5.11-SNAPSHOT-sources.jar>
to org.apache.activemq/activemq-blueprint/5.11-SNAPSHOT/activemq-blueprint-5.11-SNAPSHOT-sources.jar
Sending artifact delta relative to ActiveMQ-Java7 » ActiveMQ :: Blueprint #466
Archived 3 artifacts
Archive block size is 32768
Received 0 blocks and 18124 bytes
Compression is 0.0%
Took 42 ms
[JENKINS] Archiving <https://builds.apache.org/job/ActiveMQ-Java7/ws/activemq-client/pom.xml>
to org.apache.activemq/activemq-client/5.11-SNAPSHOT/activemq-client-5.11-SNAPSHOT.pom
[JENKINS] Archiving <https://builds.apache.org/job/ActiveMQ-Java7/ws/activemq-client/target/activemq-client-5.11-SNAPSHOT.jar>
to org.apache.activemq/activemq-client/5.11-SNAPSHOT/activemq-client-5.11-SNAPSHOT.jar
[JENKINS] Archiving <https://builds.apache.org/job/ActiveMQ-Java7/ws/activemq-client/target/activemq-client-5.11-SNAPSHOT-sources.jar>
to org.apache.activemq/activemq-client/5.11-SNAPSHOT/activemq-client-5.11-SNAPSHOT-sources.jar
Sending artifact delta relative to ActiveMQ-Java7 » ActiveMQ :: Client #466
Archived 3 artifacts
Archive block size is 32768
Received 0 blocks and 2213968 bytes
Compression is 0.0%
Took 0.62 sec
[JENKINS] Archiving <https://builds.apache.org/job/ActiveMQ-Java7/ws/pom.xml> to org.apache.activemq/activemq-parent/5.11-SNAPSHOT/activemq-parent-5.11-SNAPSHOT.pom
Sending artifact delta relative to ActiveMQ-Java7 » ActiveMQ #466
Archived 1 artifacts
Archive block size is 32768
Received 1 blocks and 25626 bytes
Compression is 56.1%
Took 0.1 sec
[JENKINS] Archiving <https://builds.apache.org/job/ActiveMQ-Java7/ws/activemq-karaf-itest/pom.xml>
to org.apache.activemq/activemq-karaf-itest/5.11-SNAPSHOT/activemq-karaf-itest-5.11-SNAPSHOT.pom
[JENKINS] Archiving <https://builds.apache.org/job/ActiveMQ-Java7/ws/activemq-karaf-itest/target/activemq-karaf-itest-5.11-SNAPSHOT.jar>
to org.apache.activemq/activemq-karaf-itest/5.11-SNAPSHOT/activemq-karaf-itest-5.11-SNAPSHOT.jar
[JENKINS] Archiving <https://builds.apache.org/job/ActiveMQ-Java7/ws/activemq-karaf-itest/target/activemq-karaf-itest-5.11-SNAPSHOT-sources.jar>
to org.apache.activemq/activemq-karaf-itest/5.11-SNAPSHOT/activemq-karaf-itest-5.11-SNAPSHOT-sources.jar
Sending artifact delta relative to ActiveMQ-Java7 » ActiveMQ :: Karaf Integration Tests #466
Archived 3 artifacts
Archive block size is 32768
Received 0 blocks and 54936 bytes
Compression is 0.0%
Took 0.11 sec
[JENKINS] Archiving <https://builds.apache.org/job/ActiveMQ-Java7/ws/activemq-broker/pom.xml>
to org.apache.activemq/activemq-broker/5.11-SNAPSHOT/activemq-broker-5.11-SNAPSHOT.pom
[JENKINS] Archiving <https://builds.apache.org/job/ActiveMQ-Java7/ws/activemq-broker/target/activemq-broker-5.11-SNAPSHOT.jar>
to org.apache.activemq/activemq-broker/5.11-SNAPSHOT/activemq-broker-5.11-SNAPSHOT.jar
[JENKINS] Archiving <https://builds.apache.org/job/ActiveMQ-Java7/ws/activemq-broker/target/activemq-broker-5.11-SNAPSHOT-tests.jar>
to org.apache.activemq/activemq-broker/5.11-SNAPSHOT/activemq-broker-5.11-SNAPSHOT-tests.jar
[JENKINS] Archiving <https://builds.apache.org/job/ActiveMQ-Java7/ws/activemq-broker/target/activemq-broker-5.11-SNAPSHOT-sources.jar>
to org.apache.activemq/activemq-broker/5.11-SNAPSHOT/activemq-broker-5.11-SNAPSHOT-sources.jar
Sending artifact delta relative to ActiveMQ-Java7 » ActiveMQ :: Broker #466
Archived 4 artifacts
Archive block size is 32768
Received 0 blocks and 1919184 bytes
Compression is 0.0%
Took 2.6 sec
[JENKINS] Archiving <https://builds.apache.org/job/ActiveMQ-Java7/ws/activemq-ra/pom.xml>
to org.apache.activemq/activemq-ra/5.11-SNAPSHOT/activemq-ra-5.11-SNAPSHOT.pom
[JENKINS] Archiving <https://builds.apache.org/job/ActiveMQ-Java7/ws/activemq-ra/target/activemq-ra-5.11-SNAPSHOT.jar>
to org.apache.activemq/activemq-ra/5.11-SNAPSHOT/activemq-ra-5.11-SNAPSHOT.jar
[JENKINS] Archiving <https://builds.apache.org/job/ActiveMQ-Java7/ws/activemq-ra/target/xbean/activemq-ra.xsd>
to org.apache.activemq/activemq-ra/5.11-SNAPSHOT/activemq-ra-5.11-SNAPSHOT.xsd
[JENKINS] Archiving <https://builds.apache.org/job/ActiveMQ-Java7/ws/activemq-ra/target/xbean/activemq-ra.xsd.html>
to org.apache.activemq/activemq-ra/5.11-SNAPSHOT/activemq-ra-5.11-SNAPSHOT-schema.html
[JENKINS] Archiving <https://builds.apache.org/job/ActiveMQ-Java7/ws/activemq-ra/target/xbean/activemq-ra.xsd.html>
to org.apache.activemq/activemq-ra/5.11-SNAPSHOT/activemq-ra-5.11-SNAPSHOT.xsd.html
[JENKINS] Archiving <https://builds.apache.org/job/ActiveMQ-Java7/ws/activemq-ra/target/activemq-ra-5.11-SNAPSHOT-sources.jar>
to org.apache.activemq/activemq-ra/5.11-SNAPSHOT/activemq-ra-5.11-SNAPSHOT-sources.jar
Sending artifact delta relative to ActiveMQ-Java7 » ActiveMQ :: RA #466
Archived 6 artifacts
Archive block size is 32768
Received 0 blocks and 190561 bytes
Compression is 0.0%
Took 0.23 sec
[JENKINS] Archiving <https://builds.apache.org/job/ActiveMQ-Java7/ws/activemq-spring/pom.xml>
to org.apache.activemq/activemq-spring/5.11-SNAPSHOT/activemq-spring-5.11-SNAPSHOT.pom
[JENKINS] Archiving <https://builds.apache.org/job/ActiveMQ-Java7/ws/activemq-spring/target/activemq-spring-5.11-SNAPSHOT.jar>
to org.apache.activemq/activemq-spring/5.11-SNAPSHOT/activemq-spring-5.11-SNAPSHOT.jar
[JENKINS] Archiving <https://builds.apache.org/job/ActiveMQ-Java7/ws/activemq-spring/target/classes/activemq.xsd>
to org.apache.activemq/activemq-spring/5.11-SNAPSHOT/activemq-spring-5.11-SNAPSHOT.xsd
[JENKINS] Archiving <https://builds.apache.org/job/ActiveMQ-Java7/ws/activemq-spring/target/classes/activemq.xsd.html>
to org.apache.activemq/activemq-spring/5.11-SNAPSHOT/activemq-spring-5.11-SNAPSHOT-schema.html
[JENKINS] Archiving <https://builds.apache.org/job/ActiveMQ-Java7/ws/activemq-spring/target/activemq-spring-5.11-SNAPSHOT-sources.jar>
to org.apache.activemq/activemq-spring/5.11-SNAPSHOT/activemq-spring-5.11-SNAPSHOT-sources.jar
Sending artifact delta relative to ActiveMQ-Java7 » ActiveMQ :: Spring #466
Archived 5 artifacts
Archive block size is 32768
Received 23 blocks and 322903 bytes
Compression is 70.0%
Took 0.3 sec
[JENKINS] Archiving <https://builds.apache.org/job/ActiveMQ-Java7/ws/activemq-all/dependency-reduced-pom.xml>
to org.apache.activemq/activemq-all/5.11-SNAPSHOT/activemq-all-5.11-SNAPSHOT.pom
[JENKINS] Archiving <https://builds.apache.org/job/ActiveMQ-Java7/ws/activemq-all/target/activemq-all-5.11-SNAPSHOT.jar>
to org.apache.activemq/activemq-all/5.11-SNAPSHOT/activemq-all-5.11-SNAPSHOT.jar
[JENKINS] Archiving <https://builds.apache.org/job/ActiveMQ-Java7/ws/activemq-all/target/activemq-all-5.11-SNAPSHOT-sources.jar>
to org.apache.activemq/activemq-all/5.11-SNAPSHOT/activemq-all-5.11-SNAPSHOT-sources.jar
Sending artifact delta relative to ActiveMQ-Java7 » ActiveMQ :: All JAR bundle #466
Archived 3 artifacts
Archive block size is 32768
Received 2 blocks and 6339678 bytes
Compression is 1.0%
Took 5.3 sec
[JENKINS] Archiving <https://builds.apache.org/job/ActiveMQ-Java7/ws/activemq-kahadb-store/pom.xml>
to org.apache.activemq/activemq-kahadb-store/5.11-SNAPSHOT/activemq-kahadb-store-5.11-SNAPSHOT.pom
[JENKINS] Archiving <https://builds.apache.org/job/ActiveMQ-Java7/ws/activemq-kahadb-store/target/activemq-kahadb-store-5.11-SNAPSHOT.jar>
to org.apache.activemq/activemq-kahadb-store/5.11-SNAPSHOT/activemq-kahadb-store-5.11-SNAPSHOT.jar
[JENKINS] Archiving <https://builds.apache.org/job/ActiveMQ-Java7/ws/activemq-kahadb-store/target/activemq-kahadb-store-5.11-SNAPSHOT-sources.jar>
to org.apache.activemq/activemq-kahadb-store/5.11-SNAPSHOT/activemq-kahadb-store-5.11-SNAPSHOT-sources.jar
Sending artifact delta relative to ActiveMQ-Java7 » ActiveMQ :: KahaDB Store #466
Archived 3 artifacts
Archive block size is 32768
Received 0 blocks and 896549 bytes
Compression is 0.0%
Took 0.42 sec
[JENKINS] Archiving <https://builds.apache.org/job/ActiveMQ-Java7/ws/activemq-jaas/pom.xml>
to org.apache.activemq/activemq-jaas/5.11-SNAPSHOT/activemq-jaas-5.11-SNAPSHOT.pom
[JENKINS] Archiving <https://builds.apache.org/job/ActiveMQ-Java7/ws/activemq-jaas/target/activemq-jaas-5.11-SNAPSHOT.jar>
to org.apache.activemq/activemq-jaas/5.11-SNAPSHOT/activemq-jaas-5.11-SNAPSHOT.jar
[JENKINS] Archiving <https://builds.apache.org/job/ActiveMQ-Java7/ws/activemq-jaas/target/activemq-jaas-5.11-SNAPSHOT-sources.jar>
to org.apache.activemq/activemq-jaas/5.11-SNAPSHOT/activemq-jaas-5.11-SNAPSHOT-sources.jar
Sending artifact delta relative to ActiveMQ-Java7 » ActiveMQ :: JAAS #466
Archived 3 artifacts
Archive block size is 32768
Received 0 blocks and 64318 bytes
Compression is 0.0%
Took 95 ms
[JENKINS] Archiving <https://builds.apache.org/job/ActiveMQ-Java7/ws/activemq-tooling/pom.xml>
to org.apache.activemq.tooling/activemq-tooling/5.11-SNAPSHOT/activemq-tooling-5.11-SNAPSHOT.pom
Sending artifact delta relative to ActiveMQ-Java7 » ActiveMQ :: Tooling #466
Archived 1 artifacts
Archive block size is 32768
Received 0 blocks and 1679 bytes
Compression is 0.0%
Took 97 ms
[JENKINS] Archiving <https://builds.apache.org/job/ActiveMQ-Java7/ws/activemq-partition/pom.xml>
to org.apache.activemq/activemq-partition/5.11-SNAPSHOT/activemq-partition-5.11-SNAPSHOT.pom
[JENKINS] Archiving <https://builds.apache.org/job/ActiveMQ-Java7/ws/activemq-partition/target/activemq-partition-5.11-SNAPSHOT.jar>
to org.apache.activemq/activemq-partition/5.11-SNAPSHOT/activemq-partition-5.11-SNAPSHOT.jar
[JENKINS] Archiving <https://builds.apache.org/job/ActiveMQ-Java7/ws/activemq-partition/target/activemq-partition-5.11-SNAPSHOT-sources.jar>
to org.apache.activemq/activemq-partition/5.11-SNAPSHOT/activemq-partition-5.11-SNAPSHOT-sources.jar
Sending artifact delta relative to ActiveMQ-Java7 » ActiveMQ :: Partition Management #466
Archived 3 artifacts
Archive block size is 32768
Received 0 blocks and 46415 bytes
Compression is 0.0%
Took 2.1 sec
[JENKINS] Archiving <https://builds.apache.org/job/ActiveMQ-Java7/ws/activemq-web/pom.xml>
to org.apache.activemq/activemq-web/5.11-SNAPSHOT/activemq-web-5.11-SNAPSHOT.pom
[JENKINS] Archiving <https://builds.apache.org/job/ActiveMQ-Java7/ws/activemq-web/target/activemq-web-5.11-SNAPSHOT.jar>
to org.apache.activemq/activemq-web/5.11-SNAPSHOT/activemq-web-5.11-SNAPSHOT.jar
[JENKINS] Archiving <https://builds.apache.org/job/ActiveMQ-Java7/ws/activemq-web/target/activemq-web-5.11-SNAPSHOT-sources.jar>
to org.apache.activemq/activemq-web/5.11-SNAPSHOT/activemq-web-5.11-SNAPSHOT-sources.jar
Sending artifact delta relative to ActiveMQ-Java7 » ActiveMQ :: Web #466
Archived 3 artifacts
Archive block size is 32768
Received 0 blocks and 211733 bytes
Compression is 0.0%
Took 0.24 sec
[JENKINS] Archiving <https://builds.apache.org/job/ActiveMQ-Java7/ws/activemq-leveldb-store/pom.xml>
to org.apache.activemq/activemq-leveldb-store/5.11-SNAPSHOT/activemq-leveldb-store-5.11-SNAPSHOT.pom
[JENKINS] Archiving <https://builds.apache.org/job/ActiveMQ-Java7/ws/activemq-leveldb-store/target/activemq-leveldb-store-5.11-SNAPSHOT.jar>
to org.apache.activemq/activemq-leveldb-store/5.11-SNAPSHOT/activemq-leveldb-store-5.11-SNAPSHOT.jar
[JENKINS] Archiving <https://builds.apache.org/job/ActiveMQ-Java7/ws/activemq-leveldb-store/target/activemq-leveldb-store-5.11-SNAPSHOT-sources.jar>
to org.apache.activemq/activemq-leveldb-store/5.11-SNAPSHOT/activemq-leveldb-store-5.11-SNAPSHOT-sources.jar
Sending artifact delta relative to ActiveMQ-Java7 » ActiveMQ :: LevelDB Store #466
Archived 3 artifacts
Archive block size is 32768
Received 0 blocks and 1089864 bytes
Compression is 0.0%
Took 2.3 sec
[JENKINS] Archiving <https://builds.apache.org/job/ActiveMQ-Java7/ws/activemq-fileserver/pom.xml>
to org.apache.activemq/activemq-fileserver/5.11-SNAPSHOT/activemq-fileserver-5.11-SNAPSHOT.pom
[JENKINS] Archiving <https://builds.apache.org/job/ActiveMQ-Java7/ws/activemq-fileserver/target/activemq-fileserver-5.11-SNAPSHOT.war>
to org.apache.activemq/activemq-fileserver/5.11-SNAPSHOT/activemq-fileserver-5.11-SNAPSHOT.war
[JENKINS] Archiving <https://builds.apache.org/job/ActiveMQ-Java7/ws/activemq-fileserver/target/activemq-fileserver-5.11-SNAPSHOT-sources.jar>
to org.apache.activemq/activemq-fileserver/5.11-SNAPSHOT/activemq-fileserver-5.11-SNAPSHOT-sources.jar
Sending artifact delta relative to ActiveMQ-Java7 » ActiveMQ :: File Server #466
Archived 3 artifacts
Archive block size is 32768
Received 0 blocks and 58360 bytes
Compression is 0.0%
Took 0.15 sec
[JENKINS] Archiving <https://builds.apache.org/job/ActiveMQ-Java7/ws/activemq-karaf/pom.xml>
to org.apache.activemq/activemq-karaf/5.11-SNAPSHOT/activemq-karaf-5.11-SNAPSHOT.pom
[JENKINS] Archiving <https://builds.apache.org/job/ActiveMQ-Java7/ws/activemq-karaf/target/activemq-karaf-5.11-SNAPSHOT.jar>
to org.apache.activemq/activemq-karaf/5.11-SNAPSHOT/activemq-karaf-5.11-SNAPSHOT.jar
[JENKINS] Archiving <https://builds.apache.org/job/ActiveMQ-Java7/ws/activemq-karaf/target/classes/features.xml>
to org.apache.activemq/activemq-karaf/5.11-SNAPSHOT/activemq-karaf-5.11-SNAPSHOT-features.xml
[JENKINS] Archiving <https://builds.apache.org/job/ActiveMQ-Java7/ws/activemq-karaf/target/classes/features-core.xml>
to org.apache.activemq/activemq-karaf/5.11-SNAPSHOT/activemq-karaf-5.11-SNAPSHOT-features-core.xml
[JENKINS] Archiving <https://builds.apache.org/job/ActiveMQ-Java7/ws/activemq-karaf/target/classes/activemq.xml>
to org.apache.activemq/activemq-karaf/5.11-SNAPSHOT/activemq-karaf-5.11-SNAPSHOT-activemq.xml
[JENKINS] Archiving <https://builds.apache.org/job/ActiveMQ-Java7/ws/activemq-karaf/target/classes/org.apache.activemq.server-default.cfg>
to org.apache.activemq/activemq-karaf/5.11-SNAPSHOT/activemq-karaf-5.11-SNAPSHOT-activemq.cfg
[JENKINS] Archiving <https://builds.apache.org/job/ActiveMQ-Java7/ws/activemq-karaf/target/classes/org.apache.activemq.webconsole.cfg>
to org.apache.activemq/activemq-karaf/5.11-SNAPSHOT/activemq-karaf-5.11-SNAPSHOT-activemq-webconsole.cfg
[JENKINS] Archiving <https://builds.apache.org/job/ActiveMQ-Java7/ws/activemq-karaf/target/activemq-karaf-5.11-SNAPSHOT-sources.jar>
to org.apache.activemq/activemq-karaf/5.11-SNAPSHOT/activemq-karaf-5.11-SNAPSHOT-sources.jar
Sending artifact delta relative to ActiveMQ-Java7 » ActiveMQ :: Apache Karaf #466
Archived 8 artifacts
Archive block size is 32768
Received 0 blocks and 69436 bytes
Compression is 0.0%
Took 0.18 sec
[JENKINS] Archiving <https://builds.apache.org/job/ActiveMQ-Java7/ws/activemq-http/pom.xml>
to org.apache.activemq/activemq-http/5.11-SNAPSHOT/activemq-http-5.11-SNAPSHOT.pom
[JENKINS] Archiving <https://builds.apache.org/job/ActiveMQ-Java7/ws/activemq-http/target/activemq-http-5.11-SNAPSHOT.jar>
to org.apache.activemq/activemq-http/5.11-SNAPSHOT/activemq-http-5.11-SNAPSHOT.jar
[JENKINS] Archiving <https://builds.apache.org/job/ActiveMQ-Java7/ws/activemq-http/target/activemq-http-5.11-SNAPSHOT-sources.jar>
to org.apache.activemq/activemq-http/5.11-SNAPSHOT/activemq-http-5.11-SNAPSHOT-sources.jar
Sending artifact delta relative to ActiveMQ-Java7 » ActiveMQ :: HTTP Protocol Support #466
Archived 3 artifacts
Archive block size is 32768
Received 0 blocks and 151228 bytes
Compression is 0.0%
Took 0.13 sec
Sending e-mails to: commits@activemq.apache.org
channel stopped
[locks-and-latches] Releasing all the locks
[locks-and-latches] All the locks released
Maven RedeployPublisher use remote ubuntu-6 maven settings from : /home/jenkins/.m2/settings.xml
[ERROR] uniqueVersion == false is not anymore supported in maven 3
[INFO] Deployment in https://repository.apache.org/content/repositories/snapshots (id=,uniqueVersion=false)
Deploying the main artifact activemq-all-5.11-SNAPSHOT.jar
Downloading: https://repository.apache.org/content/repositories/snapshots/org/apache/activemq/activemq-all/5.11-SNAPSHOT/maven-metadata.xml
Downloaded: https://repository.apache.org/content/repositories/snapshots/org/apache/activemq/activemq-all/5.11-SNAPSHOT/maven-metadata.xml
(784 B at 0.1 KB/sec)
Uploading: https://repository.apache.org/content/repositories/snapshots/org/apache/activemq/activemq-all/5.11-SNAPSHOT/activemq-all-5.11-20141005.060825-104.jar
Uploading: https://repository.apache.org/content/repositories/snapshots/org/apache/activemq/activemq-all/5.11-SNAPSHOT/activemq-all-5.11-20141005.060825-104.pom
ERROR: Failed to deploy artifacts: Could not transfer artifact org.apache.activemq:activemq-all:jar:5.11-20141005.060825-104
from/to  (https://repository.apache.org/content/repositories/snapshots): Failed to transfer
file: https://repository.apache.org/content/repositories/snapshots/org/apache/activemq/activemq-all/5.11-SNAPSHOT/activemq-all-5.11-20141005.060825-104.jar.
Return code is: 401, ReasonPhrase: Unauthorized.
org.apache.maven.artifact.deployer.ArtifactDeploymentException: Failed to deploy artifacts:
Could not transfer artifact org.apache.activemq:activemq-all:jar:5.11-20141005.060825-104
from/to  (https://repository.apache.org/content/repositories/snapshots): Failed to transfer
file: https://repository.apache.org/content/repositories/snapshots/org/apache/activemq/activemq-all/5.11-SNAPSHOT/activemq-all-5.11-20141005.060825-104.jar.
Return code is: 401, ReasonPhrase: Unauthorized.
	at org.apache.maven.artifact.deployer.DefaultArtifactDeployer.deploy(DefaultArtifactDeployer.java:143)
	at hudson.maven.reporters.MavenArtifactRecord.deploy(MavenArtifactRecord.java:193)
	at hudson.maven.RedeployPublisher.perform(RedeployPublisher.java:176)
	at hudson.tasks.BuildStepMonitor$1.perform(BuildStepMonitor.java:20)
	at hudson.model.AbstractBuild$AbstractBuildExecution.perform(AbstractBuild.java:804)
	at hudson.model.AbstractBuild$AbstractBuildExecution.performAllBuildSteps(AbstractBuild.java:776)
	at hudson.maven.MavenModuleSetBuild$MavenModuleSetBuildExecution.post2(MavenModuleSetBuild.java:1040)
	at hudson.model.AbstractBuild$AbstractBuildExecution.post(AbstractBuild.java:725)
	at hudson.model.Run.execute(Run.java:1701)
	at hudson.maven.MavenModuleSetBuild.run(MavenModuleSetBuild.java:529)
	at hudson.model.ResourceController.execute(ResourceController.java:88)
	at hudson.model.Executor.run(Executor.java:231)
Caused by: org.eclipse.aether.deployment.DeploymentException: Failed to deploy artifacts:
Could not transfer artifact org.apache.activemq:activemq-all:jar:5.11-20141005.060825-104
from/to  (https://repository.apache.org/content/repositories/snapshots): Failed to transfer
file: https://repository.apache.org/content/repositories/snapshots/org/apache/activemq/activemq-all/5.11-SNAPSHOT/activemq-all-5.11-20141005.060825-104.jar.
Return code is: 401, ReasonPhrase: Unauthorized.
	at org.eclipse.aether.internal.impl.DefaultDeployer.deploy(DefaultDeployer.java:341)
	at org.eclipse.aether.internal.impl.DefaultDeployer.deploy(DefaultDeployer.java:269)
	at org.eclipse.aether.internal.impl.DefaultRepositorySystem.deploy(DefaultRepositorySystem.java:413)
	at org.apache.maven.artifact.deployer.DefaultArtifactDeployer.deploy(DefaultArtifactDeployer.java:139)
	... 11 more
Caused by: org.eclipse.aether.transfer.ArtifactTransferException: Could not transfer artifact
org.apache.activemq:activemq-all:jar:5.11-20141005.060825-104 from/to  (https://repository.apache.org/content/repositories/snapshots):
Failed to transfer file: https://repository.apache.org/content/repositories/snapshots/org/apache/activemq/activemq-all/5.11-SNAPSHOT/activemq-all-5.11-20141005.060825-104.jar.
Return code is: 401, ReasonPhrase: Unauthorized.
	at org.eclipse.aether.connector.wagon.WagonRepositoryConnector$6.wrap(WagonRepositoryConnector.java:1016)
	at org.eclipse.aether.connector.wagon.WagonRepositoryConnector$6.wrap(WagonRepositoryConnector.java:1004)
	at org.eclipse.aether.connector.wagon.WagonRepositoryConnector$PutTask.run(WagonRepositoryConnector.java:895)
	at org.eclipse.aether.connector.wagon.WagonRepositoryConnector.put(WagonRepositoryConnector.java:522)
	at org.eclipse.aether.internal.impl.DefaultDeployer.deploy(DefaultDeployer.java:335)
	... 14 more
Caused by: org.apache.maven.wagon.TransferFailedException: Failed to transfer file: https://repository.apache.org/content/repositories/snapshots/org/apache/activemq/activemq-all/5.11-SNAPSHOT/activemq-all-5.11-20141005.060825-104.jar.
Return code is: 401, ReasonPhrase: Unauthorized.
	at org.apache.maven.wagon.shared.http4.AbstractHttpClientWagon.put(AbstractHttpClientWagon.java:626)
	at org.apache.maven.wagon.shared.http4.AbstractHttpClientWagon.put(AbstractHttpClientWagon.java:524)
	at org.apache.maven.wagon.shared.http4.AbstractHttpClientWagon.put(AbstractHttpClientWagon.java:505)
	at org.apache.maven.wagon.shared.http4.AbstractHttpClientWagon.put(AbstractHttpClientWagon.java:485)
	at org.eclipse.aether.connector.wagon.WagonRepositoryConnector$PutTask.run(WagonRepositoryConnector.java:871)
	... 16 more
[INFO] Deployment failed after 5.9 sec
Build step 'Deploy artifacts to Maven repository' changed build result to FAILURE

Mime
View raw message