activemq-commits mailing list archives

Site index · List index
Message view « Date » · « Thread »
Top « Date » · « Thread »
From Apache Jenkins Server <jenk...@builds.apache.org>
Subject Build failed in Jenkins: ActiveMQ-Java7 » ActiveMQ :: Unit Tests #477
Date Tue, 14 Oct 2014 05:49:35 GMT
See <https://builds.apache.org/job/ActiveMQ-Java7/org.apache.activemq$activemq-unit-tests/477/>

------------------------------------------
[...truncated 664 lines...]
Tests run: 1, Failures: 0, Errors: 0, Skipped: 0, Time elapsed: 1.855 sec - in org.apache.activemq.store.jdbc.JDBCIOExceptionHandlerMockeryTest
Running org.apache.activemq.store.jdbc.JDBCIOExceptionHandlerTest
Tests run: 4, Failures: 0, Errors: 0, Skipped: 0, Time elapsed: 27.32 sec - in org.apache.activemq.store.jdbc.JDBCIOExceptionHandlerTest
Running org.apache.activemq.store.jdbc.JDBCLockTablePrefixTest
Tests run: 1, Failures: 0, Errors: 0, Skipped: 0, Time elapsed: 3.281 sec - in org.apache.activemq.store.jdbc.JDBCLockTablePrefixTest
Running org.apache.activemq.store.jdbc.JDBCStoreAutoCommitTest
Tests run: 3, Failures: 0, Errors: 0, Skipped: 0, Time elapsed: 4.001 sec - in org.apache.activemq.store.jdbc.JDBCStoreAutoCommitTest
Running org.apache.activemq.store.jdbc.JDBCTablePrefixAssignedTest
Tests run: 1, Failures: 0, Errors: 0, Skipped: 0, Time elapsed: 3.082 sec - in org.apache.activemq.store.jdbc.JDBCTablePrefixAssignedTest
Running org.apache.activemq.store.jdbc.LeaseDatabaseLockerTest
Tests run: 5, Failures: 0, Errors: 0, Skipped: 0, Time elapsed: 54.925 sec - in org.apache.activemq.store.jdbc.LeaseDatabaseLockerTest
Running org.apache.activemq.store.kahadb.CustomLockerTest
Tests run: 1, Failures: 0, Errors: 0, Skipped: 0, Time elapsed: 2.106 sec - in org.apache.activemq.store.kahadb.CustomLockerTest
Running org.apache.activemq.store.kahadb.KahaDBIndexLocationTest
Tests run: 2, Failures: 0, Errors: 0, Skipped: 0, Time elapsed: 5.347 sec - in org.apache.activemq.store.kahadb.KahaDBIndexLocationTest
Running org.apache.activemq.store.kahadb.KahaDBPersistenceAdapterTest
Tests run: 2, Failures: 0, Errors: 0, Skipped: 0, Time elapsed: 2.526 sec - in org.apache.activemq.store.kahadb.KahaDBPersistenceAdapterTest
Running org.apache.activemq.store.kahadb.KahaDBStoreBrokerTest
Tests run: 129, Failures: 0, Errors: 0, Skipped: 0, Time elapsed: 87.239 sec - in org.apache.activemq.store.kahadb.KahaDBStoreBrokerTest
Running org.apache.activemq.store.kahadb.KahaDBStoreOrderTest
Tests run: 2, Failures: 0, Errors: 0, Skipped: 0, Time elapsed: 3.874 sec - in org.apache.activemq.store.kahadb.KahaDBStoreOrderTest
Running org.apache.activemq.store.kahadb.NoSpaceIOTest
Tests run: 1, Failures: 0, Errors: 0, Skipped: 1, Time elapsed: 0.085 sec - in org.apache.activemq.store.kahadb.NoSpaceIOTest
Running org.apache.activemq.store.kahadb.PBMesssagesTest
Tests run: 1, Failures: 0, Errors: 0, Skipped: 0, Time elapsed: 0.087 sec - in org.apache.activemq.store.kahadb.PBMesssagesTest
Running org.apache.activemq.store.kahadb.TempKahaDBStoreBrokerTest
Tests run: 129, Failures: 0, Errors: 0, Skipped: 0, Time elapsed: 107.044 sec - in org.apache.activemq.store.kahadb.TempKahaDBStoreBrokerTest
Running org.apache.activemq.store.kahadb.plist.KahaDBFilePendingMessageCursorTest
Tests run: 3, Failures: 0, Errors: 0, Skipped: 0, Time elapsed: 2.536 sec - in org.apache.activemq.store.kahadb.plist.KahaDBFilePendingMessageCursorTest
Running org.apache.activemq.store.leveldb.LevelDBNegativeQueueTest
Tests run: 4, Failures: 0, Errors: 0, Skipped: 0, Time elapsed: 166.623 sec - in org.apache.activemq.store.leveldb.LevelDBNegativeQueueTest
Running org.apache.activemq.store.leveldb.LevelDBStoreBrokerTest
Tests run: 129, Failures: 0, Errors: 0, Skipped: 0, Time elapsed: 27.061 sec - in org.apache.activemq.store.leveldb.LevelDBStoreBrokerTest
Running org.apache.activemq.streams.JMSInputStreamTest
Tests run: 10, Failures: 0, Errors: 0, Skipped: 0, Time elapsed: 3.687 sec - in org.apache.activemq.streams.JMSInputStreamTest
Running org.apache.activemq.test.JmsTopicSendReceiveTest
Tests run: 1, Failures: 0, Errors: 0, Skipped: 0, Time elapsed: 2.167 sec - in org.apache.activemq.test.JmsTopicSendReceiveTest
Running org.apache.activemq.test.JmsTopicSendReceiveWithTwoConnectionsAndByteSelectorTest
Tests run: 1, Failures: 0, Errors: 0, Skipped: 0, Time elapsed: 2.137 sec - in org.apache.activemq.test.JmsTopicSendReceiveWithTwoConnectionsAndByteSelectorTest
Running org.apache.activemq.test.JmsTopicSendReceiveWithTwoConnectionsTest
Tests run: 1, Failures: 0, Errors: 0, Skipped: 0, Time elapsed: 2.109 sec - in org.apache.activemq.test.JmsTopicSendReceiveWithTwoConnectionsTest
Running org.apache.activemq.test.TemporaryDestinationToFromNameTest
Tests run: 2, Failures: 0, Errors: 0, Skipped: 0, Time elapsed: 1.102 sec - in org.apache.activemq.test.TemporaryDestinationToFromNameTest
Running org.apache.activemq.test.retroactive.RetroactiveConsumerTestWithDestinationBasedBufferTest
Tests run: 1, Failures: 0, Errors: 0, Skipped: 0, Time elapsed: 1.892 sec - in org.apache.activemq.test.retroactive.RetroactiveConsumerTestWithDestinationBasedBufferTest
Running org.apache.activemq.test.retroactive.RetroactiveConsumerTestWithLastImagePolicyWithWildcardTest
Tests run: 1, Failures: 0, Errors: 0, Skipped: 0, Time elapsed: 1.96 sec - in org.apache.activemq.test.retroactive.RetroactiveConsumerTestWithLastImagePolicyWithWildcardTest
Running org.apache.activemq.test.retroactive.RetroactiveConsumerTestWithSimpleMessageListTest
Tests run: 1, Failures: 0, Errors: 0, Skipped: 0, Time elapsed: 1.863 sec - in org.apache.activemq.test.retroactive.RetroactiveConsumerTestWithSimpleMessageListTest
Running org.apache.activemq.test.retroactive.RetroactiveConsumerTestWithTimePolicyTest
Tests run: 1, Failures: 0, Errors: 0, Skipped: 0, Time elapsed: 1.855 sec - in org.apache.activemq.test.retroactive.RetroactiveConsumerTestWithTimePolicyTest
Running org.apache.activemq.test.retroactive.RetroactiveConsumerWithMessageQueryTest
Tests run: 1, Failures: 0, Errors: 0, Skipped: 0, Time elapsed: 1.881 sec - in org.apache.activemq.test.retroactive.RetroactiveConsumerWithMessageQueryTest
Running org.apache.activemq.test.rollback.CloseRollbackRedeliveryQueueTest
Tests run: 3, Failures: 0, Errors: 0, Skipped: 0, Time elapsed: 1.351 sec - in org.apache.activemq.test.rollback.CloseRollbackRedeliveryQueueTest
Running org.apache.activemq.transport.failover.BadConnectionTest
Tests run: 1, Failures: 0, Errors: 0, Skipped: 0, Time elapsed: 0.614 sec - in org.apache.activemq.transport.failover.BadConnectionTest
Running org.apache.activemq.transport.failover.FailoverBackupLeakTest
Tests run: 2, Failures: 0, Errors: 0, Skipped: 0, Time elapsed: 1.046 sec - in org.apache.activemq.transport.failover.FailoverBackupLeakTest
Running org.apache.activemq.transport.failover.FailoverTransportTest
Tests run: 4, Failures: 0, Errors: 0, Skipped: 1, Time elapsed: 0.33 sec - in org.apache.activemq.transport.failover.FailoverTransportTest
Running org.apache.activemq.transport.failover.FailoverTransportUriHandlingTest
Tests run: 4, Failures: 0, Errors: 0, Skipped: 0, Time elapsed: 0.431 sec - in org.apache.activemq.transport.failover.FailoverTransportUriHandlingTest
Running org.apache.activemq.transport.failover.FailoverUriTest
Tests run: 16, Failures: 0, Errors: 0, Skipped: 0, Time elapsed: 1.395 sec - in org.apache.activemq.transport.failover.FailoverUriTest
Running org.apache.activemq.transport.failover.SlowConnectionTest
Tests run: 1, Failures: 0, Errors: 0, Skipped: 0, Time elapsed: 1.498 sec - in org.apache.activemq.transport.failover.SlowConnectionTest
Running org.apache.activemq.transport.failover.TwoBrokerFailoverClusterTest
Tests run: 1, Failures: 0, Errors: 0, Skipped: 0, Time elapsed: 19.472 sec - in org.apache.activemq.transport.failover.TwoBrokerFailoverClusterTest
Running org.apache.activemq.transport.reliable.ReliableTransportTest
Tests run: 7, Failures: 0, Errors: 0, Skipped: 0, Time elapsed: 0.173 sec - in org.apache.activemq.transport.reliable.ReliableTransportTest
Running org.apache.activemq.transport.tcp.QualityOfServiceUtilsTest
Tests run: 6, Failures: 0, Errors: 0, Skipped: 0, Time elapsed: 0.075 sec - in org.apache.activemq.transport.tcp.QualityOfServiceUtilsTest
Running org.apache.activemq.transport.tcp.SslTransportFactoryTest
Tests run: 2, Failures: 0, Errors: 0, Skipped: 0, Time elapsed: 0.747 sec - in org.apache.activemq.transport.tcp.SslTransportFactoryTest
Running org.apache.activemq.transport.tcp.SslTransportServerTest
Tests run: 2, Failures: 0, Errors: 0, Skipped: 0, Time elapsed: 0.183 sec - in org.apache.activemq.transport.tcp.SslTransportServerTest
Running org.apache.activemq.transport.tcp.SslTransportTest
Tests run: 1, Failures: 0, Errors: 0, Skipped: 0, Time elapsed: 0.178 sec - in org.apache.activemq.transport.tcp.SslTransportTest
Running org.apache.activemq.transport.tcp.TcpTransportBindTest
Tests run: 2, Failures: 0, Errors: 0, Skipped: 0, Time elapsed: 2.186 sec - in org.apache.activemq.transport.tcp.TcpTransportBindTest
Running org.apache.activemq.transport.tcp.TcpTransportServerTest
Tests run: 1, Failures: 0, Errors: 0, Skipped: 0, Time elapsed: 0.293 sec - in org.apache.activemq.transport.tcp.TcpTransportServerTest
Running org.apache.activemq.transport.tcp.TransportConnectorInvalidSocketOptionsTest
Tests run: 2, Failures: 0, Errors: 0, Skipped: 0, Time elapsed: 0.951 sec - in org.apache.activemq.transport.tcp.TransportConnectorInvalidSocketOptionsTest
Running org.apache.activemq.transport.tcp.TransportUriTest
Tests run: 14, Failures: 0, Errors: 0, Skipped: 0, Time elapsed: 1.316 sec - in org.apache.activemq.transport.tcp.TransportUriTest
Running org.apache.activemq.transport.tcp.WireformatNegociationTest
Tests run: 5, Failures: 0, Errors: 0, Skipped: 0, Time elapsed: 0.355 sec - in org.apache.activemq.transport.tcp.WireformatNegociationTest
Running org.apache.activemq.transport.udp.UdpSendReceiveWithTwoConnectionsAndLargeMessagesTest
Tests run: 1, Failures: 0, Errors: 0, Skipped: 0, Time elapsed: 1.956 sec - in org.apache.activemq.transport.udp.UdpSendReceiveWithTwoConnectionsAndLargeMessagesTest
Running org.apache.activemq.transport.udp.UdpSendReceiveWithTwoConnectionsTest
Tests run: 1, Failures: 0, Errors: 0, Skipped: 0, Time elapsed: 2.034 sec - in org.apache.activemq.transport.udp.UdpSendReceiveWithTwoConnectionsTest
Running org.apache.activemq.transport.udp.UdpTransportTest
Tests run: 3, Failures: 0, Errors: 0, Skipped: 0, Time elapsed: 0.316 sec - in org.apache.activemq.transport.udp.UdpTransportTest
Running org.apache.activemq.transport.udp.UdpTransportUsingServerTest
Tests run: 4, Failures: 0, Errors: 0, Skipped: 0, Time elapsed: 0.379 sec - in org.apache.activemq.transport.udp.UdpTransportUsingServerTest
Running org.apache.activemq.transport.udp.UpdTransportBindTest
Tests run: 1, Failures: 0, Errors: 0, Skipped: 0, Time elapsed: 1.104 sec - in org.apache.activemq.transport.udp.UpdTransportBindTest
Running org.apache.activemq.transport.vm.VMTransportEmbeddedBrokerTest
Tests run: 1, Failures: 0, Errors: 0, Skipped: 0, Time elapsed: 1.022 sec - in org.apache.activemq.transport.vm.VMTransportEmbeddedBrokerTest
Running org.apache.activemq.transport.vm.VMTransportThreadSafeTest
Tests run: 19, Failures: 1, Errors: 0, Skipped: 0, Time elapsed: 69.329 sec <<< FAILURE!
- in org.apache.activemq.transport.vm.VMTransportThreadSafeTest
testRemoteStopSendsExceptionToPendingRequests(org.apache.activemq.transport.vm.VMTransportThreadSafeTest)
 Time elapsed: 30.043 sec  <<< FAILURE!
java.lang.AssertionError: null
	at org.junit.Assert.fail(Assert.java:86)
	at org.junit.Assert.assertTrue(Assert.java:41)
	at org.junit.Assert.assertTrue(Assert.java:52)
	at org.apache.activemq.transport.vm.VMTransportThreadSafeTest.testRemoteStopSendsExceptionToPendingRequests(VMTransportThreadSafeTest.java:320)

Running org.apache.activemq.usage.CompositeMessageCursorUsageTest
Tests run: 1, Failures: 0, Errors: 0, Skipped: 0, Time elapsed: 1.185 sec - in org.apache.activemq.usage.CompositeMessageCursorUsageTest
Running org.apache.activemq.usage.JobSchedulerStoreUsageTest
Tests run: 1, Failures: 0, Errors: 0, Skipped: 0, Time elapsed: 31.721 sec - in org.apache.activemq.usage.JobSchedulerStoreUsageTest
Running org.apache.activemq.usage.StoreUsageLimitsTest
Tests run: 1, Failures: 0, Errors: 0, Skipped: 0, Time elapsed: 1.641 sec - in org.apache.activemq.usage.StoreUsageLimitsTest
Running org.apache.activemq.usecases.AdvisoryTopicDeletionTest
Tests run: 2, Failures: 0, Errors: 0, Skipped: 0, Time elapsed: 1.116 sec - in org.apache.activemq.usecases.AdvisoryTopicDeletionTest
Running org.apache.activemq.usecases.AuthorizationFromAdminViewTest
Tests run: 1, Failures: 0, Errors: 0, Skipped: 0, Time elapsed: 0.934 sec - in org.apache.activemq.usecases.AuthorizationFromAdminViewTest
Running org.apache.activemq.usecases.BacklogNetworkCrossTalkTest
Tests run: 1, Failures: 0, Errors: 0, Skipped: 0, Time elapsed: 33.948 sec - in org.apache.activemq.usecases.BacklogNetworkCrossTalkTest
Running org.apache.activemq.usecases.BrokerQueueNetworkWithDisconnectTest
Tests run: 4, Failures: 0, Errors: 0, Skipped: 0, Time elapsed: 78.384 sec - in org.apache.activemq.usecases.BrokerQueueNetworkWithDisconnectTest
Running org.apache.activemq.usecases.BrowseDLQTest
Tests run: 1, Failures: 0, Errors: 0, Skipped: 0, Time elapsed: 4.206 sec - in org.apache.activemq.usecases.BrowseDLQTest
Running org.apache.activemq.usecases.ChangeSentMessageTest
Tests run: 1, Failures: 0, Errors: 0, Skipped: 0, Time elapsed: 1.222 sec - in org.apache.activemq.usecases.ChangeSentMessageTest
Running org.apache.activemq.usecases.ChangeSessionDeliveryModeTest
Tests run: 1, Failures: 0, Errors: 0, Skipped: 0, Time elapsed: 1.038 sec - in org.apache.activemq.usecases.ChangeSessionDeliveryModeTest
Running org.apache.activemq.usecases.CompositeConsumeTest
Tests run: 1, Failures: 0, Errors: 0, Skipped: 0, Time elapsed: 1.41 sec - in org.apache.activemq.usecases.CompositeConsumeTest
Running org.apache.activemq.usecases.ConsumeQueuePrefetchTest
Tests run: 4, Failures: 0, Errors: 0, Skipped: 0, Time elapsed: 2.001 sec - in org.apache.activemq.usecases.ConsumeQueuePrefetchTest
Running org.apache.activemq.usecases.ConsumeTopicPrefetchTest
Tests run: 3, Failures: 0, Errors: 0, Skipped: 0, Time elapsed: 1.574 sec - in org.apache.activemq.usecases.ConsumeTopicPrefetchTest
Running org.apache.activemq.usecases.CreateTemporaryQueueBeforeStartTest
Tests run: 3, Failures: 0, Errors: 0, Skipped: 0, Time elapsed: 1.218 sec - in org.apache.activemq.usecases.CreateTemporaryQueueBeforeStartTest
Running org.apache.activemq.usecases.DurableSubInBrokerNetworkTest
Tests run: 2, Failures: 0, Errors: 0, Skipped: 0, Time elapsed: 2.065 sec - in org.apache.activemq.usecases.DurableSubInBrokerNetworkTest
Running org.apache.activemq.usecases.DurableSubProcessConcurrentCommitActivateNoDuplicateTest
Tests run: 1, Failures: 0, Errors: 0, Skipped: 1, Time elapsed: 0.114 sec - in org.apache.activemq.usecases.DurableSubProcessConcurrentCommitActivateNoDuplicateTest
Running org.apache.activemq.usecases.DurableSubProcessWithRestartTest
Tests run: 1, Failures: 0, Errors: 0, Skipped: 1, Time elapsed: 0.115 sec - in org.apache.activemq.usecases.DurableSubProcessWithRestartTest
Running org.apache.activemq.usecases.DurableSubsOfflineSelectorConcurrentConsumeIndexUseTest
Tests run: 1, Failures: 0, Errors: 0, Skipped: 0, Time elapsed: 14.473 sec - in org.apache.activemq.usecases.DurableSubsOfflineSelectorConcurrentConsumeIndexUseTest
Running org.apache.activemq.usecases.DurableSubsOfflineSelectorIndexUseTest
Tests run: 3, Failures: 0, Errors: 0, Skipped: 0, Time elapsed: 24.355 sec - in org.apache.activemq.usecases.DurableSubsOfflineSelectorIndexUseTest
Running org.apache.activemq.usecases.DurableSubscriberWithNetworkRestartTest
Tests run: 2, Failures: 0, Errors: 0, Skipped: 0, Time elapsed: 22.427 sec - in org.apache.activemq.usecases.DurableSubscriberWithNetworkRestartTest
Running org.apache.activemq.usecases.DurableSubscriptionOffline1Test
Killed
Running org.apache.activemq.usecases.DurableSubscriptionOffline2Test
Tests run: 2, Failures: 0, Errors: 0, Skipped: 0, Time elapsed: 4.208 sec - in org.apache.activemq.usecases.DurableSubscriptionOffline2Test
Running org.apache.activemq.usecases.DurableSubscriptionOffline3Test
Tests run: 12, Failures: 0, Errors: 0, Skipped: 0, Time elapsed: 117.431 sec - in org.apache.activemq.usecases.DurableSubscriptionOffline3Test
Running org.apache.activemq.usecases.DurableSubscriptionOffline4Test
Tests run: 2, Failures: 0, Errors: 0, Skipped: 0, Time elapsed: 7.748 sec - in org.apache.activemq.usecases.DurableSubscriptionOffline4Test
Running org.apache.activemq.usecases.ExceptionListenerTest
Tests run: 1, Failures: 0, Errors: 0, Skipped: 0, Time elapsed: 0.059 sec - in org.apache.activemq.usecases.ExceptionListenerTest
Running org.apache.activemq.usecases.LevelDBDurableSubscriptionTest
Tests run: 12, Failures: 0, Errors: 0, Skipped: 0, Time elapsed: 26.438 sec - in org.apache.activemq.usecases.LevelDBDurableSubscriptionTest
Running org.apache.activemq.usecases.ManagedDurableSubscriptionTest
Tests run: 1, Failures: 0, Errors: 0, Skipped: 0, Time elapsed: 1.842 sec - in org.apache.activemq.usecases.ManagedDurableSubscriptionTest
Running org.apache.activemq.usecases.MemoryLimitTest
Tests run: 6, Failures: 0, Errors: 0, Skipped: 3, Time elapsed: 31.411 sec - in org.apache.activemq.usecases.MemoryLimitTest
Running org.apache.activemq.usecases.MessageGroupLateArrivalsTest
Tests run: 2, Failures: 0, Errors: 0, Skipped: 0, Time elapsed: 1.996 sec - in org.apache.activemq.usecases.MessageGroupLateArrivalsTest
Running org.apache.activemq.usecases.NewConsumerCreatesDestinationTest
Tests run: 1, Failures: 0, Errors: 0, Skipped: 0, Time elapsed: 1.06 sec - in org.apache.activemq.usecases.NewConsumerCreatesDestinationTest
Running org.apache.activemq.usecases.ObjectMessageNotSerializableTest
Tests run: 2, Failures: 0, Errors: 0, Skipped: 0, Time elapsed: 0.894 sec - in org.apache.activemq.usecases.ObjectMessageNotSerializableTest
Running org.apache.activemq.usecases.PublishOnDurableTopicConsumedMessageTest
Tests run: 1, Failures: 0, Errors: 0, Skipped: 0, Time elapsed: 2.117 sec - in org.apache.activemq.usecases.PublishOnDurableTopicConsumedMessageTest
Running org.apache.activemq.usecases.PublishOnQueueConsumedMessageTest
Tests run: 1, Failures: 0, Errors: 0, Skipped: 0, Time elapsed: 2.142 sec - in org.apache.activemq.usecases.PublishOnQueueConsumedMessageTest
Running org.apache.activemq.usecases.PublishOnTemporaryQueueConsumedMessageTest
Tests run: 1, Failures: 0, Errors: 0, Skipped: 0, Time elapsed: 2.108 sec - in org.apache.activemq.usecases.PublishOnTemporaryQueueConsumedMessageTest
Running org.apache.activemq.usecases.QueueBrowsingLevelDBTest
Tests run: 3, Failures: 0, Errors: 0, Skipped: 0, Time elapsed: 5.707 sec - in org.apache.activemq.usecases.QueueBrowsingLevelDBTest
Running org.apache.activemq.usecases.QueueBrowsingLimitTest
Tests run: 1, Failures: 0, Errors: 0, Skipped: 0, Time elapsed: 2.681 sec - in org.apache.activemq.usecases.QueueBrowsingLimitTest
Running org.apache.activemq.usecases.QueueBrowsingTest
Tests run: 3, Failures: 1, Errors: 0, Skipped: 0, Time elapsed: 6.692 sec <<< FAILURE!
- in org.apache.activemq.usecases.QueueBrowsingTest
testMemoryLimit(org.apache.activemq.usecases.QueueBrowsingTest)  Time elapsed: 2.469 sec 
<<< FAILURE!
java.lang.AssertionError: expected:<102> but was:<101>
	at org.junit.Assert.fail(Assert.java:88)
	at org.junit.Assert.failNotEquals(Assert.java:743)
	at org.junit.Assert.assertEquals(Assert.java:118)
	at org.junit.Assert.assertEquals(Assert.java:555)
	at org.junit.Assert.assertEquals(Assert.java:542)
	at org.apache.activemq.usecases.QueueBrowsingTest.testMemoryLimit(QueueBrowsingTest.java:212)

Running org.apache.activemq.usecases.QueueRepeaterTest
Tests run: 1, Failures: 0, Errors: 0, Skipped: 0, Time elapsed: 1.107 sec - in org.apache.activemq.usecases.QueueRepeaterTest
Running org.apache.activemq.usecases.RequestReplyTempDestRemovalAdvisoryRaceTest
Tests run: 8, Failures: 0, Errors: 0, Skipped: 0, Time elapsed: 117.959 sec - in org.apache.activemq.usecases.RequestReplyTempDestRemovalAdvisoryRaceTest
Running org.apache.activemq.usecases.RequestReplyToTopicViaThreeNetworkHopsTest
Tests run: 1, Failures: 0, Errors: 0, Skipped: 0, Time elapsed: 11.457 sec - in org.apache.activemq.usecases.RequestReplyToTopicViaThreeNetworkHopsTest
Running org.apache.activemq.usecases.SingleBrokerVirtualDestinationsWithWildcardLevelDBTest
Tests run: 4, Failures: 0, Errors: 0, Skipped: 0, Time elapsed: 41.102 sec - in org.apache.activemq.usecases.SingleBrokerVirtualDestinationsWithWildcardLevelDBTest
Running org.apache.activemq.usecases.SubscribeClosePublishThenConsumeTest
Tests run: 1, Failures: 0, Errors: 0, Skipped: 0, Time elapsed: 1.62 sec - in org.apache.activemq.usecases.SubscribeClosePublishThenConsumeTest
Running org.apache.activemq.usecases.ThreeBrokerTempDestDemandSubscriptionCleanupTest
Tests run: 2, Failures: 0, Errors: 0, Skipped: 0, Time elapsed: 9.427 sec - in org.apache.activemq.usecases.ThreeBrokerTempDestDemandSubscriptionCleanupTest
Running org.apache.activemq.usecases.ThreeBrokerVirtualTopicNetworkLevelDBTest
Tests run: 1, Failures: 0, Errors: 0, Skipped: 0, Time elapsed: 22.31 sec - in org.apache.activemq.usecases.ThreeBrokerVirtualTopicNetworkLevelDBTest
Running org.apache.activemq.usecases.TopicDurableConnectStatsTest
Tests run: 1, Failures: 0, Errors: 0, Skipped: 0, Time elapsed: 2.586 sec - in org.apache.activemq.usecases.TopicDurableConnectStatsTest
Running org.apache.activemq.usecases.TopicSubscriptionZeroPrefetchTest
Tests run: 2, Failures: 0, Errors: 0, Skipped: 0, Time elapsed: 2.384 sec - in org.apache.activemq.usecases.TopicSubscriptionZeroPrefetchTest
Running org.apache.activemq.usecases.TransactionRollbackOrderTest
Tests run: 1, Failures: 0, Errors: 0, Skipped: 0, Time elapsed: 2.152 sec - in org.apache.activemq.usecases.TransactionRollbackOrderTest
Running org.apache.activemq.usecases.TransactionTest
Tests run: 1, Failures: 0, Errors: 0, Skipped: 0, Time elapsed: 1.082 sec - in org.apache.activemq.usecases.TransactionTest
Running org.apache.activemq.usecases.TwoBrokerVirtualTopicForwardingTest
Tests run: 3, Failures: 0, Errors: 0, Skipped: 0, Time elapsed: 17.104 sec - in org.apache.activemq.usecases.TwoBrokerVirtualTopicForwardingTest
Running org.apache.activemq.usecases.TwoSecureBrokerRequestReplyTest
Tests run: 1, Failures: 0, Errors: 0, Skipped: 0, Time elapsed: 63.557 sec - in org.apache.activemq.usecases.TwoSecureBrokerRequestReplyTest
Running org.apache.activemq.usecases.VerifyNetworkConsumersDisconnectTest
Tests run: 2, Failures: 0, Errors: 0, Skipped: 0, Time elapsed: 33.757 sec - in org.apache.activemq.usecases.VerifyNetworkConsumersDisconnectTest
Running org.apache.activemq.usecases.VirtualTopicNetworkClusterReactivationTest
Tests run: 1, Failures: 0, Errors: 0, Skipped: 0, Time elapsed: 7.237 sec - in org.apache.activemq.usecases.VirtualTopicNetworkClusterReactivationTest
Running org.apache.activemq.util.LinkedNodeTest
Tests run: 3, Failures: 0, Errors: 0, Skipped: 0, Time elapsed: 0.065 sec - in org.apache.activemq.util.LinkedNodeTest
Running org.apache.activemq.util.ReflectionSupportTest
Tests run: 3, Failures: 0, Errors: 0, Skipped: 0, Time elapsed: 0.187 sec - in org.apache.activemq.util.ReflectionSupportTest
Running org.apache.activemq.xbean.JDBCPersistenceAdapterXBeanConfigTest
Tests run: 1, Failures: 0, Errors: 0, Skipped: 0, Time elapsed: 3.951 sec - in org.apache.activemq.xbean.JDBCPersistenceAdapterXBeanConfigTest
Running org.apache.activemq.xbean.ManagementContextXBeanConfigTest
Tests run: 3, Failures: 0, Errors: 0, Skipped: 0, Time elapsed: 4.799 sec - in org.apache.activemq.xbean.ManagementContextXBeanConfigTest
Running org.apache.activemq.xbean.MultipleTestsWithEmbeddedBrokerAndPersistenceTest
Tests run: 2, Failures: 0, Errors: 0, Skipped: 0, Time elapsed: 2.51 sec - in org.apache.activemq.xbean.MultipleTestsWithEmbeddedBrokerAndPersistenceTest
Running org.apache.activemq.xbean.MultipleTestsWithEmbeddedBrokerTest
Tests run: 2, Failures: 0, Errors: 0, Skipped: 0, Time elapsed: 1.012 sec - in org.apache.activemq.xbean.MultipleTestsWithEmbeddedBrokerTest
Running org.apache.activemq.xbean.XBeanConfigTest
Tests run: 1, Failures: 0, Errors: 0, Skipped: 0, Time elapsed: 1.752 sec - in org.apache.activemq.xbean.XBeanConfigTest
Running org.apache.activemq.xbean.XBeanStartFalseTest
Tests run: 1, Failures: 0, Errors: 0, Skipped: 0, Time elapsed: 1.463 sec - in org.apache.activemq.xbean.XBeanStartFalseTest

Results :

Failed tests: 
  VMTransportThreadSafeTest.testRemoteStopSendsExceptionToPendingRequests:320 null
  QueueBrowsingTest.testMemoryLimit:212 expected:<102> but was:<101>

Tests run: 2773, Failures: 2, Errors: 0, Skipped: 16

[JENKINS] Recording test results

Mime
View raw message