activemq-commits mailing list archives

Site index · List index
Message view « Date » · « Thread »
Top « Date » · « Thread »
From Apache Jenkins Server <jenk...@builds.apache.org>
Subject Build failed in Jenkins: ActiveMQ-Java8 » ActiveMQ :: Spring #116
Date Fri, 19 Sep 2014 09:15:55 GMT
See <https://builds.apache.org/job/ActiveMQ-Java8/org.apache.activemq$activemq-spring/116/>

------------------------------------------
[INFO]                                                                         
[INFO] ------------------------------------------------------------------------
[INFO] Building ActiveMQ :: Spring 5.11-SNAPSHOT
[INFO] ------------------------------------------------------------------------
Downloading: http://repo.maven.apache.org/maven2/org/eclipse/jetty/maven-jetty-plugin/7.6.9.v20130131/maven-jetty-plugin-7.6.9.v20130131.pom
[WARNING] The POM for org.eclipse.jetty:maven-jetty-plugin:jar:7.6.9.v20130131 is missing,
no dependency information available
[WARNING] Failed to retrieve plugin descriptor for org.eclipse.jetty:maven-jetty-plugin:7.6.9.v20130131:
Plugin org.eclipse.jetty:maven-jetty-plugin:7.6.9.v20130131 or one of its dependencies could
not be resolved: Failed to read artifact descriptor for org.eclipse.jetty:maven-jetty-plugin:jar:7.6.9.v20130131
[INFO] 
[INFO] --- maven-clean-plugin:2.5:clean (default-clean) @ activemq-spring ---
[INFO] Deleting <https://builds.apache.org/job/ActiveMQ-Java8/org.apache.activemq$activemq-spring/ws/target>
[INFO] 
[INFO] --- maven-enforcer-plugin:1.0.1:enforce (default) @ activemq-spring ---
[INFO] 
[INFO] --- maven-bundle-plugin:2.3.7:cleanVersions (cleanVersions) @ activemq-spring ---
[INFO] 
[INFO] --- maven-remote-resources-plugin:1.3:process (default) @ activemq-spring ---
[INFO] 
[INFO] --- maven-resources-plugin:2.5:resources (default-resources) @ activemq-spring ---
[debug] execute contextualize
[INFO] Using 'UTF-8' encoding to copy filtered resources.
[INFO] Copying 1 resource
[INFO] Copying 3 resources
[INFO] 
[INFO] --- maven-compiler-plugin:3.1:compile (default-compile) @ activemq-spring ---
[INFO] Changes detected - recompiling the module!
[INFO] Compiling 20 source files to <https://builds.apache.org/job/ActiveMQ-Java8/org.apache.activemq$activemq-spring/ws/target/classes>
[WARNING] bootstrap class path not set in conjunction with -source 1.7
[WARNING] <https://builds.apache.org/job/ActiveMQ-Java8/org.apache.activemq$activemq-spring/ws/src/main/java/org/apache/activemq/spring/SpringBrokerContext.java>:
<https://builds.apache.org/job/ActiveMQ-Java8/org.apache.activemq$activemq-spring/ws/src/main/java/org/apache/activemq/spring/SpringBrokerContext.java>
uses unchecked or unsafe operations.
[WARNING] <https://builds.apache.org/job/ActiveMQ-Java8/org.apache.activemq$activemq-spring/ws/src/main/java/org/apache/activemq/spring/SpringBrokerContext.java>:
Recompile with -Xlint:unchecked for details.
[INFO] 
[INFO] --- maven-xbean-plugin:3.12:mapping (default) @ activemq-spring ---
[INFO] Generating META-INF properties file: <https://builds.apache.org/job/ActiveMQ-Java8/org.apache.activemq$activemq-spring/ws/target/classes/META-INF/services/org/apache/xbean/spring/http/activemq.apache.org/schema/core>
for namespace: http://activemq.apache.org/schema/core
[INFO] Generating Spring 2.0 handler mapping: <https://builds.apache.org/job/ActiveMQ-Java8/org.apache.activemq$activemq-spring/ws/target/classes/META-INF/spring.handlers>
for namespace: http://activemq.apache.org/schema/core
[INFO] Generating HTML documentation file: <https://builds.apache.org/job/ActiveMQ-Java8/org.apache.activemq$activemq-spring/ws/target/classes/activemq.xsd.html>
for namespace: http://activemq.apache.org/schema/core
Warning, could not load class: org.apache.camel.CamelContext: java.lang.ClassNotFoundException:
org.apache.camel.CamelContext
Warning, could not load class: org.apache.activemq.camel.component.ActiveMQComponent: java.lang.ClassNotFoundException:
org.apache.activemq.camel.component.ActiveMQComponent
Warning, could not load class: T: java.lang.ClassNotFoundException: T
Warning, could not load class: T: java.lang.ClassNotFoundException: T
Warning, could not load class: org.apache.activemq.partition.dto.Partitioning: java.lang.ClassNotFoundException:
org.apache.activemq.partition.dto.Partitioning
Warning, could not load class: T: java.lang.ClassNotFoundException: T
Warning, could not load class: T: java.lang.ClassNotFoundException: T
[INFO] Generating XSD file: <https://builds.apache.org/job/ActiveMQ-Java8/org.apache.activemq$activemq-spring/ws/target/classes/activemq.xsd>
for namespace: http://activemq.apache.org/schema/core
[INFO] Generating WIKI documentation file: <https://builds.apache.org/job/ActiveMQ-Java8/org.apache.activemq$activemq-spring/ws/target/classes/activemq.xsd.wiki>
for namespace: http://activemq.apache.org/schema/core
[INFO] ...done.
[INFO] 
[INFO] --- maven-resources-plugin:2.5:testResources (default-testResources) @ activemq-spring
---
[debug] execute contextualize
[INFO] Using 'UTF-8' encoding to copy filtered resources.
[INFO] Copying 8 resources
[INFO] Copying 3 resources
[INFO] 
[INFO] --- maven-compiler-plugin:3.1:testCompile (default-testCompile) @ activemq-spring ---
[INFO] Changes detected - recompiling the module!
[INFO] Compiling 12 source files to <https://builds.apache.org/job/ActiveMQ-Java8/org.apache.activemq$activemq-spring/ws/target/test-classes>
[WARNING] bootstrap class path not set in conjunction with -source 1.7
[INFO] 
[INFO] --- maven-surefire-plugin:2.16:test (default-test) @ activemq-spring ---
[INFO] Surefire report directory: <https://builds.apache.org/job/ActiveMQ-Java8/org.apache.activemq$activemq-spring/ws/target/surefire-reports>

-------------------------------------------------------
 T E S T S
-------------------------------------------------------
Running org.apache.bugs.LoadBalanceTest
Tests run: 2, Failures: 0, Errors: 0, Skipped: 1, Time elapsed: 11.071 sec - in org.apache.bugs.LoadBalanceTest
Running org.apache.bugs.AMQ2754Test
Tests run: 1, Failures: 0, Errors: 0, Skipped: 0, Time elapsed: 13.387 sec - in org.apache.bugs.AMQ2754Test
Running org.apache.bugs.AMQ1730Test
Killed

Results :

Tests run: 3, Failures: 0, Errors: 0, Skipped: 1

[JENKINS] Recording test results

Mime
View raw message