activemq-commits mailing list archives

Site index · List index
Message view « Date » · « Thread »
Top « Date » · « Thread »
From Apache Jenkins Server <jenk...@builds.apache.org>
Subject Build failed in Jenkins: ActiveMQ-openwire #4
Date Thu, 14 Aug 2014 22:00:15 GMT
See <https://builds.apache.org/job/ActiveMQ-openwire/4/changes>

Changes:

[tabish121] add some more to dependency management.

------------------------------------------
[...truncated 453 lines...]
Downloading: http://repo.maven.apache.org/maven2/org/eclipse/jetty/jetty-io/7.2.1.v20101111/jetty-io-7.2.1.v20101111.pom
Downloaded: http://repo.maven.apache.org/maven2/org/eclipse/jetty/jetty-io/7.2.1.v20101111/jetty-io-7.2.1.v20101111.pom
(3 KB at 41.4 KB/sec)
Downloading: http://repo.maven.apache.org/maven2/org/eclipse/jetty/jetty-util/7.2.1.v20101111/jetty-util-7.2.1.v20101111.pom
Downloaded: http://repo.maven.apache.org/maven2/org/eclipse/jetty/jetty-util/7.2.1.v20101111/jetty-util-7.2.1.v20101111.pom
(3 KB at 52.4 KB/sec)
Downloading: http://repo.maven.apache.org/maven2/org/eclipse/jetty/jetty-webapp/7.2.1.v20101111/jetty-webapp-7.2.1.v20101111.pom
Downloaded: http://repo.maven.apache.org/maven2/org/eclipse/jetty/jetty-webapp/7.2.1.v20101111/jetty-webapp-7.2.1.v20101111.pom
(4 KB at 59.3 KB/sec)
Downloading: http://repo.maven.apache.org/maven2/org/eclipse/jetty/jetty-xml/7.2.1.v20101111/jetty-xml-7.2.1.v20101111.pom
Downloaded: http://repo.maven.apache.org/maven2/org/eclipse/jetty/jetty-xml/7.2.1.v20101111/jetty-xml-7.2.1.v20101111.pom
(3 KB at 19.7 KB/sec)
Downloading: http://repo.maven.apache.org/maven2/org/eclipse/jetty/jetty-servlet/7.2.1.v20101111/jetty-servlet-7.2.1.v20101111.pom
Downloaded: http://repo.maven.apache.org/maven2/org/eclipse/jetty/jetty-servlet/7.2.1.v20101111/jetty-servlet-7.2.1.v20101111.pom
(3 KB at 36.1 KB/sec)
Downloading: http://repo.maven.apache.org/maven2/org/eclipse/jetty/jetty-security/7.2.1.v20101111/jetty-security-7.2.1.v20101111.pom
Downloaded: http://repo.maven.apache.org/maven2/org/eclipse/jetty/jetty-security/7.2.1.v20101111/jetty-security-7.2.1.v20101111.pom
(3 KB at 17.3 KB/sec)
Downloading: http://repo.maven.apache.org/maven2/org/fusesource/scalate/scalate-wikitext_2.10/1.6.1/scalate-wikitext_2.10-1.6.1.jar
Downloading: http://repo.maven.apache.org/maven2/org/fusesource/scalate/scalate-core_2.10/1.6.1/scalate-core_2.10-1.6.1.jar
Downloading: http://repo.maven.apache.org/maven2/org/fusesource/scalate/scalate-util_2.10/1.6.1/scalate-util_2.10-1.6.1.jar
Downloading: http://repo.maven.apache.org/maven2/org/fusesource/wikitext/confluence-core/1.4/confluence-core-1.4.jar
Downloading: http://repo.maven.apache.org/maven2/org/fusesource/wikitext/wikitext-core/1.4/wikitext-core-1.4.jar
Downloaded: http://repo.maven.apache.org/maven2/org/fusesource/scalate/scalate-wikitext_2.10/1.6.1/scalate-wikitext_2.10-1.6.1.jar
(163 KB at 974.8 KB/sec)
Downloading: http://repo.maven.apache.org/maven2/org/fusesource/wikitext/textile-core/1.4/textile-core-1.4.jar
Downloaded: http://repo.maven.apache.org/maven2/org/fusesource/wikitext/confluence-core/1.4/confluence-core-1.4.jar
(67 KB at 291.3 KB/sec)
Downloading: http://repo.maven.apache.org/maven2/org/fusesource/scalate/scalate-page_2.10/1.6.1/scalate-page_2.10-1.6.1.jar
Downloaded: http://repo.maven.apache.org/maven2/org/fusesource/wikitext/wikitext-core/1.4/wikitext-core-1.4.jar
(236 KB at 992.9 KB/sec)
Downloading: http://repo.maven.apache.org/maven2/org/yaml/snakeyaml/1.7/snakeyaml-1.7.jar
Downloaded: http://repo.maven.apache.org/maven2/org/fusesource/scalate/scalate-util_2.10/1.6.1/scalate-util_2.10-1.6.1.jar
(289 KB at 1067.9 KB/sec)
Downloading: http://repo.maven.apache.org/maven2/org/fusesource/scalamd/scalamd_2.10/1.6/scalamd_2.10-1.6.jar
Downloaded: http://repo.maven.apache.org/maven2/org/fusesource/wikitext/textile-core/1.4/textile-core-1.4.jar
(54 KB at 366.0 KB/sec)
Downloading: http://repo.maven.apache.org/maven2/org/fusesource/scalate/scalate-test_2.10/1.6.1/scalate-test_2.10-1.6.1.jar
Downloaded: http://repo.maven.apache.org/maven2/org/yaml/snakeyaml/1.7/snakeyaml-1.7.jar (248
KB at 1874.9 KB/sec)
Downloading: http://repo.maven.apache.org/maven2/org/scalatest/scalatest_2.10.0/1.8/scalatest_2.10.0-1.8.jar
Downloaded: http://repo.maven.apache.org/maven2/org/fusesource/scalamd/scalamd_2.10/1.6/scalamd_2.10-1.6.jar
(85 KB at 554.8 KB/sec)
Downloading: http://repo.maven.apache.org/maven2/org/seleniumhq/selenium/selenium-htmlunit-driver/2.0a5/selenium-htmlunit-driver-2.0a5.jar
Downloaded: http://repo.maven.apache.org/maven2/org/seleniumhq/selenium/selenium-htmlunit-driver/2.0a5/selenium-htmlunit-driver-2.0a5.jar
(34 KB at 631.9 KB/sec)
Downloading: http://repo.maven.apache.org/maven2/org/seleniumhq/selenium/selenium-common/2.0a5/selenium-common-2.0a5.jar
Downloaded: http://repo.maven.apache.org/maven2/org/fusesource/scalate/scalate-page_2.10/1.6.1/scalate-page_2.10-1.6.1.jar
(97 KB at 380.2 KB/sec)
Downloading: http://repo.maven.apache.org/maven2/org/eclipse/jetty/jetty-server/7.2.1.v20101111/jetty-server-7.2.1.v20101111.jar
Downloaded: http://repo.maven.apache.org/maven2/org/fusesource/scalate/scalate-test_2.10/1.6.1/scalate-test_2.10-1.6.1.jar
(47 KB at 234.6 KB/sec)
Downloading: http://repo.maven.apache.org/maven2/org/eclipse/jetty/jetty-continuation/7.2.1.v20101111/jetty-continuation-7.2.1.v20101111.jar
Downloaded: http://repo.maven.apache.org/maven2/org/seleniumhq/selenium/selenium-common/2.0a5/selenium-common-2.0a5.jar
(114 KB at 1460.6 KB/sec)
Downloading: http://repo.maven.apache.org/maven2/org/eclipse/jetty/jetty-http/7.2.1.v20101111/jetty-http-7.2.1.v20101111.jar
Downloaded: http://repo.maven.apache.org/maven2/org/eclipse/jetty/jetty-continuation/7.2.1.v20101111/jetty-continuation-7.2.1.v20101111.jar
(20 KB at 377.8 KB/sec)
Downloading: http://repo.maven.apache.org/maven2/org/eclipse/jetty/jetty-io/7.2.1.v20101111/jetty-io-7.2.1.v20101111.jar
Downloaded: http://repo.maven.apache.org/maven2/org/fusesource/scalate/scalate-core_2.10/1.6.1/scalate-core_2.10-1.6.1.jar
(1934 KB at 3333.6 KB/sec)
Downloading: http://repo.maven.apache.org/maven2/org/eclipse/jetty/jetty-webapp/7.2.1.v20101111/jetty-webapp-7.2.1.v20101111.jar
Downloaded: http://repo.maven.apache.org/maven2/org/eclipse/jetty/jetty-webapp/7.2.1.v20101111/jetty-webapp-7.2.1.v20101111.jar
(90 KB at 1517.6 KB/sec)
Downloading: http://repo.maven.apache.org/maven2/org/eclipse/jetty/jetty-xml/7.2.1.v20101111/jetty-xml-7.2.1.v20101111.jar
Downloaded: http://repo.maven.apache.org/maven2/org/eclipse/jetty/jetty-server/7.2.1.v20101111/jetty-server-7.2.1.v20101111.jar
(275 KB at 1594.6 KB/sec)
Downloading: http://repo.maven.apache.org/maven2/org/eclipse/jetty/jetty-servlet/7.2.1.v20101111/jetty-servlet-7.2.1.v20101111.jar
Downloaded: http://repo.maven.apache.org/maven2/org/eclipse/jetty/jetty-xml/7.2.1.v20101111/jetty-xml-7.2.1.v20101111.jar
(29 KB at 516.7 KB/sec)
Downloading: http://repo.maven.apache.org/maven2/org/eclipse/jetty/jetty-security/7.2.1.v20101111/jetty-security-7.2.1.v20101111.jar
Downloaded: http://repo.maven.apache.org/maven2/org/eclipse/jetty/jetty-io/7.2.1.v20101111/jetty-io-7.2.1.v20101111.jar
(75 KB at 506.4 KB/sec)
Downloading: http://repo.maven.apache.org/maven2/org/eclipse/jetty/jetty-util/7.2.1.v20101111/jetty-util-7.2.1.v20101111.jar
Downloaded: http://repo.maven.apache.org/maven2/org/eclipse/jetty/jetty-servlet/7.2.1.v20101111/jetty-servlet-7.2.1.v20101111.jar
(77 KB at 989.2 KB/sec)
Downloaded: http://repo.maven.apache.org/maven2/org/eclipse/jetty/jetty-security/7.2.1.v20101111/jetty-security-7.2.1.v20101111.jar
(75 KB at 1298.9 KB/sec)
Downloaded: http://repo.maven.apache.org/maven2/org/eclipse/jetty/jetty-http/7.2.1.v20101111/jetty-http-7.2.1.v20101111.jar
(97 KB at 429.7 KB/sec)
Downloaded: http://repo.maven.apache.org/maven2/org/eclipse/jetty/jetty-util/7.2.1.v20101111/jetty-util-7.2.1.v20101111.jar
(192 KB at 562.9 KB/sec)
Downloaded: http://repo.maven.apache.org/maven2/org/scalatest/scalatest_2.10.0/1.8/scalatest_2.10.0-1.8.jar
(3035 KB at 2855.0 KB/sec)
[INFO] 
[INFO] --- maven-clean-plugin:2.5:clean (default-clean) @ openwire-website ---
[INFO] 
[INFO] --- maven-antrun-plugin:1.7:run (default) @ openwire-website ---
[WARNING] Parameter tasks is deprecated, use target instead
[INFO] Executing tasks

main:
    [mkdir] Created dir: <https://builds.apache.org/job/ActiveMQ-openwire/ws/openwire-website/target/sitegen/documentation/schema>
[INFO] Executed tasks
[INFO] 
[INFO] --- maven-remote-resources-plugin:1.5:process (default) @ openwire-website ---
[INFO] 
[INFO] --- scala-maven-plugin:3.1.0:compile (default) @ openwire-website ---
[INFO] <https://builds.apache.org/job/ActiveMQ-openwire/ws/openwire-website/ext>:-1:
info: compiling
[INFO] Compiling 3 source files to <https://builds.apache.org/job/ActiveMQ-openwire/ws/openwire-website/target/classes>
at 1408053584478
[INFO] prepare-compile in 0 s
[INFO] compile in 5 s
[INFO] 
[INFO] --- scala-maven-plugin:3.1.0:testCompile (default) @ openwire-website ---
[WARNING] No source files found.
[INFO] 
[INFO] --- maven-site-plugin:3.3:attach-descriptor (attach-descriptor) @ openwire-website
---
[WARNING] Failed to getClass for org.apache.maven.plugin.source.SourceJarMojo
[INFO] 
[INFO] --- maven-source-plugin:2.2.1:jar (attach-sources) @ openwire-website ---
[INFO] 
[INFO] --- maven-scalate-plugin_2.10:1.6.1:sitegen (sitegen) @ openwire-website ---
Downloading: http://repo.maven.apache.org/maven2/org/slf4j/slf4j-nop/1.6.1/slf4j-nop-1.6.1.pom
Downloaded: http://repo.maven.apache.org/maven2/org/slf4j/slf4j-nop/1.6.1/slf4j-nop-1.6.1.pom
(2 KB at 25.7 KB/sec)
Downloading: http://repo.maven.apache.org/maven2/org/apache/maven/wagon/wagon-ssh/2.2/wagon-ssh-2.2.pom
Downloaded: http://repo.maven.apache.org/maven2/org/apache/maven/wagon/wagon-ssh/2.2/wagon-ssh-2.2.pom
(6 KB at 85.7 KB/sec)
Downloading: http://repo.maven.apache.org/maven2/org/apache/maven/wagon/wagon-ssh-common/2.2/wagon-ssh-common-2.2.pom
Downloaded: http://repo.maven.apache.org/maven2/org/apache/maven/wagon/wagon-ssh-common/2.2/wagon-ssh-common-2.2.pom
(2 KB at 32.6 KB/sec)
Downloading: http://repo.maven.apache.org/maven2/org/codehaus/swizzle/swizzle-confluence/1.4/swizzle-confluence-1.4.pom
Downloaded: http://repo.maven.apache.org/maven2/org/codehaus/swizzle/swizzle-confluence/1.4/swizzle-confluence-1.4.pom
(2 KB at 27.9 KB/sec)
Downloading: http://repo.maven.apache.org/maven2/org/codehaus/swizzle/swizzle/1.4/swizzle-1.4.pom
Downloaded: http://repo.maven.apache.org/maven2/org/codehaus/swizzle/swizzle/1.4/swizzle-1.4.pom
(4 KB at 61.0 KB/sec)
Downloading: http://repo.maven.apache.org/maven2/xmlrpc/xmlrpc-client/3.0/xmlrpc-client-3.0.pom
Downloaded: http://repo.maven.apache.org/maven2/xmlrpc/xmlrpc-client/3.0/xmlrpc-client-3.0.pom
(808 B at 12.0 KB/sec)
Downloading: http://repo.maven.apache.org/maven2/org/slf4j/slf4j-nop/1.6.1/slf4j-nop-1.6.1.jar
Downloading: http://repo.maven.apache.org/maven2/org/apache/maven/wagon/wagon-ssh/2.2/wagon-ssh-2.2.jar
Downloading: http://repo.maven.apache.org/maven2/org/apache/maven/wagon/wagon-ssh-common/2.2/wagon-ssh-common-2.2.jar
Downloading: http://repo.maven.apache.org/maven2/org/codehaus/swizzle/swizzle-confluence/1.4/swizzle-confluence-1.4.jar
Downloading: http://repo.maven.apache.org/maven2/xmlrpc/xmlrpc-client/3.0/xmlrpc-client-3.0.jar
Downloaded: http://repo.maven.apache.org/maven2/org/slf4j/slf4j-nop/1.6.1/slf4j-nop-1.6.1.jar
(5 KB at 82.4 KB/sec)
Downloaded: http://repo.maven.apache.org/maven2/org/apache/maven/wagon/wagon-ssh/2.2/wagon-ssh-2.2.jar
(29 KB at 502.1 KB/sec)
Downloaded: http://repo.maven.apache.org/maven2/org/apache/maven/wagon/wagon-ssh-common/2.2/wagon-ssh-common-2.2.jar
(25 KB at 434.8 KB/sec)
Downloaded: http://repo.maven.apache.org/maven2/org/codehaus/swizzle/swizzle-confluence/1.4/swizzle-confluence-1.4.jar
(29 KB at 484.5 KB/sec)
Downloaded: http://repo.maven.apache.org/maven2/xmlrpc/xmlrpc-client/3.0/xmlrpc-client-3.0.jar
(43 KB at 693.4 KB/sec)
[INFO] Generating static website from Scalate Templates and wiki files...
[INFO] template properties: null
[INFO]     processing <https://builds.apache.org/job/ActiveMQ-openwire/ws/openwire-website/src/versions/index.page>
with uri: /versions/index.page => 
[INFO]     processing <https://builds.apache.org/job/ActiveMQ-openwire/ws/openwire-website/src/documentation/module-organization.page>
with uri: /documentation/module-organization.page => 
[INFO]     processing <https://builds.apache.org/job/ActiveMQ-openwire/ws/openwire-website/src/documentation/index.page>
with uri: /documentation/index.page => 
[INFO]     processing <https://builds.apache.org/job/ActiveMQ-openwire/ws/openwire-website/src/documentation/openwire-manual.md>
with uri: /documentation/openwire-manual.md => 
[INFO]     processing <https://builds.apache.org/job/ActiveMQ-openwire/ws/openwire-website/src/documentation/getting-started.md>
with uri: /documentation/getting-started.md => 
[INFO]     processing <https://builds.apache.org/job/ActiveMQ-openwire/ws/openwire-website/src/download.page>
with uri: /download.page => 
[INFO]     processing <https://builds.apache.org/job/ActiveMQ-openwire/ws/openwire-website/src/index.page>
with uri: /index.page => 
[INFO]     processing <https://builds.apache.org/job/ActiveMQ-openwire/ws/openwire-website/src/community/site.page>
with uri: /community/site.page => 
[INFO]     processing <https://builds.apache.org/job/ActiveMQ-openwire/ws/openwire-website/src/community/developers.page>
with uri: /community/developers.page => 
[INFO]     processing <https://builds.apache.org/job/ActiveMQ-openwire/ws/openwire-website/src/community/support.page>
with uri: /community/support.page => 
[INFO]     processing <https://builds.apache.org/job/ActiveMQ-openwire/ws/openwire-website/src/community/index.page>
with uri: /community/index.page => 
[INFO]     processing <https://builds.apache.org/job/ActiveMQ-openwire/ws/openwire-website/src/community/building.page>
with uri: /community/building.page => 
[INFO]     processing <https://builds.apache.org/job/ActiveMQ-openwire/ws/openwire-website/src/community/faq.page>
with uri: /community/faq.page => 
[INFO]     processing <https://builds.apache.org/job/ActiveMQ-openwire/ws/openwire-website/src/community/contributing.page>
with uri: /community/contributing.page => 
[INFO]     processing <https://builds.apache.org/job/ActiveMQ-openwire/ws/openwire-website/src/community/source.page>
with uri: /community/source.page => 
[INFO]     processing <https://builds.apache.org/job/ActiveMQ-openwire/ws/openwire-website/src/community/release-guide.page>
with uri: /community/release-guide.page => 
[INFO]     processing <https://builds.apache.org/job/ActiveMQ-openwire/ws/openwire-website/src/privacy-policy.page>
with uri: /privacy-policy.page => 
Using dir: <https://builds.apache.org/job/ActiveMQ-openwire/ws/openwire-website/src/blog>
at request path: /blog
[INFO]     processing <https://builds.apache.org/job/ActiveMQ-openwire/ws/openwire-website/src/blog/index.rss.feed>
with uri: /blog/index.rss.feed => 
Using dir: <https://builds.apache.org/job/ActiveMQ-openwire/ws/openwire-website/src/blog>
at request path: /blog
[INFO]     processing <https://builds.apache.org/job/ActiveMQ-openwire/ws/openwire-website/src/blog/index.page>
with uri: /blog/index.page => 
[INFO]     processing <https://builds.apache.org/job/ActiveMQ-openwire/ws/openwire-website/src/blog/releases/release-1.0.page>
with uri: /blog/releases/release-1.0.page => 
[INFO] 
[INFO] --- maven-install-plugin:2.5.1:install (default-install) @ openwire-website ---
[INFO] Installing <https://builds.apache.org/job/ActiveMQ-openwire/ws/openwire-website/pom.xml>
to /home/jenkins/jenkins-slave/maven-repositories/0/org/apache/activemq/openwire-website/1.0-SNAPSHOT/openwire-website-1.0-SNAPSHOT.pom
[INFO] ------------------------------------------------------------------------
[INFO] Reactor Summary:
[INFO] 
[INFO] openwire-protocol ................................. SUCCESS [9.914s]
[INFO] openwire-generator ................................ SUCCESS [4.956s]
[INFO] openwire-core ..................................... SUCCESS [20.126s]
[INFO] openwire-legacy ................................... SUCCESS [3.308s]
[INFO] openwire-interop-tests ............................ SUCCESS [46.805s]
[INFO] openwire-jms ...................................... SUCCESS [3.324s]
[INFO] openwire-website .................................. SUCCESS [26.740s]
[INFO] ------------------------------------------------------------------------
[INFO] BUILD SUCCESS
[INFO] ------------------------------------------------------------------------
[INFO] Total time: 1:59.333s
[INFO] Finished at: Thu Aug 14 22:00:04 UTC 2014
[INFO] Final Memory: 69M/1181M
[INFO] ------------------------------------------------------------------------
Waiting for Jenkins to finish collecting data
[JENKINS] Archiving <https://builds.apache.org/job/ActiveMQ-openwire/ws/openwire-website/pom.xml>
to org.apache.activemq/openwire-website/1.0-SNAPSHOT/openwire-website-1.0-SNAPSHOT.pom
Sending artifact delta relative to ActiveMQ-openwire ? openwire-website #3
Archived 1 artifacts
Archive block size is 32768
Received 0 blocks and 11739 bytes
Compression is 0.0%
Took 70 ms
[JENKINS] Archiving <https://builds.apache.org/job/ActiveMQ-openwire/ws/openwire-generator/pom.xml>
to org.apache.activemq/openwire-generator/1.0-SNAPSHOT/openwire-generator-1.0-SNAPSHOT.pom
[JENKINS] Archiving <https://builds.apache.org/job/ActiveMQ-openwire/ws/openwire-generator/target/openwire-generator-1.0-SNAPSHOT.jar>
to org.apache.activemq/openwire-generator/1.0-SNAPSHOT/openwire-generator-1.0-SNAPSHOT.jar
Sending artifact delta relative to ActiveMQ-openwire ? openwire-generator #3
Archived 2 artifacts
Archive block size is 32768
Received 0 blocks and 36911 bytes
Compression is 0.0%
Took 42 ms
[JENKINS] Archiving <https://builds.apache.org/job/ActiveMQ-openwire/ws/openwire-interop-tests/pom.xml>
to org.apache.activemq/openwire-interop-tests/1.0-SNAPSHOT/openwire-interop-tests-1.0-SNAPSHOT.pom
[JENKINS] Archiving <https://builds.apache.org/job/ActiveMQ-openwire/ws/openwire-interop-tests/target/openwire-interop-tests-1.0-SNAPSHOT.jar>
to org.apache.activemq/openwire-interop-tests/1.0-SNAPSHOT/openwire-interop-tests-1.0-SNAPSHOT.jar
Sending artifact delta relative to ActiveMQ-openwire ? openwire-interop-tests #3
Archived 2 artifacts
Archive block size is 32768
Received 0 blocks and 10859 bytes
Compression is 0.0%
Took 37 ms
[JENKINS] Archiving <https://builds.apache.org/job/ActiveMQ-openwire/ws/openwire-legacy/pom.xml>
to org.apache.activemq/openwire-legacy/1.0-SNAPSHOT/openwire-legacy-1.0-SNAPSHOT.pom
[JENKINS] Archiving <https://builds.apache.org/job/ActiveMQ-openwire/ws/openwire-legacy/target/openwire-legacy-1.0-SNAPSHOT.jar>
to org.apache.activemq/openwire-legacy/1.0-SNAPSHOT/openwire-legacy-1.0-SNAPSHOT.jar
Sending artifact delta relative to ActiveMQ-openwire ? openwire-legacy #3
Archived 2 artifacts
Archive block size is 32768
Received 0 blocks and 644881 bytes
Compression is 0.0%
Took 0.24 sec
[JENKINS] Archiving <https://builds.apache.org/job/ActiveMQ-openwire/ws/pom.xml> to
org.apache.activemq/openwire-protocol/1.0-SNAPSHOT/openwire-protocol-1.0-SNAPSHOT.pom
Sending artifact delta relative to ActiveMQ-openwire ? openwire-protocol #3
Archived 1 artifacts
Archive block size is 32768
Received 0 blocks and 9025 bytes
Compression is 0.0%
Took 37 ms
[JENKINS] Archiving <https://builds.apache.org/job/ActiveMQ-openwire/ws/openwire-core/pom.xml>
to org.apache.activemq/openwire-core/1.0-SNAPSHOT/openwire-core-1.0-SNAPSHOT.pom
[JENKINS] Archiving <https://builds.apache.org/job/ActiveMQ-openwire/ws/openwire-core/target/openwire-core-1.0-SNAPSHOT.jar>
to org.apache.activemq/openwire-core/1.0-SNAPSHOT/openwire-core-1.0-SNAPSHOT.jar
Sending artifact delta relative to ActiveMQ-openwire ? openwire-core #3
Archived 2 artifacts
Archive block size is 32768
Received 0 blocks and 434499 bytes
Compression is 0.0%
Took 0.16 sec
[JENKINS] Archiving <https://builds.apache.org/job/ActiveMQ-openwire/ws/openwire-jms/pom.xml>
to org.apache.activemq/openwire-jms/1.0-SNAPSHOT/openwire-jms-1.0-SNAPSHOT.pom
[JENKINS] Archiving <https://builds.apache.org/job/ActiveMQ-openwire/ws/openwire-jms/target/openwire-jms-1.0-SNAPSHOT.jar>
to org.apache.activemq/openwire-jms/1.0-SNAPSHOT/openwire-jms-1.0-SNAPSHOT.jar
Sending artifact delta relative to ActiveMQ-openwire ? openwire-jms #3
Archived 2 artifacts
Archive block size is 32768
Received 0 blocks and 78374 bytes
Compression is 0.0%
Took 59 ms
channel stopped
Maven RedeployPublisher use remote ubuntu-1 maven settings from : /home/jenkins/.m2/settings.xml
[ERROR] uniqueVersion == false is not anymore supported in maven 3
[INFO] Deployment in https://repository.apache.org/content/repositories/snapshots (id=,uniqueVersion=false)
Deploying the main artifact openwire-core-1.0-SNAPSHOT.jar
Downloading: https://repository.apache.org/content/repositories/snapshots/org/apache/activemq/openwire-core/1.0-SNAPSHOT/maven-metadata.xml
Uploading: https://repository.apache.org/content/repositories/snapshots/org/apache/activemq/openwire-core/1.0-SNAPSHOT/openwire-core-1.0-20140814.220015-1.jar
Uploading: https://repository.apache.org/content/repositories/snapshots/org/apache/activemq/openwire-core/1.0-SNAPSHOT/openwire-core-1.0-20140814.220015-1.pom
ERROR: Failed to deploy artifacts: Could not transfer artifact org.apache.activemq:openwire-core:jar:1.0-20140814.220015-1
from/to  (https://repository.apache.org/content/repositories/snapshots): Failed to transfer
file: https://repository.apache.org/content/repositories/snapshots/org/apache/activemq/openwire-core/1.0-SNAPSHOT/openwire-core-1.0-20140814.220015-1.jar.
Return code is: 401, ReasonPhrase: Unauthorized.
org.apache.maven.artifact.deployer.ArtifactDeploymentException: Failed to deploy artifacts:
Could not transfer artifact org.apache.activemq:openwire-core:jar:1.0-20140814.220015-1 from/to
 (https://repository.apache.org/content/repositories/snapshots): Failed to transfer file:
https://repository.apache.org/content/repositories/snapshots/org/apache/activemq/openwire-core/1.0-SNAPSHOT/openwire-core-1.0-20140814.220015-1.jar.
Return code is: 401, ReasonPhrase: Unauthorized.
	at org.apache.maven.artifact.deployer.DefaultArtifactDeployer.deploy(DefaultArtifactDeployer.java:143)
	at hudson.maven.reporters.MavenArtifactRecord.deploy(MavenArtifactRecord.java:193)
	at hudson.maven.RedeployPublisher.perform(RedeployPublisher.java:176)
	at hudson.tasks.BuildStepMonitor$1.perform(BuildStepMonitor.java:20)
	at hudson.model.AbstractBuild$AbstractBuildExecution.perform(AbstractBuild.java:804)
	at hudson.model.AbstractBuild$AbstractBuildExecution.performAllBuildSteps(AbstractBuild.java:776)
	at hudson.maven.MavenModuleSetBuild$MavenModuleSetBuildExecution.post2(MavenModuleSetBuild.java:1040)
	at hudson.model.AbstractBuild$AbstractBuildExecution.post(AbstractBuild.java:725)
	at hudson.model.Run.execute(Run.java:1701)
	at hudson.maven.MavenModuleSetBuild.run(MavenModuleSetBuild.java:529)
	at hudson.model.ResourceController.execute(ResourceController.java:88)
	at hudson.model.Executor.run(Executor.java:231)
Caused by: org.eclipse.aether.deployment.DeploymentException: Failed to deploy artifacts:
Could not transfer artifact org.apache.activemq:openwire-core:jar:1.0-20140814.220015-1 from/to
 (https://repository.apache.org/content/repositories/snapshots): Failed to transfer file:
https://repository.apache.org/content/repositories/snapshots/org/apache/activemq/openwire-core/1.0-SNAPSHOT/openwire-core-1.0-20140814.220015-1.jar.
Return code is: 401, ReasonPhrase: Unauthorized.
	at org.eclipse.aether.internal.impl.DefaultDeployer.deploy(DefaultDeployer.java:341)
	at org.eclipse.aether.internal.impl.DefaultDeployer.deploy(DefaultDeployer.java:269)
	at org.eclipse.aether.internal.impl.DefaultRepositorySystem.deploy(DefaultRepositorySystem.java:413)
	at org.apache.maven.artifact.deployer.DefaultArtifactDeployer.deploy(DefaultArtifactDeployer.java:139)
	... 11 more
Caused by: org.eclipse.aether.transfer.ArtifactTransferException: Could not transfer artifact
org.apache.activemq:openwire-core:jar:1.0-20140814.220015-1 from/to  (https://repository.apache.org/content/repositories/snapshots):
Failed to transfer file: https://repository.apache.org/content/repositories/snapshots/org/apache/activemq/openwire-core/1.0-SNAPSHOT/openwire-core-1.0-20140814.220015-1.jar.
Return code is: 401, ReasonPhrase: Unauthorized.
	at org.eclipse.aether.connector.wagon.WagonRepositoryConnector$6.wrap(WagonRepositoryConnector.java:1016)
	at org.eclipse.aether.connector.wagon.WagonRepositoryConnector$6.wrap(WagonRepositoryConnector.java:1004)
	at org.eclipse.aether.connector.wagon.WagonRepositoryConnector$PutTask.run(WagonRepositoryConnector.java:895)
	at org.eclipse.aether.connector.wagon.WagonRepositoryConnector.put(WagonRepositoryConnector.java:522)
	at org.eclipse.aether.internal.impl.DefaultDeployer.deploy(DefaultDeployer.java:335)
	... 14 more
Caused by: org.apache.maven.wagon.TransferFailedException: Failed to transfer file: https://repository.apache.org/content/repositories/snapshots/org/apache/activemq/openwire-core/1.0-SNAPSHOT/openwire-core-1.0-20140814.220015-1.jar.
Return code is: 401, ReasonPhrase: Unauthorized.
	at org.apache.maven.wagon.shared.http4.AbstractHttpClientWagon.put(AbstractHttpClientWagon.java:626)
	at org.apache.maven.wagon.shared.http4.AbstractHttpClientWagon.put(AbstractHttpClientWagon.java:524)
	at org.apache.maven.wagon.shared.http4.AbstractHttpClientWagon.put(AbstractHttpClientWagon.java:505)
	at org.apache.maven.wagon.shared.http4.AbstractHttpClientWagon.put(AbstractHttpClientWagon.java:485)
	at org.eclipse.aether.connector.wagon.WagonRepositoryConnector$PutTask.run(WagonRepositoryConnector.java:871)
	... 16 more
[INFO] Deployment failed after 2.4 sec
Build step 'Deploy artifacts to Maven repository' changed build result to FAILURE

Mime
View raw message