activemq-commits mailing list archives

Site index · List index
Message view « Date » · « Thread »
Top « Date » · « Thread »
From Apache Jenkins Server <jenk...@builds.apache.org>
Subject Build failed in Jenkins: ActiveMQ-openwire #3
Date Wed, 13 Aug 2014 22:56:48 GMT
See <https://builds.apache.org/job/ActiveMQ-openwire/3/changes>

Changes:

[tabish121] Use the latest Apache POM

[tabish121] https://issues.apache.org/jira/browse/OPENWIRE-2

------------------------------------------
[...truncated 327 lines...]
[INFO] skip non existing resourceDirectory <https://builds.apache.org/job/ActiveMQ-openwire/ws/openwire-jms/src/main/resources>
[INFO] Copying 3 resources
[INFO] 
[INFO] --- maven-compiler-plugin:3.1:compile (default-compile) @ openwire-jms ---
[INFO] Changes detected - recompiling the module!
[INFO] Compiling 9 source files to <https://builds.apache.org/job/ActiveMQ-openwire/ws/openwire-jms/target/classes>
[INFO] 
[INFO] --- maven-resources-plugin:2.6:testResources (default-testResources) @ openwire-jms
---
[INFO] Using 'UTF-8' encoding to copy filtered resources.
[INFO] Copying 1 resource
[INFO] Copying 3 resources
[INFO] 
[INFO] --- maven-compiler-plugin:3.1:testCompile (default-testCompile) @ openwire-jms ---
[INFO] Changes detected - recompiling the module!
[INFO] Compiling 6 source files to <https://builds.apache.org/job/ActiveMQ-openwire/ws/openwire-jms/target/test-classes>
[INFO] 
[INFO] --- maven-surefire-plugin:2.16:test (default-test) @ openwire-jms ---
[INFO] Surefire report directory: <https://builds.apache.org/job/ActiveMQ-openwire/ws/openwire-jms/target/surefire-reports>

-------------------------------------------------------
 T E S T S
-------------------------------------------------------
Running org.apache.activemq.openwire.jms.OpenWireJMSObjectMessageTest
Tests run: 5, Failures: 0, Errors: 0, Skipped: 0, Time elapsed: 0.118 sec - in org.apache.activemq.openwire.jms.OpenWireJMSObjectMessageTest
Running org.apache.activemq.openwire.jms.OpenWireJMSMapMessageTest
Tests run: 17, Failures: 0, Errors: 0, Skipped: 0, Time elapsed: 0.14 sec - in org.apache.activemq.openwire.jms.OpenWireJMSMapMessageTest
Running org.apache.activemq.openwire.jms.OpenWireJMSMessageTest
Tests run: 50, Failures: 0, Errors: 0, Skipped: 0, Time elapsed: 0.098 sec - in org.apache.activemq.openwire.jms.OpenWireJMSMessageTest
Running org.apache.activemq.openwire.jms.OpenWireJMSTextMessageTest
Tests run: 3, Failures: 0, Errors: 0, Skipped: 0, Time elapsed: 0.001 sec - in org.apache.activemq.openwire.jms.OpenWireJMSTextMessageTest
Running org.apache.activemq.openwire.jms.OpenWireJMSStreamMessageTest
Tests run: 17, Failures: 0, Errors: 0, Skipped: 0, Time elapsed: 0.167 sec - in org.apache.activemq.openwire.jms.OpenWireJMSStreamMessageTest
Running org.apache.activemq.openwire.jms.OpenWireJMSBytesMessageTest
Tests run: 19, Failures: 0, Errors: 0, Skipped: 0, Time elapsed: 0.005 sec - in org.apache.activemq.openwire.jms.OpenWireJMSBytesMessageTest

Results :

Tests run: 111, Failures: 0, Errors: 0, Skipped: 0

[JENKINS] Recording test results
[INFO] 
[INFO] --- maven-jar-plugin:2.4:jar (default-jar) @ openwire-jms ---
[INFO] Building jar: <https://builds.apache.org/job/ActiveMQ-openwire/ws/openwire-jms/target/openwire-jms-1.0-SNAPSHOT.jar>
[INFO] 
[INFO] --- maven-site-plugin:3.3:attach-descriptor (attach-descriptor) @ openwire-jms ---
[INFO] 
[INFO] --- maven-install-plugin:2.5.1:install (default-install) @ openwire-jms ---
[INFO] Installing <https://builds.apache.org/job/ActiveMQ-openwire/ws/openwire-jms/target/openwire-jms-1.0-SNAPSHOT.jar>
to /home/jenkins/jenkins-slave/maven-repositories/0/org/apache/activemq/openwire-jms/1.0-SNAPSHOT/openwire-jms-1.0-SNAPSHOT.jar
[INFO] Installing <https://builds.apache.org/job/ActiveMQ-openwire/ws/openwire-jms/pom.xml>
to /home/jenkins/jenkins-slave/maven-repositories/0/org/apache/activemq/openwire-jms/1.0-SNAPSHOT/openwire-jms-1.0-SNAPSHOT.pom
[INFO]                                                                         
[INFO] ------------------------------------------------------------------------
[INFO] Building openwire-website 1.0-SNAPSHOT
[INFO] ------------------------------------------------------------------------
Downloading: http://repo.maven.apache.org/maven2/org/fusesource/scalate/scalate-wikitext_2.10/1.6.1/scalate-wikitext_2.10-1.6.1.pom
Downloaded: http://repo.maven.apache.org/maven2/org/fusesource/scalate/scalate-wikitext_2.10/1.6.1/scalate-wikitext_2.10-1.6.1.pom
(0 B at 0.0 KB/sec)
Downloading: http://repo.maven.apache.org/maven2/org/fusesource/wikitext/confluence-core/1.4/confluence-core-1.4.pom
Downloaded: http://repo.maven.apache.org/maven2/org/fusesource/wikitext/confluence-core/1.4/confluence-core-1.4.pom
(0 B at 0.0 KB/sec)
Downloading: http://repo.maven.apache.org/maven2/org/fusesource/wikitext/wikitext-project/1.4/wikitext-project-1.4.pom
Downloaded: http://repo.maven.apache.org/maven2/org/fusesource/wikitext/wikitext-project/1.4/wikitext-project-1.4.pom
(0 B at 0.0 KB/sec)
Downloading: http://repo.maven.apache.org/maven2/org/fusesource/wikitext/wikitext-core/1.4/wikitext-core-1.4.pom
Downloaded: http://repo.maven.apache.org/maven2/org/fusesource/wikitext/wikitext-core/1.4/wikitext-core-1.4.pom
(0 B at 0.0 KB/sec)
Downloading: http://repo.maven.apache.org/maven2/org/fusesource/wikitext/textile-core/1.4/textile-core-1.4.pom
Downloaded: http://repo.maven.apache.org/maven2/org/fusesource/wikitext/textile-core/1.4/textile-core-1.4.pom
(0 B at 0.0 KB/sec)
Downloading: http://repo.maven.apache.org/maven2/org/fusesource/scalate/scalate-page_2.10/1.6.1/scalate-page_2.10-1.6.1.pom
Downloaded: http://repo.maven.apache.org/maven2/org/fusesource/scalate/scalate-page_2.10/1.6.1/scalate-page_2.10-1.6.1.pom
(0 B at 0.0 KB/sec)
Downloading: http://repo.maven.apache.org/maven2/org/fusesource/scalamd/scalamd_2.10/1.6/scalamd_2.10-1.6.pom
Downloaded: http://repo.maven.apache.org/maven2/org/fusesource/scalamd/scalamd_2.10/1.6/scalamd_2.10-1.6.pom
(0 B at 0.0 KB/sec)
Downloading: http://repo.maven.apache.org/maven2/org/fusesource/scalate/scalate-test_2.10/1.6.1/scalate-test_2.10-1.6.1.pom
Downloaded: http://repo.maven.apache.org/maven2/org/fusesource/scalate/scalate-test_2.10/1.6.1/scalate-test_2.10-1.6.1.pom
(0 B at 0.0 KB/sec)
Downloading: http://repo.maven.apache.org/maven2/org/fusesource/scalate/scalate-wikitext_2.10/1.6.1/scalate-wikitext_2.10-1.6.1.jar
Downloading: http://repo.maven.apache.org/maven2/org/fusesource/wikitext/confluence-core/1.4/confluence-core-1.4.jar
Downloading: http://repo.maven.apache.org/maven2/org/fusesource/wikitext/wikitext-core/1.4/wikitext-core-1.4.jar
Downloading: http://repo.maven.apache.org/maven2/org/fusesource/wikitext/textile-core/1.4/textile-core-1.4.jar
Downloading: http://repo.maven.apache.org/maven2/org/fusesource/scalate/scalate-page_2.10/1.6.1/scalate-page_2.10-1.6.1.jar
Downloaded: http://repo.maven.apache.org/maven2/org/fusesource/scalate/scalate-wikitext_2.10/1.6.1/scalate-wikitext_2.10-1.6.1.jar
(0 B at 0.0 KB/sec)
Downloading: http://repo.maven.apache.org/maven2/org/fusesource/scalamd/scalamd_2.10/1.6/scalamd_2.10-1.6.jar
Downloaded: http://repo.maven.apache.org/maven2/org/fusesource/wikitext/textile-core/1.4/textile-core-1.4.jar
(0 B at 0.0 KB/sec)
Downloading: http://repo.maven.apache.org/maven2/org/fusesource/scalate/scalate-test_2.10/1.6.1/scalate-test_2.10-1.6.1.jar
Downloaded: http://repo.maven.apache.org/maven2/org/fusesource/wikitext/confluence-core/1.4/confluence-core-1.4.jar
(0 B at 0.0 KB/sec)
Downloaded: http://repo.maven.apache.org/maven2/org/fusesource/wikitext/wikitext-core/1.4/wikitext-core-1.4.jar
(0 B at 0.0 KB/sec)
Downloaded: http://repo.maven.apache.org/maven2/org/fusesource/scalate/scalate-page_2.10/1.6.1/scalate-page_2.10-1.6.1.jar
(0 B at 0.0 KB/sec)
Downloaded: http://repo.maven.apache.org/maven2/org/fusesource/scalamd/scalamd_2.10/1.6/scalamd_2.10-1.6.jar
(0 B at 0.0 KB/sec)
Downloaded: http://repo.maven.apache.org/maven2/org/fusesource/scalate/scalate-test_2.10/1.6.1/scalate-test_2.10-1.6.1.jar
(0 B at 0.0 KB/sec)
[INFO] 
[INFO] --- maven-clean-plugin:2.5:clean (default-clean) @ openwire-website ---
[INFO] 
[INFO] --- maven-antrun-plugin:1.7:run (default) @ openwire-website ---
[WARNING] Parameter tasks is deprecated, use target instead
[INFO] Executing tasks

main:
    [mkdir] Created dir: <https://builds.apache.org/job/ActiveMQ-openwire/ws/openwire-website/target/sitegen/documentation/schema>
[INFO] Executed tasks
[INFO] 
[INFO] --- maven-remote-resources-plugin:1.5:process (default) @ openwire-website ---
[INFO] 
[INFO] --- scala-maven-plugin:3.1.0:compile (default) @ openwire-website ---
[INFO] /x1/jenkins/jenkins-slave/workspace/ActiveMQ-openwire/openwire-website/ext:-1: info:
compiling
[INFO] Compiling 3 source files to /x1/jenkins/jenkins-slave/workspace/ActiveMQ-openwire/openwire-website/target/classes
at 1407970584195
[INFO] prepare-compile in 0 s
[INFO] compile in 4 s
[INFO] 
[INFO] --- scala-maven-plugin:3.1.0:testCompile (default) @ openwire-website ---
[WARNING] No source files found.
[INFO] 
[INFO] --- maven-site-plugin:3.3:attach-descriptor (attach-descriptor) @ openwire-website
---
[WARNING] Failed to getClass for org.apache.maven.plugin.source.SourceJarMojo
[INFO] 
[INFO] --- maven-source-plugin:2.2.1:jar (attach-sources) @ openwire-website ---
[INFO] 
[INFO] --- maven-scalate-plugin_2.10:1.6.1:sitegen (sitegen) @ openwire-website ---
[INFO] Generating static website from Scalate Templates and wiki files...
[INFO] template properties: null
Using dir: <https://builds.apache.org/job/ActiveMQ-openwire/ws/openwire-website/src/blog>
at request path: /blog
[INFO]     processing <https://builds.apache.org/job/ActiveMQ-openwire/ws/openwire-website/src/blog/index.page>
with uri: /blog/index.page => 
[INFO]     processing <https://builds.apache.org/job/ActiveMQ-openwire/ws/openwire-website/src/blog/releases/release-1.0.page>
with uri: /blog/releases/release-1.0.page => 
Using dir: <https://builds.apache.org/job/ActiveMQ-openwire/ws/openwire-website/src/blog>
at request path: /blog
[INFO]     processing <https://builds.apache.org/job/ActiveMQ-openwire/ws/openwire-website/src/blog/index.rss.feed>
with uri: /blog/index.rss.feed => 
[INFO]     processing <https://builds.apache.org/job/ActiveMQ-openwire/ws/openwire-website/src/index.page>
with uri: /index.page => 
[INFO]     processing <https://builds.apache.org/job/ActiveMQ-openwire/ws/openwire-website/src/versions/index.page>
with uri: /versions/index.page => 
[INFO]     processing <https://builds.apache.org/job/ActiveMQ-openwire/ws/openwire-website/src/documentation/index.page>
with uri: /documentation/index.page => 
[INFO]     processing <https://builds.apache.org/job/ActiveMQ-openwire/ws/openwire-website/src/documentation/openwire-manual.md>
with uri: /documentation/openwire-manual.md => 
[INFO]     processing <https://builds.apache.org/job/ActiveMQ-openwire/ws/openwire-website/src/documentation/module-organization.page>
with uri: /documentation/module-organization.page => 
[INFO]     processing <https://builds.apache.org/job/ActiveMQ-openwire/ws/openwire-website/src/documentation/getting-started.md>
with uri: /documentation/getting-started.md => 
[INFO]     processing <https://builds.apache.org/job/ActiveMQ-openwire/ws/openwire-website/src/download.page>
with uri: /download.page => 
[INFO]     processing <https://builds.apache.org/job/ActiveMQ-openwire/ws/openwire-website/src/community/release-guide.page>
with uri: /community/release-guide.page => 
[INFO]     processing <https://builds.apache.org/job/ActiveMQ-openwire/ws/openwire-website/src/community/index.page>
with uri: /community/index.page => 
[INFO]     processing <https://builds.apache.org/job/ActiveMQ-openwire/ws/openwire-website/src/community/faq.page>
with uri: /community/faq.page => 
[INFO]     processing <https://builds.apache.org/job/ActiveMQ-openwire/ws/openwire-website/src/community/building.page>
with uri: /community/building.page => 
[INFO]     processing <https://builds.apache.org/job/ActiveMQ-openwire/ws/openwire-website/src/community/site.page>
with uri: /community/site.page => 
[INFO]     processing <https://builds.apache.org/job/ActiveMQ-openwire/ws/openwire-website/src/community/contributing.page>
with uri: /community/contributing.page => 
[INFO]     processing <https://builds.apache.org/job/ActiveMQ-openwire/ws/openwire-website/src/community/source.page>
with uri: /community/source.page => 
[INFO]     processing <https://builds.apache.org/job/ActiveMQ-openwire/ws/openwire-website/src/community/support.page>
with uri: /community/support.page => 
[INFO]     processing <https://builds.apache.org/job/ActiveMQ-openwire/ws/openwire-website/src/community/developers.page>
with uri: /community/developers.page => 
[INFO]     processing <https://builds.apache.org/job/ActiveMQ-openwire/ws/openwire-website/src/privacy-policy.page>
with uri: /privacy-policy.page => 
[INFO] 
[INFO] --- maven-install-plugin:2.5.1:install (default-install) @ openwire-website ---
[INFO] Installing <https://builds.apache.org/job/ActiveMQ-openwire/ws/openwire-website/pom.xml>
to /home/jenkins/jenkins-slave/maven-repositories/0/org/apache/activemq/openwire-website/1.0-SNAPSHOT/openwire-website-1.0-SNAPSHOT.pom
[INFO] ------------------------------------------------------------------------
[INFO] Reactor Summary:
[INFO] 
[INFO] openwire-protocol ................................. SUCCESS [11.748s]
[INFO] openwire-generator ................................ SUCCESS [6.432s]
[INFO] openwire-core ..................................... SUCCESS [2:04.091s]
[INFO] openwire-legacy ................................... SUCCESS [3.536s]
[INFO] openwire-interop-tests ............................ SUCCESS [47.626s]
[INFO] openwire-jms ...................................... SUCCESS [5.113s]
[INFO] openwire-website .................................. SUCCESS [24.579s]
[INFO] ------------------------------------------------------------------------
[INFO] BUILD SUCCESS
[INFO] ------------------------------------------------------------------------
[INFO] Total time: 3:49.853s
[INFO] Finished at: Wed Aug 13 22:56:42 UTC 2014
[INFO] Final Memory: 69M/1291M
[INFO] ------------------------------------------------------------------------
Waiting for Jenkins to finish collecting data
[JENKINS] Archiving <https://builds.apache.org/job/ActiveMQ-openwire/ws/openwire-website/pom.xml>
to org.apache.activemq/openwire-website/1.0-SNAPSHOT/openwire-website-1.0-SNAPSHOT.pom
No prior successful build to compare, so performing full copy of artifacts
[JENKINS] Archiving <https://builds.apache.org/job/ActiveMQ-openwire/ws/openwire-generator/pom.xml>
to org.apache.activemq/openwire-generator/1.0-SNAPSHOT/openwire-generator-1.0-SNAPSHOT.pom
[JENKINS] Archiving <https://builds.apache.org/job/ActiveMQ-openwire/ws/openwire-generator/target/openwire-generator-1.0-SNAPSHOT.jar>
to org.apache.activemq/openwire-generator/1.0-SNAPSHOT/openwire-generator-1.0-SNAPSHOT.jar
Sending artifact delta relative to ActiveMQ-openwire ? openwire-generator #2
Archived 2 artifacts
Archive block size is 32768
Received 0 blocks and 36910 bytes
Compression is 0.0%
Took 30 ms
[JENKINS] Archiving <https://builds.apache.org/job/ActiveMQ-openwire/ws/openwire-interop-tests/pom.xml>
to org.apache.activemq/openwire-interop-tests/1.0-SNAPSHOT/openwire-interop-tests-1.0-SNAPSHOT.pom
[JENKINS] Archiving <https://builds.apache.org/job/ActiveMQ-openwire/ws/openwire-interop-tests/target/openwire-interop-tests-1.0-SNAPSHOT.jar>
to org.apache.activemq/openwire-interop-tests/1.0-SNAPSHOT/openwire-interop-tests-1.0-SNAPSHOT.jar
Sending artifact delta relative to ActiveMQ-openwire ? openwire-interop-tests #2
Archived 2 artifacts
Archive block size is 32768
Received 0 blocks and 10858 bytes
Compression is 0.0%
Took 22 ms
[JENKINS] Archiving <https://builds.apache.org/job/ActiveMQ-openwire/ws/openwire-legacy/pom.xml>
to org.apache.activemq/openwire-legacy/1.0-SNAPSHOT/openwire-legacy-1.0-SNAPSHOT.pom
[JENKINS] Archiving <https://builds.apache.org/job/ActiveMQ-openwire/ws/openwire-legacy/target/openwire-legacy-1.0-SNAPSHOT.jar>
to org.apache.activemq/openwire-legacy/1.0-SNAPSHOT/openwire-legacy-1.0-SNAPSHOT.jar
Sending artifact delta relative to ActiveMQ-openwire ? openwire-legacy #2
Archived 2 artifacts
Archive block size is 32768
Received 0 blocks and 644880 bytes
Compression is 0.0%
Took 0.22 sec
[JENKINS] Archiving <https://builds.apache.org/job/ActiveMQ-openwire/ws/pom.xml> to
org.apache.activemq/openwire-protocol/1.0-SNAPSHOT/openwire-protocol-1.0-SNAPSHOT.pom
Sending artifact delta relative to ActiveMQ-openwire ? openwire-protocol #2
Archived 1 artifacts
Archive block size is 32768
Received 0 blocks and 8757 bytes
Compression is 0.0%
Took 12 ms
[JENKINS] Archiving <https://builds.apache.org/job/ActiveMQ-openwire/ws/openwire-core/pom.xml>
to org.apache.activemq/openwire-core/1.0-SNAPSHOT/openwire-core-1.0-SNAPSHOT.pom
[JENKINS] Archiving <https://builds.apache.org/job/ActiveMQ-openwire/ws/openwire-core/target/openwire-core-1.0-SNAPSHOT.jar>
to org.apache.activemq/openwire-core/1.0-SNAPSHOT/openwire-core-1.0-SNAPSHOT.jar
Sending artifact delta relative to ActiveMQ-openwire ? openwire-core #2
Archived 2 artifacts
Archive block size is 32768
Received 0 blocks and 434498 bytes
Compression is 0.0%
Took 1.7 sec
[JENKINS] Archiving <https://builds.apache.org/job/ActiveMQ-openwire/ws/openwire-jms/pom.xml>
to org.apache.activemq/openwire-jms/1.0-SNAPSHOT/openwire-jms-1.0-SNAPSHOT.pom
[JENKINS] Archiving <https://builds.apache.org/job/ActiveMQ-openwire/ws/openwire-jms/target/openwire-jms-1.0-SNAPSHOT.jar>
to org.apache.activemq/openwire-jms/1.0-SNAPSHOT/openwire-jms-1.0-SNAPSHOT.jar
Sending artifact delta relative to ActiveMQ-openwire ? openwire-jms #2
Archived 2 artifacts
Archive block size is 32768
Received 0 blocks and 78373 bytes
Compression is 0.0%
Took 52 ms
channel stopped
Maven RedeployPublisher use remote ubuntu3 maven settings from : /home/jenkins/.m2/settings.xml
[ERROR] uniqueVersion == false is not anymore supported in maven 3
[INFO] Deployment in https://repository.apache.org/content/repositories/snapshots (id=,uniqueVersion=false)
Deploying the main artifact openwire-core-1.0-SNAPSHOT.jar
Downloading: https://repository.apache.org/content/repositories/snapshots/org/apache/activemq/openwire-core/1.0-SNAPSHOT/maven-metadata.xml
Uploading: https://repository.apache.org/content/repositories/snapshots/org/apache/activemq/openwire-core/1.0-SNAPSHOT/openwire-core-1.0-20140813.225648-1.jar
Uploading: https://repository.apache.org/content/repositories/snapshots/org/apache/activemq/openwire-core/1.0-SNAPSHOT/openwire-core-1.0-20140813.225648-1.pom
ERROR: Failed to deploy artifacts: Could not transfer artifact org.apache.activemq:openwire-core:jar:1.0-20140813.225648-1
from/to  (https://repository.apache.org/content/repositories/snapshots): Failed to transfer
file: https://repository.apache.org/content/repositories/snapshots/org/apache/activemq/openwire-core/1.0-SNAPSHOT/openwire-core-1.0-20140813.225648-1.jar.
Return code is: 401, ReasonPhrase: Unauthorized.
org.apache.maven.artifact.deployer.ArtifactDeploymentException: Failed to deploy artifacts:
Could not transfer artifact org.apache.activemq:openwire-core:jar:1.0-20140813.225648-1 from/to
 (https://repository.apache.org/content/repositories/snapshots): Failed to transfer file:
https://repository.apache.org/content/repositories/snapshots/org/apache/activemq/openwire-core/1.0-SNAPSHOT/openwire-core-1.0-20140813.225648-1.jar.
Return code is: 401, ReasonPhrase: Unauthorized.
	at org.apache.maven.artifact.deployer.DefaultArtifactDeployer.deploy(DefaultArtifactDeployer.java:143)
	at hudson.maven.reporters.MavenArtifactRecord.deploy(MavenArtifactRecord.java:193)
	at hudson.maven.RedeployPublisher.perform(RedeployPublisher.java:176)
	at hudson.tasks.BuildStepMonitor$1.perform(BuildStepMonitor.java:20)
	at hudson.model.AbstractBuild$AbstractBuildExecution.perform(AbstractBuild.java:804)
	at hudson.model.AbstractBuild$AbstractBuildExecution.performAllBuildSteps(AbstractBuild.java:776)
	at hudson.maven.MavenModuleSetBuild$MavenModuleSetBuildExecution.post2(MavenModuleSetBuild.java:1040)
	at hudson.model.AbstractBuild$AbstractBuildExecution.post(AbstractBuild.java:725)
	at hudson.model.Run.execute(Run.java:1701)
	at hudson.maven.MavenModuleSetBuild.run(MavenModuleSetBuild.java:529)
	at hudson.model.ResourceController.execute(ResourceController.java:88)
	at hudson.model.Executor.run(Executor.java:231)
Caused by: org.eclipse.aether.deployment.DeploymentException: Failed to deploy artifacts:
Could not transfer artifact org.apache.activemq:openwire-core:jar:1.0-20140813.225648-1 from/to
 (https://repository.apache.org/content/repositories/snapshots): Failed to transfer file:
https://repository.apache.org/content/repositories/snapshots/org/apache/activemq/openwire-core/1.0-SNAPSHOT/openwire-core-1.0-20140813.225648-1.jar.
Return code is: 401, ReasonPhrase: Unauthorized.
	at org.eclipse.aether.internal.impl.DefaultDeployer.deploy(DefaultDeployer.java:341)
	at org.eclipse.aether.internal.impl.DefaultDeployer.deploy(DefaultDeployer.java:269)
	at org.eclipse.aether.internal.impl.DefaultRepositorySystem.deploy(DefaultRepositorySystem.java:413)
	at org.apache.maven.artifact.deployer.DefaultArtifactDeployer.deploy(DefaultArtifactDeployer.java:139)
	... 11 more
Caused by: org.eclipse.aether.transfer.ArtifactTransferException: Could not transfer artifact
org.apache.activemq:openwire-core:jar:1.0-20140813.225648-1 from/to  (https://repository.apache.org/content/repositories/snapshots):
Failed to transfer file: https://repository.apache.org/content/repositories/snapshots/org/apache/activemq/openwire-core/1.0-SNAPSHOT/openwire-core-1.0-20140813.225648-1.jar.
Return code is: 401, ReasonPhrase: Unauthorized.
	at org.eclipse.aether.connector.wagon.WagonRepositoryConnector$6.wrap(WagonRepositoryConnector.java:1016)
	at org.eclipse.aether.connector.wagon.WagonRepositoryConnector$6.wrap(WagonRepositoryConnector.java:1004)
	at org.eclipse.aether.connector.wagon.WagonRepositoryConnector$PutTask.run(WagonRepositoryConnector.java:895)
	at org.eclipse.aether.connector.wagon.WagonRepositoryConnector.put(WagonRepositoryConnector.java:522)
	at org.eclipse.aether.internal.impl.DefaultDeployer.deploy(DefaultDeployer.java:335)
	... 14 more
Caused by: org.apache.maven.wagon.TransferFailedException: Failed to transfer file: https://repository.apache.org/content/repositories/snapshots/org/apache/activemq/openwire-core/1.0-SNAPSHOT/openwire-core-1.0-20140813.225648-1.jar.
Return code is: 401, ReasonPhrase: Unauthorized.
	at org.apache.maven.wagon.shared.http4.AbstractHttpClientWagon.put(AbstractHttpClientWagon.java:626)
	at org.apache.maven.wagon.shared.http4.AbstractHttpClientWagon.put(AbstractHttpClientWagon.java:524)
	at org.apache.maven.wagon.shared.http4.AbstractHttpClientWagon.put(AbstractHttpClientWagon.java:505)
	at org.apache.maven.wagon.shared.http4.AbstractHttpClientWagon.put(AbstractHttpClientWagon.java:485)
	at org.eclipse.aether.connector.wagon.WagonRepositoryConnector$PutTask.run(WagonRepositoryConnector.java:871)
	... 16 more
[INFO] Deployment failed after 0.53 sec
Build step 'Deploy artifacts to Maven repository' changed build result to FAILURE

Mime
View raw message