activemq-commits mailing list archives

Site index · List index
Message view « Date » · « Thread »
Top « Date » · « Thread »
From Apache Jenkins Server <jenk...@builds.apache.org>
Subject Build failed in Jenkins: ActiveMQ-Java8 » ActiveMQ :: Blueprint #54
Date Fri, 18 Jul 2014 08:16:25 GMT
See <https://builds.apache.org/job/ActiveMQ-Java8/org.apache.activemq$activemq-blueprint/54/>

------------------------------------------
[INFO]                                                                         
[INFO] ------------------------------------------------------------------------
[INFO] Skipping ActiveMQ :: Memory Usage Test Plugin
[INFO] This project has been banned from the build due to previous failures.
[INFO] ------------------------------------------------------------------------
[INFO]                                                                         
[INFO] ------------------------------------------------------------------------
[INFO] Skipping ActiveMQ :: Performance Test Plugin
[INFO] This project has been banned from the build due to previous failures.
[INFO] ------------------------------------------------------------------------
[INFO]                                                                         
[INFO] ------------------------------------------------------------------------
[INFO] Skipping ActiveMQ :: StartUp/Stop Plugin
[INFO] This project has been banned from the build due to previous failures.
[INFO] ------------------------------------------------------------------------
[INFO]                                                                         
[INFO] ------------------------------------------------------------------------
[INFO] Skipping ActiveMQ :: Web
[INFO] This project has been banned from the build due to previous failures.
[INFO] ------------------------------------------------------------------------
[INFO]                                                                         
[INFO] ------------------------------------------------------------------------
[INFO] Skipping ActiveMQ :: OSGi bundle
[INFO] This project has been banned from the build due to previous failures.
[INFO] ------------------------------------------------------------------------
[INFO]                                                                         
[INFO] ------------------------------------------------------------------------
[INFO] Building ActiveMQ :: Blueprint 5.11-SNAPSHOT
[INFO] ------------------------------------------------------------------------
Downloading: http://repo.maven.apache.org/maven2/org/eclipse/jetty/maven-jetty-plugin/7.6.9.v20130131/maven-jetty-plugin-7.6.9.v20130131.pom
[WARNING] The POM for org.eclipse.jetty:maven-jetty-plugin:jar:7.6.9.v20130131 is missing,
no dependency information available
[WARNING] Failed to retrieve plugin descriptor for org.eclipse.jetty:maven-jetty-plugin:7.6.9.v20130131:
Plugin org.eclipse.jetty:maven-jetty-plugin:7.6.9.v20130131 or one of its dependencies could
not be resolved: Failed to read artifact descriptor for org.eclipse.jetty:maven-jetty-plugin:jar:7.6.9.v20130131
[INFO] 
[INFO] --- maven-clean-plugin:2.5:clean (default-clean) @ activemq-blueprint ---
[INFO] 
[INFO] --- maven-enforcer-plugin:1.0.1:enforce (default) @ activemq-blueprint ---
[INFO] 
[INFO] --- maven-bundle-plugin:2.3.7:cleanVersions (cleanVersions) @ activemq-blueprint ---
[INFO] 
[INFO] --- maven-remote-resources-plugin:1.3:process (default) @ activemq-blueprint ---
[INFO] 
[INFO] --- maven-resources-plugin:2.5:resources (default-resources) @ activemq-blueprint ---
[debug] execute contextualize
[INFO] Using 'UTF-8' encoding to copy filtered resources.
[INFO] skip non existing resourceDirectory <https://builds.apache.org/job/ActiveMQ-Java8/org.apache.activemq$activemq-blueprint/ws/src/main/resources>
[INFO] Copying 3 resources
[INFO] 
[INFO] --- maven-compiler-plugin:2.5.1:compile (default-compile) @ activemq-blueprint ---
[INFO] No sources to compile
[INFO] 
[INFO] --- maven-resources-plugin:2.5:testResources (default-testResources) @ activemq-blueprint
---
[debug] execute contextualize
[INFO] Using 'UTF-8' encoding to copy filtered resources.
[INFO] skip non existing resourceDirectory <https://builds.apache.org/job/ActiveMQ-Java8/org.apache.activemq$activemq-blueprint/ws/src/test/resources>
[INFO] Copying 3 resources
[INFO] 
[INFO] --- maven-compiler-plugin:2.5.1:testCompile (default-testCompile) @ activemq-blueprint
---
[INFO] No sources to compile
[INFO] 
[INFO] --- maven-surefire-plugin:2.16:test (default-test) @ activemq-blueprint ---
[JENKINS] Recording test results[INFO] 

[INFO] --- maven-bundle-plugin:2.3.7:bundle (default-bundle) @ activemq-blueprint ---
[WARNING] Bundle org.apache.activemq:activemq-blueprint:bundle:5.11-SNAPSHOT : Instructions
in Export-Package that are never used: org\.apache\.activemq.*.*
Classpath: Jar:.,Jar:org.apache.aries.blueprint,Jar:xbean-blueprint,Jar:commons-jexl,Jar:pax-logging-api

[WARNING] Bundle org.apache.activemq:activemq-blueprint:bundle:5.11-SNAPSHOT : Superfluous
export-package instructions: [org.apache.activemq**]
[WARNING] Bundle org.apache.activemq:activemq-blueprint:bundle:5.11-SNAPSHOT : Did not find
matching referal for org.apache.aries.blueprint.*
[WARNING] Bundle org.apache.activemq:activemq-blueprint:bundle:5.11-SNAPSHOT : Did not find
matching referal for org.apache.xbean*
[ERROR] An internal error occurred
java.io.FileNotFoundException: <https://builds.apache.org/job/ActiveMQ-Java8/org.apache.activemq$activemq-blueprint/ws/pom.xml>
(No such file or directory)
	at java.io.FileInputStream.open(Native Method)
	at java.io.FileInputStream.<init>(FileInputStream.java:131)
	at aQute.lib.osgi.FileResource.openInputStream(FileResource.java:15)
	at aQute.lib.osgi.FileResource.copy(FileResource.java:36)
	at aQute.lib.osgi.FileResource.write(FileResource.java:31)
	at aQute.lib.osgi.Jar.writeResource(Jar.java:445)
	at aQute.lib.osgi.Jar.write(Jar.java:224)
	at aQute.lib.osgi.Jar.write(Jar.java:192)
	at org.apache.felix.bundleplugin.BundlePlugin.execute(BundlePlugin.java:362)
	at org.apache.felix.bundleplugin.BundlePlugin.execute(BundlePlugin.java:264)
	at org.apache.felix.bundleplugin.BundlePlugin.execute(BundlePlugin.java:255)
	at org.apache.maven.plugin.DefaultBuildPluginManager.executeMojo(DefaultBuildPluginManager.java:101)
	at org.apache.maven.lifecycle.internal.MojoExecutor.execute(MojoExecutor.java:209)
	at org.apache.maven.lifecycle.internal.MojoExecutor.execute(MojoExecutor.java:153)
	at org.apache.maven.lifecycle.internal.MojoExecutor.execute(MojoExecutor.java:145)
	at org.apache.maven.lifecycle.internal.LifecycleModuleBuilder.buildProject(LifecycleModuleBuilder.java:84)
	at org.apache.maven.lifecycle.internal.LifecycleModuleBuilder.buildProject(LifecycleModuleBuilder.java:59)
	at org.apache.maven.lifecycle.internal.LifecycleStarter.singleThreadedBuild(LifecycleStarter.java:183)
	at org.apache.maven.lifecycle.internal.LifecycleStarter.execute(LifecycleStarter.java:161)
	at org.apache.maven.DefaultMaven.doExecute(DefaultMaven.java:320)
	at org.apache.maven.DefaultMaven.execute(DefaultMaven.java:156)
	at org.jvnet.hudson.maven3.launcher.Maven3Launcher.main(Maven3Launcher.java:117)
	at sun.reflect.NativeMethodAccessorImpl.invoke0(Native Method)
	at sun.reflect.NativeMethodAccessorImpl.invoke(NativeMethodAccessorImpl.java:62)
	at sun.reflect.DelegatingMethodAccessorImpl.invoke(DelegatingMethodAccessorImpl.java:43)
	at java.lang.reflect.Method.invoke(Method.java:483)
	at org.codehaus.plexus.classworlds.launcher.Launcher.launchStandard(Launcher.java:329)
	at org.codehaus.plexus.classworlds.launcher.Launcher.launch(Launcher.java:239)
	at org.jvnet.hudson.maven3.agent.Maven3Main.launch(Maven3Main.java:178)
	at sun.reflect.NativeMethodAccessorImpl.invoke0(Native Method)
	at sun.reflect.NativeMethodAccessorImpl.invoke(NativeMethodAccessorImpl.java:62)
	at sun.reflect.DelegatingMethodAccessorImpl.invoke(DelegatingMethodAccessorImpl.java:43)
	at java.lang.reflect.Method.invoke(Method.java:483)
	at hudson.maven.Maven3Builder.call(Maven3Builder.java:134)
	at hudson.maven.Maven3Builder.call(Maven3Builder.java:69)
	at hudson.remoting.UserRequest.perform(UserRequest.java:118)
	at hudson.remoting.UserRequest.perform(UserRequest.java:48)
	at hudson.remoting.Request$2.run(Request.java:328)
	at hudson.remoting.InterceptingExecutorService$1.call(InterceptingExecutorService.java:72)
	at java.util.concurrent.FutureTask.run(FutureTask.java:266)
	at java.util.concurrent.ThreadPoolExecutor.runWorker(ThreadPoolExecutor.java:1142)
	at java.util.concurrent.ThreadPoolExecutor$Worker.run(ThreadPoolExecutor.java:617)
	at java.lang.Thread.run(Thread.java:745)
java.io.FileNotFoundException: <https://builds.apache.org/job/ActiveMQ-Java8/org.apache.activemq$activemq-blueprint/ws/pom.xml>
(No such file or directory)
	at java.io.FileInputStream.open(Native Method)
	at java.io.FileInputStream.<init>(FileInputStream.java:131)
	at hudson.Util.getDigestOf(Util.java:593)
	at hudson.maven.reporters.MavenArtifactArchiver.postBuild(MavenArtifactArchiver.java:99)
	at hudson.maven.Maven3Builder$MavenExecutionListener.recordProjectEnded(Maven3Builder.java:556)
	at hudson.maven.Maven3Builder$MavenExecutionListener.projectFailed(Maven3Builder.java:544)
	at org.apache.maven.lifecycle.internal.DefaultExecutionEventCatapult.fire(DefaultExecutionEventCatapult.java:77)
	at org.apache.maven.lifecycle.internal.BuilderCommon.handleBuildError(BuilderCommon.java:137)
	at org.apache.maven.lifecycle.internal.LifecycleModuleBuilder.buildProject(LifecycleModuleBuilder.java:95)
	at org.apache.maven.lifecycle.internal.LifecycleModuleBuilder.buildProject(LifecycleModuleBuilder.java:59)
	at org.apache.maven.lifecycle.internal.LifecycleStarter.singleThreadedBuild(LifecycleStarter.java:183)
	at org.apache.maven.lifecycle.internal.LifecycleStarter.execute(LifecycleStarter.java:161)
	at org.apache.maven.DefaultMaven.doExecute(DefaultMaven.java:320)
	at org.apache.maven.DefaultMaven.execute(DefaultMaven.java:156)
	at org.jvnet.hudson.maven3.launcher.Maven3Launcher.main(Maven3Launcher.java:117)
	at sun.reflect.NativeMethodAccessorImpl.invoke0(Native Method)
	at sun.reflect.NativeMethodAccessorImpl.invoke(NativeMethodAccessorImpl.java:62)
	at sun.reflect.DelegatingMethodAccessorImpl.invoke(DelegatingMethodAccessorImpl.java:43)
	at java.lang.reflect.Method.invoke(Method.java:483)
	at org.codehaus.plexus.classworlds.launcher.Launcher.launchStandard(Launcher.java:329)
	at org.codehaus.plexus.classworlds.launcher.Launcher.launch(Launcher.java:239)
	at org.jvnet.hudson.maven3.agent.Maven3Main.launch(Maven3Main.java:178)
	at sun.reflect.NativeMethodAccessorImpl.invoke0(Native Method)
	at sun.reflect.NativeMethodAccessorImpl.invoke(NativeMethodAccessorImpl.java:62)
	at sun.reflect.DelegatingMethodAccessorImpl.invoke(DelegatingMethodAccessorImpl.java:43)
	at java.lang.reflect.Method.invoke(Method.java:483)
	at hudson.maven.Maven3Builder.call(Maven3Builder.java:134)
	at hudson.maven.Maven3Builder.call(Maven3Builder.java:69)
	at hudson.remoting.UserRequest.perform(UserRequest.java:118)
	at hudson.remoting.UserRequest.perform(UserRequest.java:48)
	at hudson.remoting.Request$2.run(Request.java:328)
	at hudson.remoting.InterceptingExecutorService$1.call(InterceptingExecutorService.java:72)
	at java.util.concurrent.FutureTask.run(FutureTask.java:266)
	at java.util.concurrent.ThreadPoolExecutor.runWorker(ThreadPoolExecutor.java:1142)
	at java.util.concurrent.ThreadPoolExecutor$Worker.run(ThreadPoolExecutor.java:617)
	at java.lang.Thread.run(Thread.java:745)

Mime
View raw message