activemq-commits mailing list archives

Site index · List index
Message view « Date » · « Thread »
Top « Date » · « Thread »
From Apache Jenkins Server <jenk...@builds.apache.org>
Subject Build failed in Jenkins: ActiveMQ-openwire #2
Date Fri, 25 Jul 2014 16:09:25 GMT
See <https://builds.apache.org/job/ActiveMQ-openwire/2/>

------------------------------------------
[...truncated 233 lines...]
[INFO] Changes detected - recompiling the module!
[INFO] Compiling 432 source files to <https://builds.apache.org/job/ActiveMQ-openwire/ws/openwire-legacy/target/classes>
[INFO] 
[INFO] --- maven-resources-plugin:2.6:testResources (default-testResources) @ openwire-legacy
---
[INFO] Using 'UTF-8' encoding to copy filtered resources.
[INFO] skip non existing resourceDirectory <https://builds.apache.org/job/ActiveMQ-openwire/ws/openwire-legacy/src/test/resources>
[INFO] Copying 3 resources
[INFO] 
[INFO] --- maven-compiler-plugin:3.1:testCompile (default-testCompile) @ openwire-legacy ---
[INFO] No sources to compile
[INFO] 
[INFO] --- maven-surefire-plugin:2.16:test (default-test) @ openwire-legacy ---
[INFO] Tests are skipped.
[INFO] 
[INFO] --- maven-jar-plugin:2.4:jar (default-jar) @ openwire-legacy ---
[INFO] Building jar: <https://builds.apache.org/job/ActiveMQ-openwire/ws/openwire-legacy/target/openwire-legacy-1.0-SNAPSHOT.jar>
[INFO] 
[INFO] --- maven-site-plugin:3.2:attach-descriptor (attach-descriptor) @ openwire-legacy ---
[INFO] 
[INFO] --- maven-install-plugin:2.3.1:install (default-install) @ openwire-legacy ---
[INFO] Installing <https://builds.apache.org/job/ActiveMQ-openwire/ws/openwire-legacy/target/openwire-legacy-1.0-SNAPSHOT.jar>
to /home/jenkins/jenkins-slave/maven-repositories/0/org/apache/activemq/openwire-legacy/1.0-SNAPSHOT/openwire-legacy-1.0-SNAPSHOT.jar
[INFO] Installing <https://builds.apache.org/job/ActiveMQ-openwire/ws/openwire-legacy/pom.xml>
to /home/jenkins/jenkins-slave/maven-repositories/0/org/apache/activemq/openwire-legacy/1.0-SNAPSHOT/openwire-legacy-1.0-SNAPSHOT.pom
[INFO]                                                                         
[INFO] ------------------------------------------------------------------------
[INFO] Building openwire-interop-tests 1.0-SNAPSHOT
[INFO] ------------------------------------------------------------------------
[INFO] 
[INFO] --- maven-clean-plugin:2.5:clean (default-clean) @ openwire-interop-tests ---
[INFO] 
[INFO] --- maven-remote-resources-plugin:1.4:process (default) @ openwire-interop-tests ---
[INFO] 
[INFO] --- maven-resources-plugin:2.6:resources (default-resources) @ openwire-interop-tests
---
[INFO] Using 'UTF-8' encoding to copy filtered resources.
[INFO] skip non existing resourceDirectory <https://builds.apache.org/job/ActiveMQ-openwire/ws/openwire-interop-tests/src/main/resources>
[INFO] Copying 3 resources
[INFO] 
[INFO] --- maven-compiler-plugin:3.1:compile (default-compile) @ openwire-interop-tests ---
[INFO] No sources to compile
[INFO] 
[INFO] --- maven-resources-plugin:2.6:testResources (default-testResources) @ openwire-interop-tests
---
[INFO] Using 'UTF-8' encoding to copy filtered resources.
[INFO] Copying 1 resource
[INFO] Copying 3 resources
[INFO] 
[INFO] --- maven-compiler-plugin:3.1:testCompile (default-testCompile) @ openwire-interop-tests
---
[INFO] Changes detected - recompiling the module!
[INFO] Compiling 27 source files to <https://builds.apache.org/job/ActiveMQ-openwire/ws/openwire-interop-tests/target/test-classes>
[INFO] 
[INFO] --- maven-surefire-plugin:2.16:test (default-test) @ openwire-interop-tests ---
[INFO] Surefire report directory: <https://builds.apache.org/job/ActiveMQ-openwire/ws/openwire-interop-tests/target/surefire-reports>

-------------------------------------------------------
 T E S T S
-------------------------------------------------------
Running org.apache.activemq.openwire.codec.v1.OpenWireV1Test
Tests run: 14, Failures: 0, Errors: 0, Skipped: 0, Time elapsed: 4.42 sec - in org.apache.activemq.openwire.codec.v1.OpenWireV1Test
Running org.apache.activemq.openwire.codec.v1.WireFormatInfoV1MarshaledSizeTest
Tests run: 6, Failures: 0, Errors: 0, Skipped: 0, Time elapsed: 0.004 sec - in org.apache.activemq.openwire.codec.v1.WireFormatInfoV1MarshaledSizeTest
Running org.apache.activemq.openwire.codec.v5.WireFormatInfoV5MarshaledSizeTest
Tests run: 6, Failures: 0, Errors: 0, Skipped: 0, Time elapsed: 0.037 sec - in org.apache.activemq.openwire.codec.v5.WireFormatInfoV5MarshaledSizeTest
Running org.apache.activemq.openwire.codec.v5.OpenWireV5Test
Tests run: 14, Failures: 0, Errors: 0, Skipped: 0, Time elapsed: 3.311 sec - in org.apache.activemq.openwire.codec.v5.OpenWireV5Test
Running org.apache.activemq.openwire.codec.v6.WireFormatInfoV6MarshaledSizeTest
Tests run: 6, Failures: 0, Errors: 0, Skipped: 0, Time elapsed: 0.044 sec - in org.apache.activemq.openwire.codec.v6.WireFormatInfoV6MarshaledSizeTest
Running org.apache.activemq.openwire.codec.v6.OpenWireV6Test
Tests run: 14, Failures: 0, Errors: 0, Skipped: 0, Time elapsed: 3.173 sec - in org.apache.activemq.openwire.codec.v6.OpenWireV6Test
Running org.apache.activemq.openwire.codec.v9.OpenWireV9Test
Tests run: 14, Failures: 0, Errors: 0, Skipped: 0, Time elapsed: 3.181 sec - in org.apache.activemq.openwire.codec.v9.OpenWireV9Test
Running org.apache.activemq.openwire.codec.v9.WireFormatInfoV9MarshaledSizeTest
Tests run: 6, Failures: 0, Errors: 0, Skipped: 0, Time elapsed: 0.002 sec - in org.apache.activemq.openwire.codec.v9.WireFormatInfoV9MarshaledSizeTest
Running org.apache.activemq.openwire.codec.v10.OpenWireV10Test
Tests run: 14, Failures: 0, Errors: 0, Skipped: 0, Time elapsed: 2.054 sec - in org.apache.activemq.openwire.codec.v10.OpenWireV10Test
Running org.apache.activemq.openwire.codec.v10.WireFormatInfoV10MarshaledSizeTest
Tests run: 6, Failures: 0, Errors: 0, Skipped: 0, Time elapsed: 0.004 sec - in org.apache.activemq.openwire.codec.v10.WireFormatInfoV10MarshaledSizeTest
Running org.apache.activemq.openwire.codec.v8.WireFormatInfoV8MarshaledSizeTest
Tests run: 6, Failures: 0, Errors: 0, Skipped: 0, Time elapsed: 0.039 sec - in org.apache.activemq.openwire.codec.v8.WireFormatInfoV8MarshaledSizeTest
Running org.apache.activemq.openwire.codec.v8.OpenWireV8Test
Tests run: 14, Failures: 0, Errors: 0, Skipped: 0, Time elapsed: 3.023 sec - in org.apache.activemq.openwire.codec.v8.OpenWireV8Test
Running org.apache.activemq.openwire.codec.v2.WireFormatInfoV2MarshaledSizeTest
Tests run: 6, Failures: 0, Errors: 0, Skipped: 0, Time elapsed: 0.033 sec - in org.apache.activemq.openwire.codec.v2.WireFormatInfoV2MarshaledSizeTest
Running org.apache.activemq.openwire.codec.v2.OpenWireV2Test
Tests run: 14, Failures: 0, Errors: 0, Skipped: 0, Time elapsed: 3.01 sec - in org.apache.activemq.openwire.codec.v2.OpenWireV2Test
Running org.apache.activemq.openwire.codec.v7.OpenWireV7Test
Tests run: 14, Failures: 0, Errors: 0, Skipped: 0, Time elapsed: 3.089 sec - in org.apache.activemq.openwire.codec.v7.OpenWireV7Test
Running org.apache.activemq.openwire.codec.v7.WireFormatInfoV7MarshaledSizeTest
Tests run: 6, Failures: 0, Errors: 0, Skipped: 0, Time elapsed: 0.001 sec - in org.apache.activemq.openwire.codec.v7.WireFormatInfoV7MarshaledSizeTest
Running org.apache.activemq.openwire.codec.v4.OpenWireV4Test
Tests run: 14, Failures: 0, Errors: 0, Skipped: 0, Time elapsed: 2.044 sec - in org.apache.activemq.openwire.codec.v4.OpenWireV4Test
Running org.apache.activemq.openwire.codec.v4.WireFormatInfoV4MarshaledSizeTest
Tests run: 6, Failures: 0, Errors: 0, Skipped: 0, Time elapsed: 0.001 sec - in org.apache.activemq.openwire.codec.v4.WireFormatInfoV4MarshaledSizeTest
Running org.apache.activemq.openwire.codec.v3.OpenWireV3Test
Tests run: 14, Failures: 0, Errors: 0, Skipped: 0, Time elapsed: 3.017 sec - in org.apache.activemq.openwire.codec.v3.OpenWireV3Test
Running org.apache.activemq.openwire.codec.v3.WireFormatInfoV3MarshaledSizeTest
Tests run: 6, Failures: 0, Errors: 0, Skipped: 0, Time elapsed: 0.003 sec - in org.apache.activemq.openwire.codec.v3.WireFormatInfoV3MarshaledSizeTest
Running org.apache.activemq.openwire.codec.MessageCompressionTest
Tests run: 8, Failures: 0, Errors: 0, Skipped: 0, Time elapsed: 8.302 sec - in org.apache.activemq.openwire.codec.MessageCompressionTest

Results :

Tests run: 208, Failures: 0, Errors: 0, Skipped: 0

[JENKINS] Recording test results
[INFO] 
[INFO] --- maven-jar-plugin:2.4:jar (default-jar) @ openwire-interop-tests ---
[INFO] Building jar: <https://builds.apache.org/job/ActiveMQ-openwire/ws/openwire-interop-tests/target/openwire-interop-tests-1.0-SNAPSHOT.jar>
[INFO] 
[INFO] --- maven-site-plugin:3.2:attach-descriptor (attach-descriptor) @ openwire-interop-tests
---
[INFO] 
[INFO] --- maven-install-plugin:2.3.1:install (default-install) @ openwire-interop-tests ---
[INFO] Installing <https://builds.apache.org/job/ActiveMQ-openwire/ws/openwire-interop-tests/target/openwire-interop-tests-1.0-SNAPSHOT.jar>
to /home/jenkins/jenkins-slave/maven-repositories/0/org/apache/activemq/openwire-interop-tests/1.0-SNAPSHOT/openwire-interop-tests-1.0-SNAPSHOT.jar
[INFO] Installing <https://builds.apache.org/job/ActiveMQ-openwire/ws/openwire-interop-tests/pom.xml>
to /home/jenkins/jenkins-slave/maven-repositories/0/org/apache/activemq/openwire-interop-tests/1.0-SNAPSHOT/openwire-interop-tests-1.0-SNAPSHOT.pom
[INFO]                                                                         
[INFO] ------------------------------------------------------------------------
[INFO] Building openwire-jms 1.0-SNAPSHOT
[INFO] ------------------------------------------------------------------------
[INFO] 
[INFO] --- maven-clean-plugin:2.5:clean (default-clean) @ openwire-jms ---
[INFO] 
[INFO] --- maven-remote-resources-plugin:1.4:process (default) @ openwire-jms ---
[INFO] 
[INFO] --- maven-resources-plugin:2.6:resources (default-resources) @ openwire-jms ---
[INFO] Using 'UTF-8' encoding to copy filtered resources.
[INFO] skip non existing resourceDirectory <https://builds.apache.org/job/ActiveMQ-openwire/ws/openwire-jms/src/main/resources>
[INFO] Copying 3 resources
[INFO] 
[INFO] --- maven-compiler-plugin:3.1:compile (default-compile) @ openwire-jms ---
[INFO] Changes detected - recompiling the module!
[INFO] Compiling 9 source files to <https://builds.apache.org/job/ActiveMQ-openwire/ws/openwire-jms/target/classes>
[INFO] 
[INFO] --- maven-resources-plugin:2.6:testResources (default-testResources) @ openwire-jms
---
[INFO] Using 'UTF-8' encoding to copy filtered resources.
[INFO] Copying 1 resource
[INFO] Copying 3 resources
[INFO] 
[INFO] --- maven-compiler-plugin:3.1:testCompile (default-testCompile) @ openwire-jms ---
[INFO] Changes detected - recompiling the module!
[INFO] Compiling 6 source files to <https://builds.apache.org/job/ActiveMQ-openwire/ws/openwire-jms/target/test-classes>
[INFO] 
[INFO] --- maven-surefire-plugin:2.16:test (default-test) @ openwire-jms ---
[INFO] Surefire report directory: <https://builds.apache.org/job/ActiveMQ-openwire/ws/openwire-jms/target/surefire-reports>

-------------------------------------------------------
 T E S T S
-------------------------------------------------------
Running org.apache.activemq.openwire.jms.OpenWireJMSStreamMessageTest
Tests run: 17, Failures: 0, Errors: 0, Skipped: 0, Time elapsed: 0.312 sec - in org.apache.activemq.openwire.jms.OpenWireJMSStreamMessageTest
Running org.apache.activemq.openwire.jms.OpenWireJMSTextMessageTest
Tests run: 3, Failures: 0, Errors: 0, Skipped: 0, Time elapsed: 0.003 sec - in org.apache.activemq.openwire.jms.OpenWireJMSTextMessageTest
Running org.apache.activemq.openwire.jms.OpenWireJMSMessageTest
Tests run: 50, Failures: 0, Errors: 0, Skipped: 0, Time elapsed: 0.25 sec - in org.apache.activemq.openwire.jms.OpenWireJMSMessageTest
Running org.apache.activemq.openwire.jms.OpenWireJMSMapMessageTest
Tests run: 17, Failures: 0, Errors: 0, Skipped: 0, Time elapsed: 0.125 sec - in org.apache.activemq.openwire.jms.OpenWireJMSMapMessageTest
Running org.apache.activemq.openwire.jms.OpenWireJMSObjectMessageTest
Tests run: 5, Failures: 0, Errors: 0, Skipped: 0, Time elapsed: 0.011 sec - in org.apache.activemq.openwire.jms.OpenWireJMSObjectMessageTest
Running org.apache.activemq.openwire.jms.OpenWireJMSBytesMessageTest
Tests run: 19, Failures: 0, Errors: 0, Skipped: 0, Time elapsed: 0.01 sec - in org.apache.activemq.openwire.jms.OpenWireJMSBytesMessageTest

Results :

Tests run: 111, Failures: 0, Errors: 0, Skipped: 0

[JENKINS] Recording test results
[INFO] 
[INFO] --- maven-jar-plugin:2.4:jar (default-jar) @ openwire-jms ---
[INFO] Building jar: <https://builds.apache.org/job/ActiveMQ-openwire/ws/openwire-jms/target/openwire-jms-1.0-SNAPSHOT.jar>
[INFO] 
[INFO] --- maven-site-plugin:3.2:attach-descriptor (attach-descriptor) @ openwire-jms ---
[INFO] 
[INFO] --- maven-install-plugin:2.3.1:install (default-install) @ openwire-jms ---
[INFO] Installing <https://builds.apache.org/job/ActiveMQ-openwire/ws/openwire-jms/target/openwire-jms-1.0-SNAPSHOT.jar>
to /home/jenkins/jenkins-slave/maven-repositories/0/org/apache/activemq/openwire-jms/1.0-SNAPSHOT/openwire-jms-1.0-SNAPSHOT.jar
[INFO] Installing <https://builds.apache.org/job/ActiveMQ-openwire/ws/openwire-jms/pom.xml>
to /home/jenkins/jenkins-slave/maven-repositories/0/org/apache/activemq/openwire-jms/1.0-SNAPSHOT/openwire-jms-1.0-SNAPSHOT.pom
[INFO] ------------------------------------------------------------------------
[INFO] Reactor Summary:
[INFO] 
[INFO] openwire-protocol ................................. SUCCESS [32.498s]
[INFO] openwire-generator ................................ SUCCESS [6.159s]
[INFO] openwire-core ..................................... SUCCESS [24.664s]
[INFO] openwire-legacy ................................... SUCCESS [3.476s]
[INFO] openwire-interop-tests ............................ SUCCESS [45.474s]
[INFO] openwire-jms ...................................... SUCCESS [6.005s]
[INFO] ------------------------------------------------------------------------
[INFO] BUILD SUCCESS
[INFO] ------------------------------------------------------------------------
[INFO] Total time: 2:10.892s
[INFO] Finished at: Fri Jul 25 16:08:17 UTC 2014
[INFO] Final Memory: 29M/981M
[INFO] ------------------------------------------------------------------------
Waiting for Jenkins to finish collecting data
[JENKINS] Archiving <https://builds.apache.org/job/ActiveMQ-openwire/ws/openwire-generator/pom.xml>
to org.apache.activemq/openwire-generator/1.0-SNAPSHOT/openwire-generator-1.0-SNAPSHOT.pom
[JENKINS] Archiving <https://builds.apache.org/job/ActiveMQ-openwire/ws/openwire-generator/target/openwire-generator-1.0-SNAPSHOT.jar>
to org.apache.activemq/openwire-generator/1.0-SNAPSHOT/openwire-generator-1.0-SNAPSHOT.jar
No prior successful build to compare, so performing full copy of artifacts
[JENKINS] Archiving <https://builds.apache.org/job/ActiveMQ-openwire/ws/openwire-interop-tests/pom.xml>
to org.apache.activemq/openwire-interop-tests/1.0-SNAPSHOT/openwire-interop-tests-1.0-SNAPSHOT.pom
[JENKINS] Archiving <https://builds.apache.org/job/ActiveMQ-openwire/ws/openwire-interop-tests/target/openwire-interop-tests-1.0-SNAPSHOT.jar>
to org.apache.activemq/openwire-interop-tests/1.0-SNAPSHOT/openwire-interop-tests-1.0-SNAPSHOT.jar
No prior successful build to compare, so performing full copy of artifacts
[JENKINS] Archiving <https://builds.apache.org/job/ActiveMQ-openwire/ws/openwire-legacy/pom.xml>
to org.apache.activemq/openwire-legacy/1.0-SNAPSHOT/openwire-legacy-1.0-SNAPSHOT.pom
[JENKINS] Archiving <https://builds.apache.org/job/ActiveMQ-openwire/ws/openwire-legacy/target/openwire-legacy-1.0-SNAPSHOT.jar>
to org.apache.activemq/openwire-legacy/1.0-SNAPSHOT/openwire-legacy-1.0-SNAPSHOT.jar
No prior successful build to compare, so performing full copy of artifacts
[JENKINS] Archiving <https://builds.apache.org/job/ActiveMQ-openwire/ws/pom.xml> to
org.apache.activemq/openwire-protocol/1.0-SNAPSHOT/openwire-protocol-1.0-SNAPSHOT.pom
No prior successful build to compare, so performing full copy of artifacts
[JENKINS] Archiving <https://builds.apache.org/job/ActiveMQ-openwire/ws/openwire-core/pom.xml>
to org.apache.activemq/openwire-core/1.0-SNAPSHOT/openwire-core-1.0-SNAPSHOT.pom
[JENKINS] Archiving <https://builds.apache.org/job/ActiveMQ-openwire/ws/openwire-core/target/openwire-core-1.0-SNAPSHOT.jar>
to org.apache.activemq/openwire-core/1.0-SNAPSHOT/openwire-core-1.0-SNAPSHOT.jar
No prior successful build to compare, so performing full copy of artifacts
[JENKINS] Archiving <https://builds.apache.org/job/ActiveMQ-openwire/ws/openwire-jms/pom.xml>
to org.apache.activemq/openwire-jms/1.0-SNAPSHOT/openwire-jms-1.0-SNAPSHOT.pom
[JENKINS] Archiving <https://builds.apache.org/job/ActiveMQ-openwire/ws/openwire-jms/target/openwire-jms-1.0-SNAPSHOT.jar>
to org.apache.activemq/openwire-jms/1.0-SNAPSHOT/openwire-jms-1.0-SNAPSHOT.jar
No prior successful build to compare, so performing full copy of artifacts
channel stopped
Maven RedeployPublisher use remote ubuntu-4 maven settings from : /home/jenkins/.m2/settings.xml
[ERROR] uniqueVersion == false is not anymore supported in maven 3
[INFO] Deployment in https://repository.apache.org/content/repositories/snapshots (id=,uniqueVersion=false)
Deploying the main artifact openwire-core-1.0-SNAPSHOT.jar
Downloading: https://repository.apache.org/content/repositories/snapshots/org/apache/activemq/openwire-core/1.0-SNAPSHOT/maven-metadata.xml
Uploading: https://repository.apache.org/content/repositories/snapshots/org/apache/activemq/openwire-core/1.0-SNAPSHOT/openwire-core-1.0-20140725.160925-1.jar
Uploading: https://repository.apache.org/content/repositories/snapshots/org/apache/activemq/openwire-core/1.0-SNAPSHOT/openwire-core-1.0-20140725.160925-1.pom
ERROR: Failed to deploy artifacts: Could not transfer artifact org.apache.activemq:openwire-core:jar:1.0-20140725.160925-1
from/to  (https://repository.apache.org/content/repositories/snapshots): Failed to transfer
file: https://repository.apache.org/content/repositories/snapshots/org/apache/activemq/openwire-core/1.0-SNAPSHOT/openwire-core-1.0-20140725.160925-1.jar.
Return code is: 401, ReasonPhrase: Unauthorized.
org.apache.maven.artifact.deployer.ArtifactDeploymentException: Failed to deploy artifacts:
Could not transfer artifact org.apache.activemq:openwire-core:jar:1.0-20140725.160925-1 from/to
 (https://repository.apache.org/content/repositories/snapshots): Failed to transfer file:
https://repository.apache.org/content/repositories/snapshots/org/apache/activemq/openwire-core/1.0-SNAPSHOT/openwire-core-1.0-20140725.160925-1.jar.
Return code is: 401, ReasonPhrase: Unauthorized.
	at org.apache.maven.artifact.deployer.DefaultArtifactDeployer.deploy(DefaultArtifactDeployer.java:143)
	at hudson.maven.reporters.MavenArtifactRecord.deploy(MavenArtifactRecord.java:193)
	at hudson.maven.RedeployPublisher.perform(RedeployPublisher.java:176)
	at hudson.tasks.BuildStepMonitor$1.perform(BuildStepMonitor.java:20)
	at hudson.model.AbstractBuild$AbstractBuildExecution.perform(AbstractBuild.java:804)
	at hudson.model.AbstractBuild$AbstractBuildExecution.performAllBuildSteps(AbstractBuild.java:776)
	at hudson.maven.MavenModuleSetBuild$MavenModuleSetBuildExecution.post2(MavenModuleSetBuild.java:1040)
	at hudson.model.AbstractBuild$AbstractBuildExecution.post(AbstractBuild.java:725)
	at hudson.model.Run.execute(Run.java:1701)
	at hudson.maven.MavenModuleSetBuild.run(MavenModuleSetBuild.java:529)
	at hudson.model.ResourceController.execute(ResourceController.java:88)
	at hudson.model.Executor.run(Executor.java:231)
Caused by: org.eclipse.aether.deployment.DeploymentException: Failed to deploy artifacts:
Could not transfer artifact org.apache.activemq:openwire-core:jar:1.0-20140725.160925-1 from/to
 (https://repository.apache.org/content/repositories/snapshots): Failed to transfer file:
https://repository.apache.org/content/repositories/snapshots/org/apache/activemq/openwire-core/1.0-SNAPSHOT/openwire-core-1.0-20140725.160925-1.jar.
Return code is: 401, ReasonPhrase: Unauthorized.
	at org.eclipse.aether.internal.impl.DefaultDeployer.deploy(DefaultDeployer.java:341)
	at org.eclipse.aether.internal.impl.DefaultDeployer.deploy(DefaultDeployer.java:269)
	at org.eclipse.aether.internal.impl.DefaultRepositorySystem.deploy(DefaultRepositorySystem.java:413)
	at org.apache.maven.artifact.deployer.DefaultArtifactDeployer.deploy(DefaultArtifactDeployer.java:139)
	... 11 more
Caused by: org.eclipse.aether.transfer.ArtifactTransferException: Could not transfer artifact
org.apache.activemq:openwire-core:jar:1.0-20140725.160925-1 from/to  (https://repository.apache.org/content/repositories/snapshots):
Failed to transfer file: https://repository.apache.org/content/repositories/snapshots/org/apache/activemq/openwire-core/1.0-SNAPSHOT/openwire-core-1.0-20140725.160925-1.jar.
Return code is: 401, ReasonPhrase: Unauthorized.
	at org.eclipse.aether.connector.wagon.WagonRepositoryConnector$6.wrap(WagonRepositoryConnector.java:1016)
	at org.eclipse.aether.connector.wagon.WagonRepositoryConnector$6.wrap(WagonRepositoryConnector.java:1004)
	at org.eclipse.aether.connector.wagon.WagonRepositoryConnector$PutTask.run(WagonRepositoryConnector.java:895)
	at org.eclipse.aether.connector.wagon.WagonRepositoryConnector.put(WagonRepositoryConnector.java:522)
	at org.eclipse.aether.internal.impl.DefaultDeployer.deploy(DefaultDeployer.java:335)
	... 14 more
Caused by: org.apache.maven.wagon.TransferFailedException: Failed to transfer file: https://repository.apache.org/content/repositories/snapshots/org/apache/activemq/openwire-core/1.0-SNAPSHOT/openwire-core-1.0-20140725.160925-1.jar.
Return code is: 401, ReasonPhrase: Unauthorized.
	at org.apache.maven.wagon.shared.http4.AbstractHttpClientWagon.put(AbstractHttpClientWagon.java:626)
	at org.apache.maven.wagon.shared.http4.AbstractHttpClientWagon.put(AbstractHttpClientWagon.java:524)
	at org.apache.maven.wagon.shared.http4.AbstractHttpClientWagon.put(AbstractHttpClientWagon.java:505)
	at org.apache.maven.wagon.shared.http4.AbstractHttpClientWagon.put(AbstractHttpClientWagon.java:485)
	at org.eclipse.aether.connector.wagon.WagonRepositoryConnector$PutTask.run(WagonRepositoryConnector.java:871)
	... 16 more
[INFO] Deployment failed after 2.4 sec
Build step 'Deploy artifacts to Maven repository' changed build result to FAILURE

Mime
View raw message