activemq-commits mailing list archives

Site index · List index
Message view « Date » · « Thread »
Top « Date » · « Thread »
From Apache Jenkins Server <jenk...@builds.apache.org>
Subject Build failed in Jenkins: ActiveMQ-Java8 » ActiveMQ :: Unit Tests #25
Date Thu, 19 Jun 2014 23:01:43 GMT
See <https://builds.apache.org/job/ActiveMQ-Java8/org.apache.activemq$activemq-unit-tests/25/changes>

Changes:

[tabish121] https://issues.apache.org/jira/browse/AMQ-5231

------------------------------------------
[...truncated 770 lines...]
Running org.apache.activemq.store.kahadb.TempKahaDBStoreBrokerTest
Tests run: 129, Failures: 0, Errors: 0, Skipped: 0, Time elapsed: 199.127 sec - in org.apache.activemq.store.kahadb.TempKahaDBStoreBrokerTest
Running org.apache.activemq.store.kahadb.plist.KahaDBFilePendingMessageCursorTest
Tests run: 3, Failures: 0, Errors: 0, Skipped: 0, Time elapsed: 5.855 sec - in org.apache.activemq.store.kahadb.plist.KahaDBFilePendingMessageCursorTest
Running org.apache.activemq.store.leveldb.LevelDBNegativeQueueTest
Running org.apache.activemq.store.leveldb.LevelDBStoreBrokerTest
Running org.apache.activemq.streams.JMSInputStreamTest
Tests run: 10, Failures: 0, Errors: 0, Skipped: 0, Time elapsed: 5.57 sec - in org.apache.activemq.streams.JMSInputStreamTest
Running org.apache.activemq.test.JmsTopicSendReceiveTest
Tests run: 1, Failures: 0, Errors: 0, Skipped: 0, Time elapsed: 2.078 sec - in org.apache.activemq.test.JmsTopicSendReceiveTest
Running org.apache.activemq.test.JmsTopicSendReceiveWithTwoConnectionsAndByteSelectorTest
Tests run: 1, Failures: 0, Errors: 0, Skipped: 0, Time elapsed: 1.994 sec - in org.apache.activemq.test.JmsTopicSendReceiveWithTwoConnectionsAndByteSelectorTest
Running org.apache.activemq.test.JmsTopicSendReceiveWithTwoConnectionsTest
Tests run: 1, Failures: 0, Errors: 0, Skipped: 0, Time elapsed: 2.009 sec - in org.apache.activemq.test.JmsTopicSendReceiveWithTwoConnectionsTest
Running org.apache.activemq.test.TemporaryDestinationToFromNameTest
Tests run: 2, Failures: 0, Errors: 0, Skipped: 0, Time elapsed: 0.98 sec - in org.apache.activemq.test.TemporaryDestinationToFromNameTest
Running org.apache.activemq.test.retroactive.RetroactiveConsumerTestWithDestinationBasedBufferTest
Tests run: 1, Failures: 0, Errors: 0, Skipped: 0, Time elapsed: 1.54 sec - in org.apache.activemq.test.retroactive.RetroactiveConsumerTestWithDestinationBasedBufferTest
Running org.apache.activemq.test.retroactive.RetroactiveConsumerTestWithLastImagePolicyWithWildcardTest
Tests run: 1, Failures: 0, Errors: 0, Skipped: 0, Time elapsed: 1.593 sec - in org.apache.activemq.test.retroactive.RetroactiveConsumerTestWithLastImagePolicyWithWildcardTest
Running org.apache.activemq.test.retroactive.RetroactiveConsumerTestWithSimpleMessageListTest
Tests run: 1, Failures: 0, Errors: 0, Skipped: 0, Time elapsed: 1.506 sec - in org.apache.activemq.test.retroactive.RetroactiveConsumerTestWithSimpleMessageListTest
Running org.apache.activemq.test.retroactive.RetroactiveConsumerTestWithTimePolicyTest
Tests run: 1, Failures: 0, Errors: 0, Skipped: 0, Time elapsed: 4.02 sec - in org.apache.activemq.test.retroactive.RetroactiveConsumerTestWithTimePolicyTest
Running org.apache.activemq.test.retroactive.RetroactiveConsumerWithMessageQueryTest
Tests run: 1, Failures: 0, Errors: 0, Skipped: 0, Time elapsed: 1.65 sec - in org.apache.activemq.test.retroactive.RetroactiveConsumerWithMessageQueryTest
Running org.apache.activemq.test.rollback.CloseRollbackRedeliveryQueueTest
Tests run: 3, Failures: 0, Errors: 0, Skipped: 0, Time elapsed: 1.297 sec - in org.apache.activemq.test.rollback.CloseRollbackRedeliveryQueueTest
Running org.apache.activemq.transport.failover.BadConnectionTest
Tests run: 1, Failures: 0, Errors: 0, Skipped: 0, Time elapsed: 0.685 sec - in org.apache.activemq.transport.failover.BadConnectionTest
Running org.apache.activemq.transport.failover.FailoverBackupLeakTest
Tests run: 2, Failures: 0, Errors: 0, Skipped: 0, Time elapsed: 1.074 sec - in org.apache.activemq.transport.failover.FailoverBackupLeakTest
Running org.apache.activemq.transport.failover.FailoverTransportTest
Tests run: 4, Failures: 0, Errors: 0, Skipped: 1, Time elapsed: 0.26 sec - in org.apache.activemq.transport.failover.FailoverTransportTest
Running org.apache.activemq.transport.failover.FailoverTransportUriHandlingTest
Tests run: 4, Failures: 0, Errors: 0, Skipped: 0, Time elapsed: 1.036 sec - in org.apache.activemq.transport.failover.FailoverTransportUriHandlingTest
Running org.apache.activemq.transport.failover.FailoverUriTest
Tests run: 16, Failures: 0, Errors: 0, Skipped: 0, Time elapsed: 1.4 sec - in org.apache.activemq.transport.failover.FailoverUriTest
Running org.apache.activemq.transport.failover.SlowConnectionTest
Tests run: 1, Failures: 0, Errors: 0, Skipped: 0, Time elapsed: 1.421 sec - in org.apache.activemq.transport.failover.SlowConnectionTest
Running org.apache.activemq.transport.failover.TwoBrokerFailoverClusterTest
Tests run: 1, Failures: 0, Errors: 0, Skipped: 0, Time elapsed: 19.401 sec - in org.apache.activemq.transport.failover.TwoBrokerFailoverClusterTest
Running org.apache.activemq.transport.reliable.ReliableTransportTest
Tests run: 7, Failures: 0, Errors: 0, Skipped: 0, Time elapsed: 0.145 sec - in org.apache.activemq.transport.reliable.ReliableTransportTest
Running org.apache.activemq.transport.tcp.QualityOfServiceUtilsTest
Tests run: 6, Failures: 0, Errors: 0, Skipped: 0, Time elapsed: 0.049 sec - in org.apache.activemq.transport.tcp.QualityOfServiceUtilsTest
Running org.apache.activemq.transport.tcp.SslTransportFactoryTest
Tests run: 2, Failures: 0, Errors: 0, Skipped: 0, Time elapsed: 0.563 sec - in org.apache.activemq.transport.tcp.SslTransportFactoryTest
Running org.apache.activemq.transport.tcp.SslTransportServerTest
Tests run: 2, Failures: 0, Errors: 0, Skipped: 0, Time elapsed: 0.147 sec - in org.apache.activemq.transport.tcp.SslTransportServerTest
Running org.apache.activemq.transport.tcp.SslTransportTest
Tests run: 1, Failures: 0, Errors: 0, Skipped: 0, Time elapsed: 0.145 sec - in org.apache.activemq.transport.tcp.SslTransportTest
Running org.apache.activemq.transport.tcp.TcpTransportBindTest
Tests run: 2, Failures: 0, Errors: 1, Skipped: 0, Time elapsed: 2.021 sec <<< FAILURE!
- in org.apache.activemq.transport.tcp.TcpTransportBindTest
testConnect(org.apache.activemq.transport.tcp.TcpTransportBindTest)  Time elapsed: 0.031 sec
 <<< ERROR!
javax.management.InstanceAlreadyExistsException: org.apache.activemq:type=Broker,brokerName=localhost
	at com.sun.jmx.mbeanserver.Repository.addMBean(Repository.java:437)
	at com.sun.jmx.interceptor.DefaultMBeanServerInterceptor.registerWithRepository(DefaultMBeanServerInterceptor.java:1898)
	at com.sun.jmx.interceptor.DefaultMBeanServerInterceptor.registerDynamicMBean(DefaultMBeanServerInterceptor.java:966)
	at com.sun.jmx.interceptor.DefaultMBeanServerInterceptor.registerObject(DefaultMBeanServerInterceptor.java:900)
	at com.sun.jmx.interceptor.DefaultMBeanServerInterceptor.registerMBean(DefaultMBeanServerInterceptor.java:324)
	at com.sun.jmx.mbeanserver.JmxMBeanServer.registerMBean(JmxMBeanServer.java:522)
	at org.apache.activemq.broker.jmx.ManagementContext.registerMBean(ManagementContext.java:380)
	at org.apache.activemq.broker.jmx.AnnotatedMBean.registerMBean(AnnotatedMBean.java:72)
	at org.apache.activemq.broker.BrokerService.startManagementContext(BrokerService.java:2454)
	at org.apache.activemq.broker.BrokerService.start(BrokerService.java:581)
	at org.apache.activemq.EmbeddedBrokerTestSupport.startBroker(EmbeddedBrokerTestSupport.java:124)
	at org.apache.activemq.EmbeddedBrokerTestSupport.setUp(EmbeddedBrokerTestSupport.java:47)
	at org.apache.activemq.transport.tcp.TcpTransportBindTest.setUp(TcpTransportBindTest.java:39)

Running org.apache.activemq.transport.tcp.TcpTransportServerTest
Tests run: 1, Failures: 0, Errors: 0, Skipped: 0, Time elapsed: 0.24 sec - in org.apache.activemq.transport.tcp.TcpTransportServerTest
Running org.apache.activemq.transport.tcp.TransportConnectorInvalidSocketOptionsTest
Tests run: 2, Failures: 0, Errors: 0, Skipped: 0, Time elapsed: 0.854 sec - in org.apache.activemq.transport.tcp.TransportConnectorInvalidSocketOptionsTest
Running org.apache.activemq.transport.tcp.TransportUriTest
Tests run: 14, Failures: 0, Errors: 0, Skipped: 0, Time elapsed: 1.171 sec - in org.apache.activemq.transport.tcp.TransportUriTest
Running org.apache.activemq.transport.tcp.WireformatNegociationTest
Tests run: 5, Failures: 0, Errors: 0, Skipped: 0, Time elapsed: 0.299 sec - in org.apache.activemq.transport.tcp.WireformatNegociationTest
Running org.apache.activemq.transport.udp.UdpSendReceiveWithTwoConnectionsAndLargeMessagesTest
Tests run: 1, Failures: 0, Errors: 0, Skipped: 0, Time elapsed: 2.075 sec - in org.apache.activemq.transport.udp.UdpSendReceiveWithTwoConnectionsAndLargeMessagesTest
Running org.apache.activemq.transport.udp.UdpSendReceiveWithTwoConnectionsTest
Tests run: 1, Failures: 0, Errors: 0, Skipped: 0, Time elapsed: 1.853 sec - in org.apache.activemq.transport.udp.UdpSendReceiveWithTwoConnectionsTest
Running org.apache.activemq.transport.udp.UdpTransportTest
Tests run: 3, Failures: 0, Errors: 0, Skipped: 0, Time elapsed: 0.26 sec - in org.apache.activemq.transport.udp.UdpTransportTest
Running org.apache.activemq.transport.udp.UdpTransportUsingServerTest
Tests run: 4, Failures: 0, Errors: 0, Skipped: 0, Time elapsed: 0.293 sec - in org.apache.activemq.transport.udp.UdpTransportUsingServerTest
Running org.apache.activemq.transport.udp.UpdTransportBindTest
Tests run: 1, Failures: 0, Errors: 0, Skipped: 0, Time elapsed: 0.969 sec - in org.apache.activemq.transport.udp.UpdTransportBindTest
Running org.apache.activemq.transport.vm.VMTransportEmbeddedBrokerTest
Tests run: 1, Failures: 0, Errors: 0, Skipped: 0, Time elapsed: 0.9 sec - in org.apache.activemq.transport.vm.VMTransportEmbeddedBrokerTest
Running org.apache.activemq.transport.vm.VMTransportThreadSafeTest
Tests run: 19, Failures: 0, Errors: 0, Skipped: 0, Time elapsed: 62.991 sec - in org.apache.activemq.transport.vm.VMTransportThreadSafeTest
Running org.apache.activemq.usage.CompositeMessageCursorUsageTest
Tests run: 1, Failures: 0, Errors: 0, Skipped: 0, Time elapsed: 0.989 sec - in org.apache.activemq.usage.CompositeMessageCursorUsageTest
Running org.apache.activemq.usage.JobSchedulerStoreUsageTest
Tests run: 1, Failures: 0, Errors: 0, Skipped: 0, Time elapsed: 35.768 sec - in org.apache.activemq.usage.JobSchedulerStoreUsageTest
Running org.apache.activemq.usage.StoreUsageLimitsTest
Tests run: 1, Failures: 0, Errors: 0, Skipped: 0, Time elapsed: 35.348 sec - in org.apache.activemq.usage.StoreUsageLimitsTest
Running org.apache.activemq.usecases.AdvisoryTopicDeletionTest
Tests run: 2, Failures: 0, Errors: 0, Skipped: 0, Time elapsed: 1.01 sec - in org.apache.activemq.usecases.AdvisoryTopicDeletionTest
Running org.apache.activemq.usecases.AuthorizationFromAdminViewTest
Tests run: 1, Failures: 0, Errors: 0, Skipped: 0, Time elapsed: 0.796 sec - in org.apache.activemq.usecases.AuthorizationFromAdminViewTest
Running org.apache.activemq.usecases.BacklogNetworkCrossTalkTest
Running org.apache.activemq.usecases.BrokerQueueNetworkWithDisconnectTest
Tests run: 4, Failures: 0, Errors: 0, Skipped: 0, Time elapsed: 216.005 sec - in org.apache.activemq.usecases.BrokerQueueNetworkWithDisconnectTest
Running org.apache.activemq.usecases.BrowseDLQTest
Tests run: 1, Failures: 0, Errors: 0, Skipped: 0, Time elapsed: 34.473 sec - in org.apache.activemq.usecases.BrowseDLQTest
Running org.apache.activemq.usecases.ChangeSentMessageTest
Tests run: 1, Failures: 0, Errors: 0, Skipped: 0, Time elapsed: 1.057 sec - in org.apache.activemq.usecases.ChangeSentMessageTest
Running org.apache.activemq.usecases.ChangeSessionDeliveryModeTest
Tests run: 1, Failures: 0, Errors: 0, Skipped: 0, Time elapsed: 0.866 sec - in org.apache.activemq.usecases.ChangeSessionDeliveryModeTest
Running org.apache.activemq.usecases.CompositeConsumeTest
Tests run: 1, Failures: 0, Errors: 0, Skipped: 0, Time elapsed: 0.948 sec - in org.apache.activemq.usecases.CompositeConsumeTest
Running org.apache.activemq.usecases.ConsumeQueuePrefetchTest
Tests run: 4, Failures: 0, Errors: 0, Skipped: 0, Time elapsed: 1.26 sec - in org.apache.activemq.usecases.ConsumeQueuePrefetchTest
Running org.apache.activemq.usecases.ConsumeTopicPrefetchTest
Tests run: 3, Failures: 0, Errors: 0, Skipped: 0, Time elapsed: 2.957 sec - in org.apache.activemq.usecases.ConsumeTopicPrefetchTest
Running org.apache.activemq.usecases.CreateTemporaryQueueBeforeStartTest
Tests run: 3, Failures: 0, Errors: 0, Skipped: 0, Time elapsed: 0.935 sec - in org.apache.activemq.usecases.CreateTemporaryQueueBeforeStartTest
Running org.apache.activemq.usecases.DurableSubProcessConcurrentCommitActivateNoDuplicateTest
Tests run: 1, Failures: 0, Errors: 0, Skipped: 1, Time elapsed: 0.069 sec - in org.apache.activemq.usecases.DurableSubProcessConcurrentCommitActivateNoDuplicateTest
Running org.apache.activemq.usecases.DurableSubProcessWithRestartTest
Tests run: 1, Failures: 0, Errors: 0, Skipped: 1, Time elapsed: 0.082 sec - in org.apache.activemq.usecases.DurableSubProcessWithRestartTest
Running org.apache.activemq.usecases.DurableSubsOfflineSelectorConcurrentConsumeIndexUseTest
Running org.apache.activemq.usecases.DurableSubsOfflineSelectorIndexUseTest
Tests run: 3, Failures: 0, Errors: 0, Skipped: 0, Time elapsed: 588.519 sec - in org.apache.activemq.usecases.DurableSubsOfflineSelectorIndexUseTest
Running org.apache.activemq.usecases.DurableSubscriptionOffline1Test
Tests run: 18, Failures: 0, Errors: 0, Skipped: 0, Time elapsed: 453.531 sec - in org.apache.activemq.usecases.DurableSubscriptionOffline1Test
Running org.apache.activemq.usecases.DurableSubscriptionOffline2Test
Tests run: 2, Failures: 0, Errors: 0, Skipped: 0, Time elapsed: 22.198 sec - in org.apache.activemq.usecases.DurableSubscriptionOffline2Test
Running org.apache.activemq.usecases.DurableSubscriptionOffline3Test
Tests run: 12, Failures: 0, Errors: 0, Skipped: 0, Time elapsed: 368.89 sec - in org.apache.activemq.usecases.DurableSubscriptionOffline3Test
Running org.apache.activemq.usecases.DurableSubscriptionOffline4Test
Tests run: 2, Failures: 0, Errors: 0, Skipped: 0, Time elapsed: 94.312 sec - in org.apache.activemq.usecases.DurableSubscriptionOffline4Test
Running org.apache.activemq.usecases.ExceptionListenerTest
Tests run: 1, Failures: 0, Errors: 0, Skipped: 0, Time elapsed: 0.04 sec - in org.apache.activemq.usecases.ExceptionListenerTest
Running org.apache.activemq.usecases.LevelDBDurableSubscriptionTest
Tests run: 12, Failures: 0, Errors: 0, Skipped: 0, Time elapsed: 40.433 sec - in org.apache.activemq.usecases.LevelDBDurableSubscriptionTest
Running org.apache.activemq.usecases.ManagedDurableSubscriptionTest
Tests run: 1, Failures: 0, Errors: 0, Skipped: 0, Time elapsed: 3.13 sec - in org.apache.activemq.usecases.ManagedDurableSubscriptionTest
Running org.apache.activemq.usecases.MemoryLimitTest
Tests run: 6, Failures: 0, Errors: 3, Skipped: 3, Time elapsed: 392.619 sec <<< FAILURE!
- in org.apache.activemq.usecases.MemoryLimitTest
testCursorBatch[store=KahaDB](org.apache.activemq.usecases.MemoryLimitTest)  Time elapsed:
121.81 sec  <<< ERROR!
java.lang.Exception: test timed out after 120000 milliseconds
	at java.lang.Object.wait(Native Method)
	at java.lang.Thread.join(Thread.java:1245)
	at java.lang.Thread.join(Thread.java:1319)
	at org.apache.activemq.usecases.MemoryLimitTest.testCursorBatch(MemoryLimitTest.java:112)

testCursorBatch[store=LevelDB](org.apache.activemq.usecases.MemoryLimitTest)  Time elapsed:
121.444 sec  <<< ERROR!
java.lang.Exception: test timed out after 120000 milliseconds
	at java.lang.Object.wait(Native Method)
	at java.lang.Thread.join(Thread.java:1245)
	at java.lang.Thread.join(Thread.java:1319)
	at org.apache.activemq.usecases.MemoryLimitTest.testCursorBatch(MemoryLimitTest.java:112)

testCursorBatch[store=JDBC](org.apache.activemq.usecases.MemoryLimitTest)  Time elapsed: 149.108
sec  <<< ERROR!
java.lang.Exception: test timed out after 120000 milliseconds
	at java.lang.Object.wait(Native Method)
	at java.lang.Thread.join(Thread.java:1245)
	at java.lang.Thread.join(Thread.java:1319)
	at org.apache.activemq.usecases.MemoryLimitTest.testCursorBatch(MemoryLimitTest.java:112)

Running org.apache.activemq.usecases.MessageGroupLateArrivalsTest
Tests run: 2, Failures: 0, Errors: 0, Skipped: 0, Time elapsed: 1.866 sec - in org.apache.activemq.usecases.MessageGroupLateArrivalsTest
Running org.apache.activemq.usecases.NewConsumerCreatesDestinationTest
Tests run: 1, Failures: 0, Errors: 0, Skipped: 0, Time elapsed: 0.932 sec - in org.apache.activemq.usecases.NewConsumerCreatesDestinationTest
Running org.apache.activemq.usecases.ObjectMessageNotSerializableTest
Tests run: 2, Failures: 0, Errors: 0, Skipped: 0, Time elapsed: 0.938 sec - in org.apache.activemq.usecases.ObjectMessageNotSerializableTest
Running org.apache.activemq.usecases.PublishOnDurableTopicConsumedMessageTest
Tests run: 1, Failures: 0, Errors: 0, Skipped: 0, Time elapsed: 2.092 sec - in org.apache.activemq.usecases.PublishOnDurableTopicConsumedMessageTest
Running org.apache.activemq.usecases.PublishOnQueueConsumedMessageTest
Tests run: 1, Failures: 0, Errors: 0, Skipped: 0, Time elapsed: 2.177 sec - in org.apache.activemq.usecases.PublishOnQueueConsumedMessageTest
Running org.apache.activemq.usecases.PublishOnTemporaryQueueConsumedMessageTest
Tests run: 1, Failures: 0, Errors: 0, Skipped: 0, Time elapsed: 2.082 sec - in org.apache.activemq.usecases.PublishOnTemporaryQueueConsumedMessageTest
Running org.apache.activemq.usecases.QueueBrowsingLevelDBTest
Running org.apache.activemq.usecases.QueueBrowsingLimitTest
Tests run: 1, Failures: 0, Errors: 0, Skipped: 0, Time elapsed: 57.059 sec - in org.apache.activemq.usecases.QueueBrowsingLimitTest
Running org.apache.activemq.usecases.QueueBrowsingTest
Running org.apache.activemq.usecases.QueueRepeaterTest
Tests run: 1, Failures: 0, Errors: 0, Skipped: 0, Time elapsed: 0.979 sec - in org.apache.activemq.usecases.QueueRepeaterTest
Running org.apache.activemq.usecases.RequestReplyTempDestRemovalAdvisoryRaceTest
Tests run: 8, Failures: 0, Errors: 0, Skipped: 0, Time elapsed: 118.108 sec - in org.apache.activemq.usecases.RequestReplyTempDestRemovalAdvisoryRaceTest
Running org.apache.activemq.usecases.RequestReplyToTopicViaThreeNetworkHopsTest
Tests run: 1, Failures: 0, Errors: 0, Skipped: 0, Time elapsed: 11.599 sec - in org.apache.activemq.usecases.RequestReplyToTopicViaThreeNetworkHopsTest
Running org.apache.activemq.usecases.SingleBrokerVirtualDestinationsWithWildcardLevelDBTest
Tests run: 4, Failures: 0, Errors: 0, Skipped: 0, Time elapsed: 46.427 sec - in org.apache.activemq.usecases.SingleBrokerVirtualDestinationsWithWildcardLevelDBTest
Running org.apache.activemq.usecases.SubscribeClosePublishThenConsumeTest
Tests run: 1, Failures: 0, Errors: 0, Skipped: 0, Time elapsed: 1.894 sec - in org.apache.activemq.usecases.SubscribeClosePublishThenConsumeTest
Running org.apache.activemq.usecases.ThreeBrokerTempDestDemandSubscriptionCleanupTest
Tests run: 2, Failures: 0, Errors: 0, Skipped: 0, Time elapsed: 17.693 sec - in org.apache.activemq.usecases.ThreeBrokerTempDestDemandSubscriptionCleanupTest
Running org.apache.activemq.usecases.ThreeBrokerVirtualTopicNetworkLevelDBTest
Tests run: 1, Failures: 0, Errors: 0, Skipped: 0, Time elapsed: 27.279 sec - in org.apache.activemq.usecases.ThreeBrokerVirtualTopicNetworkLevelDBTest
Running org.apache.activemq.usecases.TopicDurableConnectStatsTest
Tests run: 1, Failures: 0, Errors: 0, Skipped: 0, Time elapsed: 7.441 sec - in org.apache.activemq.usecases.TopicDurableConnectStatsTest
Running org.apache.activemq.usecases.TopicSubscriptionZeroPrefetchTest
Running org.apache.activemq.usecases.TransactionRollbackOrderTest
Tests run: 1, Failures: 0, Errors: 0, Skipped: 0, Time elapsed: 2.047 sec - in org.apache.activemq.usecases.TransactionRollbackOrderTest
Running org.apache.activemq.usecases.TransactionTest
Tests run: 1, Failures: 0, Errors: 0, Skipped: 0, Time elapsed: 1.023 sec - in org.apache.activemq.usecases.TransactionTest
Running org.apache.activemq.usecases.TwoBrokerVirtualTopicForwardingTest
Tests run: 3, Failures: 0, Errors: 0, Skipped: 0, Time elapsed: 23.968 sec - in org.apache.activemq.usecases.TwoBrokerVirtualTopicForwardingTest
Running org.apache.activemq.usecases.TwoSecureBrokerRequestReplyTest
Tests run: 1, Failures: 0, Errors: 0, Skipped: 0, Time elapsed: 67.874 sec - in org.apache.activemq.usecases.TwoSecureBrokerRequestReplyTest
Running org.apache.activemq.usecases.VerifyNetworkConsumersDisconnectTest
Tests run: 2, Failures: 0, Errors: 0, Skipped: 0, Time elapsed: 35.606 sec - in org.apache.activemq.usecases.VerifyNetworkConsumersDisconnectTest
Running org.apache.activemq.usecases.VirtualTopicNetworkClusterReactivationTest
Tests run: 1, Failures: 0, Errors: 0, Skipped: 0, Time elapsed: 10.309 sec - in org.apache.activemq.usecases.VirtualTopicNetworkClusterReactivationTest
Running org.apache.activemq.util.LinkedNodeTest
Tests run: 3, Failures: 0, Errors: 0, Skipped: 0, Time elapsed: 0.07 sec - in org.apache.activemq.util.LinkedNodeTest
Running org.apache.activemq.util.ReflectionSupportTest
Tests run: 3, Failures: 0, Errors: 0, Skipped: 0, Time elapsed: 0.193 sec - in org.apache.activemq.util.ReflectionSupportTest
Running org.apache.activemq.xbean.JDBCPersistenceAdapterXBeanConfigTest
Tests run: 1, Failures: 0, Errors: 0, Skipped: 0, Time elapsed: 10.423 sec - in org.apache.activemq.xbean.JDBCPersistenceAdapterXBeanConfigTest
Running org.apache.activemq.xbean.ManagementContextXBeanConfigTest
Killed
Running org.apache.activemq.xbean.MultipleTestsWithEmbeddedBrokerAndPersistenceTest
Tests run: 2, Failures: 0, Errors: 0, Skipped: 0, Time elapsed: 5.496 sec - in org.apache.activemq.xbean.MultipleTestsWithEmbeddedBrokerAndPersistenceTest
Running org.apache.activemq.xbean.MultipleTestsWithEmbeddedBrokerTest
Tests run: 2, Failures: 0, Errors: 0, Skipped: 0, Time elapsed: 0.863 sec - in org.apache.activemq.xbean.MultipleTestsWithEmbeddedBrokerTest
Running org.apache.activemq.xbean.XBeanConfigTest
Tests run: 1, Failures: 0, Errors: 0, Skipped: 0, Time elapsed: 1.425 sec - in org.apache.activemq.xbean.XBeanConfigTest
Running org.apache.activemq.xbean.XBeanStartFalseTest
Tests run: 1, Failures: 0, Errors: 0, Skipped: 0, Time elapsed: 1.21 sec - in org.apache.activemq.xbean.XBeanStartFalseTest

Results :

Failed tests: 
  VirtualTopicsAndDurableSubsTest>CombinationTestSupport.runBare:113->CombinationTestSupport.runBare:107->MBeanTest.testDestinationOptionsAreVisible:985->MBeanTest.assertRegisteredObjectName:740
Could not find MBean!: org.apache.activemq:type=Broker,brokerName=localhost,destinationType=Queue,destinationName=QueueWithOptions
  AMQ2149LevelDBTest>AMQ2149Test.testQueueTransactionalOrderWithRestart:412->AMQ2149Test.doTestTransactionalOrderWithRestart:435->AMQ2149Test.verifyOrderedMessageReceipt:549
No timeout waiting for senders/receivers to complete
  AMQ2149LevelDBTest>AMQ2149Test.testOrderWithRestart:382->AMQ2149Test.verifyOrderedMessageReceipt:505->AMQ2149Test.verifyOrderedMessageReceipt:549
No timeout waiting for senders/receivers to complete
  AMQ4952Test.testConsumerBrokerRestart:226 number of messages received expected:<2>
but was:<1>
  TransactedStoreUsageSuspendResumeTest.testTransactedStoreUsageSuspendResume:143 Got all
messages: java.util.concurrent.CountDownLatch@3967e60c[Count = 10000]
  LevelDBStorePerDestinationTest>StorePerDestinationTest.testSlowFastDestinationsStoreUsage:243
consumers executor finished on time
  JDBCIOExceptionHandlerTest.testRecoverWithJMX:103->recoverFromDisconnectDB:198->checkTransportConnectorStarted:224
Transport connector should have been started

Tests in error: 
  SimpleAnonymousPluginTest>CombinationTestSupport.runBare:107->testAnonymousSendSucceeds:80->SecurityTestSupport.doSend:125
? InvalidDestination
  SimpleAnonymousPluginTest>CombinationTestSupport.runBare:107->testAnonymousReceiveFails:72->SecurityTestSupport.doReceive:159
? InvalidDestination
  SimpleAnonymousPluginTest>CombinationTestSupport.runBare:107->testAnonymousSendFails:76->SecurityTestSupport.doSend:125
? InvalidDestination
  SimpleAnonymousPluginTest>CombinationTestSupport.runBare:107->testAnonymousReceiveSucceeds:68->SecurityTestSupport.doReceive:159
? InvalidDestination
  TcpTransportBindTest>CombinationTestSupport.runBare:113->CombinationTestSupport.runBare:107->setUp:39->EmbeddedBrokerTestSupport.setUp:47->EmbeddedBrokerTestSupport.startBroker:124
? InstanceAlreadyExists
  MemoryLimitTest.testCursorBatch:112->Object.wait:-2 ?  test timed out after 12...
  MemoryLimitTest.testCursorBatch:112->Object.wait:-2 ?  test timed out after 12...
  MemoryLimitTest.testCursorBatch:112->Object.wait:-2 ?  test timed out after 12...

Tests run: 2556, Failures: 5, Errors: 8, Skipped: 15

[JENKINS] Recording test results

Mime
View raw message