activemq-commits mailing list archives

Site index · List index
Message view « Date » · « Thread »
Top « Date » · « Thread »
From Apache Jenkins Server <jenk...@builds.apache.org>
Subject Build failed in Jenkins: ActiveMQ-Java8 » ActiveMQ :: Unit Tests #13
Date Sat, 07 Jun 2014 11:21:15 GMT
See <https://builds.apache.org/job/ActiveMQ-Java8/org.apache.activemq$activemq-unit-tests/13/changes>

Changes:

[tabish121] https://issues.apache.org/jira/browse/AMQ-5211

------------------------------------------
[...truncated 616 lines...]
Running org.apache.activemq.network.ForwardingBridgeTest
Tests run: 8, Failures: 0, Errors: 0, Skipped: 0, Time elapsed: 16.882 sec - in org.apache.activemq.network.ForwardingBridgeTest
Running org.apache.activemq.network.NetworkDestinationFilterTest
Tests run: 1, Failures: 0, Errors: 0, Skipped: 0, Time elapsed: 0.134 sec - in org.apache.activemq.network.NetworkDestinationFilterTest
Running org.apache.activemq.network.NetworkLoopBackTest
Tests run: 1, Failures: 0, Errors: 0, Skipped: 0, Time elapsed: 0.87 sec - in org.apache.activemq.network.NetworkLoopBackTest
Running org.apache.activemq.network.NetworkRouteTest
Tests run: 3, Failures: 0, Errors: 0, Skipped: 0, Time elapsed: 0.705 sec - in org.apache.activemq.network.NetworkRouteTest
Running org.apache.activemq.openwire.BooleanStreamTest
Tests run: 4, Failures: 0, Errors: 0, Skipped: 0, Time elapsed: 2.025 sec - in org.apache.activemq.openwire.BooleanStreamTest
Running org.apache.activemq.openwire.ItStillMarshallsTheSameTest
Tests run: 1, Failures: 0, Errors: 0, Skipped: 0, Time elapsed: 0.133 sec - in org.apache.activemq.openwire.ItStillMarshallsTheSameTest
Running org.apache.activemq.openwire.NumberRangesWhileMarshallingTest
Tests run: 3, Failures: 0, Errors: 0, Skipped: 0, Time elapsed: 0.233 sec - in org.apache.activemq.openwire.NumberRangesWhileMarshallingTest
Running org.apache.activemq.pool.JmsSendReceiveTwoConnectionsWithSenderUsingPoolTest
Tests run: 1, Failures: 0, Errors: 0, Skipped: 0, Time elapsed: 2.026 sec - in org.apache.activemq.pool.JmsSendReceiveTwoConnectionsWithSenderUsingPoolTest
Running org.apache.activemq.proxy.AMQ4889Test
Tests run: 1, Failures: 0, Errors: 0, Skipped: 0, Time elapsed: 1.825 sec - in org.apache.activemq.proxy.AMQ4889Test
Running org.apache.activemq.security.AuthorizationMapTest
Tests run: 4, Failures: 0, Errors: 0, Skipped: 0, Time elapsed: 0.061 sec - in org.apache.activemq.security.AuthorizationMapTest
Running org.apache.activemq.security.CachedLDAPAuthorizationModuleLegacyOpenLDAPTest
Tests run: 1, Failures: 0, Errors: 0, Skipped: 1, Time elapsed: 0.027 sec - in org.apache.activemq.security.CachedLDAPAuthorizationModuleLegacyOpenLDAPTest
Running org.apache.activemq.security.CachedLDAPAuthorizationModuleLegacyTest
Tests run: 12, Failures: 0, Errors: 0, Skipped: 0, Time elapsed: 31.041 sec - in org.apache.activemq.security.CachedLDAPAuthorizationModuleLegacyTest
Running org.apache.activemq.security.CachedLDAPAuthorizationModuleOpenLDAPTest
Tests run: 1, Failures: 0, Errors: 0, Skipped: 1, Time elapsed: 0.027 sec - in org.apache.activemq.security.CachedLDAPAuthorizationModuleOpenLDAPTest
Running org.apache.activemq.security.CachedLDAPAuthorizationModuleTest
Tests run: 12, Failures: 0, Errors: 0, Skipped: 0, Time elapsed: 29.517 sec - in org.apache.activemq.security.CachedLDAPAuthorizationModuleTest
Running org.apache.activemq.security.CachedLDAPSecurityLegacyTest
Tests run: 4, Failures: 0, Errors: 0, Skipped: 0, Time elapsed: 5.706 sec - in org.apache.activemq.security.CachedLDAPSecurityLegacyTest
Running org.apache.activemq.security.CachedLDAPSecurityTest
Tests run: 4, Failures: 0, Errors: 0, Skipped: 0, Time elapsed: 5.527 sec - in org.apache.activemq.security.CachedLDAPSecurityTest
Running org.apache.activemq.security.JaasCertificateAuthenticationBrokerTest
Tests run: 3, Failures: 0, Errors: 0, Skipped: 0, Time elapsed: 0.1 sec - in org.apache.activemq.security.JaasCertificateAuthenticationBrokerTest
Running org.apache.activemq.security.JaasDualAuthenticationBrokerTest
Tests run: 2, Failures: 0, Errors: 0, Skipped: 0, Time elapsed: 0.17 sec - in org.apache.activemq.security.JaasDualAuthenticationBrokerTest
Running org.apache.activemq.security.LDAPAuthorizationMapTest
Tests run: 7, Failures: 0, Errors: 0, Skipped: 0, Time elapsed: 3.556 sec - in org.apache.activemq.security.LDAPAuthorizationMapTest
Running org.apache.activemq.security.SimpleAnonymousPluginTest
Tests run: 37, Failures: 0, Errors: 4, Skipped: 0, Time elapsed: 24.361 sec <<< FAILURE!
- in org.apache.activemq.security.SimpleAnonymousPluginTest
testAnonymousSendSucceeds {}(org.apache.activemq.security.SimpleAnonymousPluginTest)  Time
elapsed: 0.316 sec  <<< ERROR!
javax.jms.InvalidDestinationException: Don't understand null destinations
	at org.apache.activemq.ActiveMQMessageConsumer.<init>(ActiveMQMessageConsumer.java:182)
	at org.apache.activemq.ActiveMQSession.createConsumer(ActiveMQSession.java:1240)
	at org.apache.activemq.ActiveMQSession.createConsumer(ActiveMQSession.java:1183)
	at org.apache.activemq.ActiveMQSession.createConsumer(ActiveMQSession.java:1095)
	at org.apache.activemq.ActiveMQSession.createConsumer(ActiveMQSession.java:1067)
	at org.apache.activemq.security.SecurityTestSupport.doSend(SecurityTestSupport.java:125)
	at org.apache.activemq.security.SimpleAnonymousPluginTest.testAnonymousSendSucceeds(SimpleAnonymousPluginTest.java:80)

testAnonymousReceiveSucceeds {}(org.apache.activemq.security.SimpleAnonymousPluginTest)  Time
elapsed: 0.225 sec  <<< ERROR!
javax.jms.InvalidDestinationException: Don't understand null destinations
	at org.apache.activemq.ActiveMQMessageConsumer.<init>(ActiveMQMessageConsumer.java:182)
	at org.apache.activemq.ActiveMQSession.createConsumer(ActiveMQSession.java:1240)
	at org.apache.activemq.ActiveMQSession.createConsumer(ActiveMQSession.java:1183)
	at org.apache.activemq.ActiveMQSession.createConsumer(ActiveMQSession.java:1095)
	at org.apache.activemq.ActiveMQSession.createConsumer(ActiveMQSession.java:1067)
	at org.apache.activemq.security.SecurityTestSupport.doReceive(SecurityTestSupport.java:159)
	at org.apache.activemq.security.SimpleAnonymousPluginTest.testAnonymousReceiveSucceeds(SimpleAnonymousPluginTest.java:68)

testAnonymousReceiveFails {}(org.apache.activemq.security.SimpleAnonymousPluginTest)  Time
elapsed: 0.177 sec  <<< ERROR!
javax.jms.InvalidDestinationException: Don't understand null destinations
	at org.apache.activemq.ActiveMQMessageConsumer.<init>(ActiveMQMessageConsumer.java:182)
	at org.apache.activemq.ActiveMQSession.createConsumer(ActiveMQSession.java:1240)
	at org.apache.activemq.ActiveMQSession.createConsumer(ActiveMQSession.java:1183)
	at org.apache.activemq.ActiveMQSession.createConsumer(ActiveMQSession.java:1095)
	at org.apache.activemq.ActiveMQSession.createConsumer(ActiveMQSession.java:1067)
	at org.apache.activemq.security.SecurityTestSupport.doReceive(SecurityTestSupport.java:159)
	at org.apache.activemq.security.SimpleAnonymousPluginTest.testAnonymousReceiveFails(SimpleAnonymousPluginTest.java:72)

testAnonymousSendFails {}(org.apache.activemq.security.SimpleAnonymousPluginTest)  Time elapsed:
0.176 sec  <<< ERROR!
javax.jms.InvalidDestinationException: Don't understand null destinations
	at org.apache.activemq.ActiveMQMessageConsumer.<init>(ActiveMQMessageConsumer.java:182)
	at org.apache.activemq.ActiveMQSession.createConsumer(ActiveMQSession.java:1240)
	at org.apache.activemq.ActiveMQSession.createConsumer(ActiveMQSession.java:1183)
	at org.apache.activemq.ActiveMQSession.createConsumer(ActiveMQSession.java:1095)
	at org.apache.activemq.ActiveMQSession.createConsumer(ActiveMQSession.java:1067)
	at org.apache.activemq.security.SecurityTestSupport.doSend(SecurityTestSupport.java:125)
	at org.apache.activemq.security.SimpleAnonymousPluginTest.testAnonymousSendFails(SimpleAnonymousPluginTest.java:76)

Running org.apache.activemq.security.SimpleAuthenticationPluginSeparatorTest
Tests run: 29, Failures: 0, Errors: 0, Skipped: 0, Time elapsed: 19.702 sec - in org.apache.activemq.security.SimpleAuthenticationPluginSeparatorTest
Running org.apache.activemq.security.SimpleAuthenticationPluginTest
Tests run: 33, Failures: 0, Errors: 0, Skipped: 0, Time elapsed: 24.434 sec - in org.apache.activemq.security.SimpleAuthenticationPluginTest
Running org.apache.activemq.security.SimpleAuthorizationMapTest
Tests run: 4, Failures: 0, Errors: 0, Skipped: 0, Time elapsed: 0.153 sec - in org.apache.activemq.security.SimpleAuthorizationMapTest
Running org.apache.activemq.security.SimpleSecurityBrokerSystemTest
Tests run: 60, Failures: 0, Errors: 0, Skipped: 0, Time elapsed: 24.853 sec - in org.apache.activemq.security.SimpleSecurityBrokerSystemTest
Running org.apache.activemq.security.XBeanSecurityTest
Tests run: 29, Failures: 0, Errors: 0, Skipped: 0, Time elapsed: 17.404 sec - in org.apache.activemq.security.XBeanSecurityTest
Running org.apache.activemq.security.XBeanSecurityWithGuestTest
Tests run: 7, Failures: 0, Errors: 0, Skipped: 0, Time elapsed: 3.308 sec - in org.apache.activemq.security.XBeanSecurityWithGuestTest
Running org.apache.activemq.selector.SelectorParserTest
Tests run: 3, Failures: 0, Errors: 0, Skipped: 0, Time elapsed: 0.25 sec - in org.apache.activemq.selector.SelectorParserTest
Running org.apache.activemq.selector.SelectorTest
Tests run: 21, Failures: 0, Errors: 0, Skipped: 0, Time elapsed: 0.415 sec - in org.apache.activemq.selector.SelectorTest
Running org.apache.activemq.spring.ActiveMQConnectionFactoryFactoryBeanTest
Tests run: 6, Failures: 0, Errors: 0, Skipped: 0, Time elapsed: 0.176 sec - in org.apache.activemq.spring.ActiveMQConnectionFactoryFactoryBeanTest
Running org.apache.activemq.spring.SpringTest
Tests run: 7, Failures: 0, Errors: 0, Skipped: 0, Time elapsed: 13.575 sec - in org.apache.activemq.spring.SpringTest
Running org.apache.activemq.store.LevelDBStorePerDestinationTest
Tests run: 6, Failures: 0, Errors: 0, Skipped: 0, Time elapsed: 154.84 sec - in org.apache.activemq.store.LevelDBStorePerDestinationTest
Running org.apache.activemq.store.jdbc.DatabaseLockerConfigTest
Tests run: 4, Failures: 0, Errors: 0, Skipped: 0, Time elapsed: 0.15 sec - in org.apache.activemq.store.jdbc.DatabaseLockerConfigTest
Running org.apache.activemq.store.jdbc.JDBCIOExceptionHandlerMockeryTest
Tests run: 1, Failures: 0, Errors: 0, Skipped: 0, Time elapsed: 1.652 sec - in org.apache.activemq.store.jdbc.JDBCIOExceptionHandlerMockeryTest
Running org.apache.activemq.store.jdbc.JDBCIOExceptionHandlerTest
Tests run: 4, Failures: 0, Errors: 3, Skipped: 0, Time elapsed: 16.374 sec <<< FAILURE!
- in org.apache.activemq.store.jdbc.JDBCIOExceptionHandlerTest
testRecoverWithJMX(org.apache.activemq.store.jdbc.JDBCIOExceptionHandlerTest)  Time elapsed:
5.289 sec  <<< ERROR!
java.sql.SQLException: Invalid value for property 'databaseName'='derbydb_15'.
	at org.apache.derby.impl.jdbc.SQLExceptionFactory.getSQLException(Unknown Source)
	at org.apache.derby.impl.jdbc.SQLExceptionFactory40.wrapArgsForTransportAcrossDRDA(Unknown
Source)
	at org.apache.derby.impl.jdbc.SQLExceptionFactory40.getSQLException(Unknown Source)
	at org.apache.derby.impl.jdbc.Util.newEmbedSQLException(Unknown Source)
	at org.apache.derby.impl.jdbc.Util.newEmbedSQLException(Unknown Source)
	at org.apache.derby.impl.jdbc.Util.generateCsSQLException(Unknown Source)
	at org.apache.derby.jdbc.EmbeddedBaseDataSource.getConnection(Unknown Source)
	at org.apache.derby.jdbc.EmbeddedBaseDataSource.getConnection(Unknown Source)
	at org.apache.activemq.store.jdbc.JDBCIOExceptionHandlerTest$ReconnectingEmbeddedDataSource.restartDB(JDBCIOExceptionHandlerTest.java:292)
	at org.apache.activemq.store.jdbc.JDBCIOExceptionHandlerTest.recoverFromDisconnectDB(JDBCIOExceptionHandlerTest.java:190)
	at org.apache.activemq.store.jdbc.JDBCIOExceptionHandlerTest.testRecoverWithJMX(JDBCIOExceptionHandlerTest.java:103)

testRecoverWithOutJMX(org.apache.activemq.store.jdbc.JDBCIOExceptionHandlerTest)  Time elapsed:
0.013 sec  <<< ERROR!
org.apache.activemq.broker.SuppressReplyException: Stop/RestartTransportsInitiated
	at org.apache.derby.impl.jdbc.SQLExceptionFactory.getSQLException(Unknown Source)
	at org.apache.derby.impl.jdbc.SQLExceptionFactory40.wrapArgsForTransportAcrossDRDA(Unknown
Source)
	at org.apache.derby.impl.jdbc.SQLExceptionFactory40.getSQLException(Unknown Source)
	at org.apache.derby.impl.jdbc.Util.newEmbedSQLException(Unknown Source)
	at org.apache.derby.impl.jdbc.Util.newEmbedSQLException(Unknown Source)
	at org.apache.derby.impl.jdbc.Util.generateCsSQLException(Unknown Source)
	at org.apache.derby.impl.jdbc.EmbedConnection.newSQLException(Unknown Source)
	at org.apache.derby.impl.jdbc.EmbedConnection.handleDBNotFound(Unknown Source)
	at org.apache.derby.impl.jdbc.EmbedConnection.<init>(Unknown Source)
	at org.apache.derby.impl.jdbc.EmbedConnection40.<init>(Unknown Source)
	at org.apache.derby.jdbc.Driver40.getNewEmbedConnection(Unknown Source)
	at org.apache.derby.jdbc.InternalDriver.connect(Unknown Source)
	at org.apache.derby.jdbc.EmbeddedBaseDataSource.getConnection(Unknown Source)
	at org.apache.derby.jdbc.EmbeddedBaseDataSource.getConnection(Unknown Source)
	at org.apache.activemq.store.jdbc.JDBCIOExceptionHandlerTest$ReconnectingEmbeddedDataSource.getConnection(JDBCIOExceptionHandlerTest.java:275)
	at org.apache.activemq.store.jdbc.TransactionContext.getConnection(TransactionContext.java:56)
	at org.apache.activemq.store.jdbc.JDBCPersistenceAdapter.loadAdapter(JDBCPersistenceAdapter.java:451)
	at org.apache.activemq.store.jdbc.JDBCPersistenceAdapter.createAdapter(JDBCPersistenceAdapter.java:434)
	at org.apache.activemq.store.jdbc.JDBCPersistenceAdapter.getAdapter(JDBCPersistenceAdapter.java:383)
	at org.apache.activemq.store.jdbc.JDBCPersistenceAdapter.init(JDBCPersistenceAdapter.java:295)
	at org.apache.activemq.broker.LockableServiceSupport.preStart(LockableServiceSupport.java:89)
	at org.apache.activemq.util.ServiceSupport.start(ServiceSupport.java:54)
	at org.apache.activemq.broker.BrokerService.doStartPersistenceAdapter(BrokerService.java:641)
	at org.apache.activemq.broker.BrokerService.startPersistenceAdapter(BrokerService.java:630)
	at org.apache.activemq.broker.BrokerService.start(BrokerService.java:595)
	at org.apache.activemq.store.jdbc.JDBCIOExceptionHandlerTest.recoverFromDisconnectDB(JDBCIOExceptionHandlerTest.java:177)
	at org.apache.activemq.store.jdbc.JDBCIOExceptionHandlerTest.testRecoverWithOutJMX(JDBCIOExceptionHandlerTest.java:96)

testSlaveStoppedDefault(org.apache.activemq.store.jdbc.JDBCIOExceptionHandlerTest)  Time elapsed:
0.299 sec  <<< ERROR!
org.apache.activemq.broker.SuppressReplyException: ShutdownBrokerInitiated
	at org.apache.derby.iapi.error.StandardException.newException(Unknown Source)
	at org.apache.derby.impl.store.raw.data.BaseDataFileFactory.privGetJBMSLockOnDB(Unknown Source)
	at org.apache.derby.impl.store.raw.data.BaseDataFileFactory.run(Unknown Source)
	at java.security.AccessController.doPrivileged(Native Method)
	at org.apache.derby.impl.store.raw.data.BaseDataFileFactory.getJBMSLockOnDB(Unknown Source)
	at org.apache.derby.impl.store.raw.data.BaseDataFileFactory.boot(Unknown Source)
	at org.apache.derby.impl.services.monitor.BaseMonitor.boot(Unknown Source)
	at org.apache.derby.impl.services.monitor.TopService.bootModule(Unknown Source)
	at org.apache.derby.impl.services.monitor.BaseMonitor.startModule(Unknown Source)
	at org.apache.derby.iapi.services.monitor.Monitor.bootServiceModule(Unknown Source)
	at org.apache.derby.impl.store.raw.RawStore.boot(Unknown Source)
	at org.apache.derby.impl.services.monitor.BaseMonitor.boot(Unknown Source)
	at org.apache.derby.impl.services.monitor.TopService.bootModule(Unknown Source)
	at org.apache.derby.impl.services.monitor.BaseMonitor.startModule(Unknown Source)
	at org.apache.derby.iapi.services.monitor.Monitor.bootServiceModule(Unknown Source)
	at org.apache.derby.impl.store.access.RAMAccessManager.boot(Unknown Source)
	at org.apache.derby.impl.services.monitor.BaseMonitor.boot(Unknown Source)
	at org.apache.derby.impl.services.monitor.TopService.bootModule(Unknown Source)
	at org.apache.derby.impl.services.monitor.BaseMonitor.startModule(Unknown Source)
	at org.apache.derby.iapi.services.monitor.Monitor.bootServiceModule(Unknown Source)
	at org.apache.derby.impl.db.BasicDatabase.bootStore(Unknown Source)
	at org.apache.derby.impl.db.BasicDatabase.boot(Unknown Source)
	at org.apache.derby.impl.services.monitor.BaseMonitor.boot(Unknown Source)
	at org.apache.derby.impl.services.monitor.TopService.bootModule(Unknown Source)
	at org.apache.derby.impl.services.monitor.BaseMonitor.bootService(Unknown Source)
	at org.apache.derby.impl.services.monitor.BaseMonitor.startProviderService(Unknown Source)
	at org.apache.derby.impl.services.monitor.BaseMonitor.findProviderAndStartService(Unknown
Source)
	at org.apache.derby.impl.services.monitor.BaseMonitor.startPersistentService(Unknown Source)
	at org.apache.derby.iapi.services.monitor.Monitor.startPersistentService(Unknown Source)
	at org.apache.derby.impl.jdbc.EmbedConnection.bootDatabase(Unknown Source)
	at org.apache.derby.impl.jdbc.EmbedConnection.<init>(Unknown Source)
	at org.apache.derby.impl.jdbc.EmbedConnection40.<init>(Unknown Source)
	at org.apache.derby.jdbc.Driver40.getNewEmbedConnection(Unknown Source)
	at org.apache.derby.jdbc.InternalDriver.connect(Unknown Source)
	at org.apache.derby.jdbc.EmbeddedBaseDataSource.getConnection(Unknown Source)
	at org.apache.derby.jdbc.EmbeddedBaseDataSource.getConnection(Unknown Source)
	at org.apache.activemq.store.jdbc.JDBCIOExceptionHandlerTest$ReconnectingEmbeddedDataSource.getConnection(JDBCIOExceptionHandlerTest.java:275)
	at org.apache.activemq.store.jdbc.TransactionContext.getConnection(TransactionContext.java:56)
	at org.apache.activemq.store.jdbc.JDBCPersistenceAdapter.loadAdapter(JDBCPersistenceAdapter.java:451)
	at org.apache.activemq.store.jdbc.JDBCPersistenceAdapter.createAdapter(JDBCPersistenceAdapter.java:434)
	at org.apache.activemq.store.jdbc.JDBCPersistenceAdapter.getAdapter(JDBCPersistenceAdapter.java:383)
	at org.apache.activemq.store.jdbc.JDBCPersistenceAdapter.init(JDBCPersistenceAdapter.java:295)
	at org.apache.activemq.broker.LockableServiceSupport.preStart(LockableServiceSupport.java:89)
	at org.apache.activemq.util.ServiceSupport.start(ServiceSupport.java:54)
	at org.apache.activemq.broker.BrokerService.doStartPersistenceAdapter(BrokerService.java:641)
	at org.apache.activemq.broker.BrokerService.startPersistenceAdapter(BrokerService.java:630)
	at org.apache.activemq.broker.BrokerService.start(BrokerService.java:595)
	at org.apache.activemq.store.jdbc.JDBCIOExceptionHandlerTest.testSlaveStopped(JDBCIOExceptionHandlerTest.java:116)
	at org.apache.activemq.store.jdbc.JDBCIOExceptionHandlerTest.testSlaveStoppedDefault(JDBCIOExceptionHandlerTest.java:111)

Running org.apache.activemq.store.jdbc.JDBCLockTablePrefixTest
Tests run: 1, Failures: 0, Errors: 0, Skipped: 0, Time elapsed: 14.413 sec - in org.apache.activemq.store.jdbc.JDBCLockTablePrefixTest
Running org.apache.activemq.store.jdbc.JDBCTablePrefixAssignedTest
Tests run: 1, Failures: 0, Errors: 0, Skipped: 0, Time elapsed: 8.056 sec - in org.apache.activemq.store.jdbc.JDBCTablePrefixAssignedTest
Running org.apache.activemq.store.jdbc.LeaseDatabaseLockerTest
Tests run: 5, Failures: 0, Errors: 0, Skipped: 0, Time elapsed: 60.181 sec - in org.apache.activemq.store.jdbc.LeaseDatabaseLockerTest
Running org.apache.activemq.store.kahadb.CustomLockerTest
Tests run: 1, Failures: 0, Errors: 0, Skipped: 0, Time elapsed: 2.067 sec - in org.apache.activemq.store.kahadb.CustomLockerTest
Running org.apache.activemq.store.kahadb.KahaDBPersistenceAdapterTest
Tests run: 2, Failures: 0, Errors: 0, Skipped: 0, Time elapsed: 2.778 sec - in org.apache.activemq.store.kahadb.KahaDBPersistenceAdapterTest
Running org.apache.activemq.store.kahadb.KahaDBStoreBrokerTest
Tests run: 129, Failures: 0, Errors: 0, Skipped: 0, Time elapsed: 120.198 sec - in org.apache.activemq.store.kahadb.KahaDBStoreBrokerTest
Running org.apache.activemq.store.kahadb.KahaDBStoreOrderTest
Tests run: 2, Failures: 0, Errors: 0, Skipped: 0, Time elapsed: 4.92 sec - in org.apache.activemq.store.kahadb.KahaDBStoreOrderTest
Running org.apache.activemq.store.kahadb.NoSpaceIOTest
Tests run: 1, Failures: 0, Errors: 0, Skipped: 1, Time elapsed: 0.058 sec - in org.apache.activemq.store.kahadb.NoSpaceIOTest
Running org.apache.activemq.store.kahadb.PBMesssagesTest
Tests run: 1, Failures: 0, Errors: 0, Skipped: 0, Time elapsed: 0.058 sec - in org.apache.activemq.store.kahadb.PBMesssagesTest
Running org.apache.activemq.store.kahadb.TempKahaDBStoreBrokerTest
Tests run: 129, Failures: 0, Errors: 0, Skipped: 0, Time elapsed: 141.375 sec - in org.apache.activemq.store.kahadb.TempKahaDBStoreBrokerTest
Running org.apache.activemq.store.kahadb.plist.KahaDBFilePendingMessageCursorTest
Tests run: 3, Failures: 0, Errors: 0, Skipped: 0, Time elapsed: 3.586 sec - in org.apache.activemq.store.kahadb.plist.KahaDBFilePendingMessageCursorTest
Running org.apache.activemq.store.leveldb.LevelDBNegativeQueueTest

Results :

Failed tests: 
  AMQ4351Test>CombinationTestSupport.runBare:107->testAMQ4351:248 null
  BrokerRedeliveryTest>CombinationTestSupport.runBare:113->CombinationTestSupport.runBare:107->testScheduledRedelivery:47->doTestScheduledRedelivery:82
got message via broker redelivery after delay
  AMQ2149LevelDBTest>AMQ2149Test.testQueueTransactionalOrderWithRestart:412->AMQ2149Test.doTestTransactionalOrderWithRestart:435->AMQ2149Test.verifyOrderedMessageReceipt:549
No timeout waiting for senders/receivers to complete
  AMQ2149LevelDBTest>AMQ2149Test.testTopicTransactionalOrderWithRestart:417->AMQ2149Test.doTestTransactionalOrderWithRestart:435->AMQ2149Test.verifyOrderedMessageReceipt:560
No exceptions
  TransactedStoreUsageSuspendResumeTest.testTransactedStoreUsageSuspendResume:143 Got all
messages: java.util.concurrent.CountDownLatch@60d8c9b7[Count = 2470]

Tests in error: 
  SimpleAnonymousPluginTest>CombinationTestSupport.runBare:107->testAnonymousSendSucceeds:80->SecurityTestSupport.doSend:125
? InvalidDestination
  SimpleAnonymousPluginTest>CombinationTestSupport.runBare:107->testAnonymousReceiveSucceeds:68->SecurityTestSupport.doReceive:159
? InvalidDestination
  SimpleAnonymousPluginTest>CombinationTestSupport.runBare:107->testAnonymousReceiveFails:72->SecurityTestSupport.doReceive:159
? InvalidDestination
  SimpleAnonymousPluginTest>CombinationTestSupport.runBare:107->testAnonymousSendFails:76->SecurityTestSupport.doSend:125
? InvalidDestination
  JDBCIOExceptionHandlerTest.testRecoverWithJMX:103->recoverFromDisconnectDB:190 ? SQL
  JDBCIOExceptionHandlerTest.testRecoverWithOutJMX:96->recoverFromDisconnectDB:177 ? SuppressReply
  JDBCIOExceptionHandlerTest.testSlaveStoppedDefault:111->testSlaveStopped:116 ? SuppressReply

Tests run: 2298, Failures: 5, Errors: 7, Skipped: 9

[JENKINS] Recording test results

Mime
View raw message