activemq-commits mailing list archives

Site index · List index
Message view « Date » · « Thread »
Top « Date » · « Thread »
From Apache Jenkins Server <jenk...@builds.apache.org>
Subject Build failed in Jenkins: ActiveMQ-Java7 » ActiveMQ :: Unit Tests #329
Date Sun, 27 Apr 2014 08:04:26 GMT
See <https://builds.apache.org/job/ActiveMQ-Java7/org.apache.activemq$activemq-unit-tests/329/>

------------------------------------------
[...truncated 208 lines...]
Running org.apache.activemq.broker.ft.DbRestartJDBCQueueMasterSlaveLeaseQuiesceTest
Tests run: 4, Failures: 0, Errors: 0, Skipped: 0, Time elapsed: 92.43 sec - in org.apache.activemq.broker.ft.DbRestartJDBCQueueMasterSlaveLeaseQuiesceTest
Running org.apache.activemq.broker.ft.DbRestartJDBCQueueMasterSlaveLeaseTest
Running org.apache.activemq.broker.ft.kahaDbJdbcLeaseQueueMasterSlaveTest
Tests run: 3, Failures: 0, Errors: 0, Skipped: 0, Time elapsed: 46.079 sec - in org.apache.activemq.broker.ft.kahaDbJdbcLeaseQueueMasterSlaveTest
Running org.apache.activemq.broker.ft.mKahaDbQueueMasterSlaveTest
Tests run: 3, Failures: 0, Errors: 0, Skipped: 0, Time elapsed: 92.727 sec - in org.apache.activemq.broker.ft.mKahaDbQueueMasterSlaveTest
Running org.apache.activemq.broker.jmx.BrokerViewSlowStoreStartupTest
Tests run: 1, Failures: 0, Errors: 0, Skipped: 0, Time elapsed: 2.072 sec - in org.apache.activemq.broker.jmx.BrokerViewSlowStoreStartupTest
Running org.apache.activemq.broker.jmx.HealthViewMBeanTest
Tests run: 1, Failures: 0, Errors: 0, Skipped: 0, Time elapsed: 6.88 sec - in org.apache.activemq.broker.jmx.HealthViewMBeanTest
Running org.apache.activemq.broker.jmx.MBeanOperationTimeoutTest
Tests run: 1, Failures: 0, Errors: 0, Skipped: 0, Time elapsed: 59.036 sec - in org.apache.activemq.broker.jmx.MBeanOperationTimeoutTest
Running org.apache.activemq.broker.jmx.TransportConnectorMBeanTest
Tests run: 4, Failures: 0, Errors: 0, Skipped: 0, Time elapsed: 2.074 sec - in org.apache.activemq.broker.jmx.TransportConnectorMBeanTest
Running org.apache.activemq.broker.mLevelDBXARecoveryBrokerTest
Tests run: 17, Failures: 0, Errors: 0, Skipped: 0, Time elapsed: 206.571 sec - in org.apache.activemq.broker.mLevelDBXARecoveryBrokerTest
Running org.apache.activemq.broker.message.security.MessageAuthenticationTest
Tests run: 1, Failures: 0, Errors: 0, Skipped: 0, Time elapsed: 1.203 sec - in org.apache.activemq.broker.message.security.MessageAuthenticationTest
Running org.apache.activemq.broker.partition.SpringPartitionBrokerTest
Tests run: 1, Failures: 0, Errors: 0, Skipped: 0, Time elapsed: 1.979 sec - in org.apache.activemq.broker.partition.SpringPartitionBrokerTest
Running org.apache.activemq.broker.policy.AbortSlowAckConsumer0Test
Tests run: 16, Failures: 0, Errors: 0, Skipped: 0, Time elapsed: 171.444 sec - in org.apache.activemq.broker.policy.AbortSlowAckConsumer0Test
Running org.apache.activemq.broker.policy.AbortSlowAckConsumer1Test
Tests run: 12, Failures: 0, Errors: 0, Skipped: 0, Time elapsed: 82.266 sec - in org.apache.activemq.broker.policy.AbortSlowAckConsumer1Test
Running org.apache.activemq.broker.policy.AbortSlowAckConsumer2Test
Tests run: 2, Failures: 0, Errors: 0, Skipped: 0, Time elapsed: 11.201 sec - in org.apache.activemq.broker.policy.AbortSlowAckConsumer2Test
Running org.apache.activemq.broker.policy.AbortSlowConsumer0Test
Tests run: 10, Failures: 0, Errors: 0, Skipped: 0, Time elapsed: 63.112 sec - in org.apache.activemq.broker.policy.AbortSlowConsumer0Test
Running org.apache.activemq.broker.policy.AbortSlowConsumer1Test
Tests run: 12, Failures: 0, Errors: 0, Skipped: 0, Time elapsed: 81.867 sec - in org.apache.activemq.broker.policy.AbortSlowConsumer1Test
Running org.apache.activemq.broker.policy.AbortSlowConsumer2Test
Tests run: 2, Failures: 0, Errors: 0, Skipped: 0, Time elapsed: 11.324 sec - in org.apache.activemq.broker.policy.AbortSlowConsumer2Test
Running org.apache.activemq.broker.policy.DeadLetterTest
Tests run: 4, Failures: 0, Errors: 0, Skipped: 0, Time elapsed: 84.823 sec - in org.apache.activemq.broker.policy.DeadLetterTest
Running org.apache.activemq.broker.policy.DestinationCursorConfigTest
Tests run: 2, Failures: 0, Errors: 0, Skipped: 0, Time elapsed: 2.229 sec - in org.apache.activemq.broker.policy.DestinationCursorConfigTest
Running org.apache.activemq.broker.policy.DiscardingDeadLetterPolicyTest
Tests run: 4, Failures: 0, Errors: 0, Skipped: 0, Time elapsed: 124.742 sec - in org.apache.activemq.broker.policy.DiscardingDeadLetterPolicyTest
Running org.apache.activemq.broker.policy.IndividualDeadLetterTest
Tests run: 5, Failures: 0, Errors: 0, Skipped: 0, Time elapsed: 116.088 sec - in org.apache.activemq.broker.policy.IndividualDeadLetterTest
Running org.apache.activemq.broker.policy.IndividualDeadLetterViaXmlTest
Tests run: 4, Failures: 0, Errors: 0, Skipped: 0, Time elapsed: 92.814 sec - in org.apache.activemq.broker.policy.IndividualDeadLetterViaXmlTest
Running org.apache.activemq.broker.policy.MessageGroupConfigTest
Tests run: 5, Failures: 0, Errors: 0, Skipped: 0, Time elapsed: 21.457 sec - in org.apache.activemq.broker.policy.MessageGroupConfigTest
Running org.apache.activemq.broker.policy.MessageListenerDeadLetterTest
Tests run: 4, Failures: 0, Errors: 0, Skipped: 0, Time elapsed: 3.781 sec - in org.apache.activemq.broker.policy.MessageListenerDeadLetterTest
Running org.apache.activemq.broker.policy.NoConsumerDeadLetterTest
Tests run: 5, Failures: 0, Errors: 0, Skipped: 0, Time elapsed: 2.373 sec - in org.apache.activemq.broker.policy.NoConsumerDeadLetterTest
Running org.apache.activemq.broker.policy.NoRetryDeadLetterTest
Tests run: 4, Failures: 0, Errors: 0, Skipped: 0, Time elapsed: 1.79 sec - in org.apache.activemq.broker.policy.NoRetryDeadLetterTest
Running org.apache.activemq.broker.policy.PerDurableConsumerDeadLetterTest
Tests run: 4, Failures: 0, Errors: 0, Skipped: 0, Time elapsed: 84.405 sec - in org.apache.activemq.broker.policy.PerDurableConsumerDeadLetterTest
Running org.apache.activemq.broker.policy.PriorityNetworkDispatchPolicyTest
Tests run: 1, Failures: 0, Errors: 0, Skipped: 0, Time elapsed: 0.902 sec - in org.apache.activemq.broker.policy.PriorityNetworkDispatchPolicyTest
Running org.apache.activemq.broker.policy.SecureDLQTest
Tests run: 4, Failures: 0, Errors: 0, Skipped: 0, Time elapsed: 5.623 sec - in org.apache.activemq.broker.policy.SecureDLQTest
Running org.apache.activemq.broker.policy.StrictOrderDispatchPolicyTest
Tests run: 8, Failures: 0, Errors: 0, Skipped: 0, Time elapsed: 7.084 sec - in org.apache.activemq.broker.policy.StrictOrderDispatchPolicyTest
Running org.apache.activemq.broker.region.QueueOptimizedDispatchExceptionTest
Tests run: 1, Failures: 0, Errors: 0, Skipped: 0, Time elapsed: 0.812 sec - in org.apache.activemq.broker.region.QueueOptimizedDispatchExceptionTest
Running org.apache.activemq.broker.region.QueuePurgeTest
Running org.apache.activemq.broker.region.QueueResendDuringShutdownTest
Tests run: 3, Failures: 0, Errors: 0, Skipped: 0, Time elapsed: 10.486 sec - in org.apache.activemq.broker.region.QueueResendDuringShutdownTest
Running org.apache.activemq.broker.region.SubscriptionAddRemoveQueueTest
Tests run: 1, Failures: 0, Errors: 0, Skipped: 0, Time elapsed: 3.849 sec - in org.apache.activemq.broker.region.SubscriptionAddRemoveQueueTest
Running org.apache.activemq.broker.region.cursors.OrderPendingListTest
Tests run: 9, Failures: 0, Errors: 0, Skipped: 0, Time elapsed: 0.31 sec - in org.apache.activemq.broker.region.cursors.OrderPendingListTest
Running org.apache.activemq.broker.region.cursors.PrioritizedPendingListTest
Tests run: 7, Failures: 0, Errors: 0, Skipped: 0, Time elapsed: 0.327 sec - in org.apache.activemq.broker.region.cursors.PrioritizedPendingListTest
Running org.apache.activemq.broker.region.cursors.StoreQueueCursorKahaDBNoDuplicateTest
Tests run: 1, Failures: 0, Errors: 0, Skipped: 0, Time elapsed: 2.735 sec - in org.apache.activemq.broker.region.cursors.StoreQueueCursorKahaDBNoDuplicateTest
Running org.apache.activemq.broker.region.cursors.StoreQueueCursorLevelDBNoDuplicateTest
Tests run: 1, Failures: 0, Errors: 0, Skipped: 0, Time elapsed: 3.049 sec - in org.apache.activemq.broker.region.cursors.StoreQueueCursorLevelDBNoDuplicateTest
Running org.apache.activemq.broker.region.cursors.StoreQueueCursorMemoryNoDuplicateTest
Tests run: 1, Failures: 0, Errors: 0, Skipped: 0, Time elapsed: 0.766 sec - in org.apache.activemq.broker.region.cursors.StoreQueueCursorMemoryNoDuplicateTest
Running org.apache.activemq.broker.region.cursors.StoreQueueCursorNoDuplicateTest
Tests run: 1, Failures: 0, Errors: 0, Skipped: 0, Time elapsed: 2.912 sec - in org.apache.activemq.broker.region.cursors.StoreQueueCursorNoDuplicateTest
Running org.apache.activemq.broker.region.group.MessageGroupHashBucketTest
Tests run: 2, Failures: 0, Errors: 0, Skipped: 0, Time elapsed: 0.064 sec - in org.apache.activemq.broker.region.group.MessageGroupHashBucketTest
Running org.apache.activemq.broker.region.group.MessageGroupMapTest
Tests run: 2, Failures: 0, Errors: 0, Skipped: 0, Time elapsed: 0.062 sec - in org.apache.activemq.broker.region.group.MessageGroupMapTest
Running org.apache.activemq.broker.region.group.MessageGroupTest
Tests run: 3, Failures: 0, Errors: 0, Skipped: 0, Time elapsed: 1.6 sec - in org.apache.activemq.broker.region.group.MessageGroupTest
Running org.apache.activemq.broker.scheduler.JobSchedulerBrokerShutdownTest
Tests run: 1, Failures: 0, Errors: 0, Skipped: 0, Time elapsed: 9.911 sec - in org.apache.activemq.broker.scheduler.JobSchedulerBrokerShutdownTest
Running org.apache.activemq.broker.scheduler.JobSchedulerTxTest
Tests run: 2, Failures: 0, Errors: 0, Skipped: 0, Time elapsed: 17.829 sec - in org.apache.activemq.broker.scheduler.JobSchedulerTxTest
Running org.apache.activemq.broker.scheduler.LostScheduledMessagesTest
Tests run: 2, Failures: 0, Errors: 0, Skipped: 0, Time elapsed: 38.589 sec - in org.apache.activemq.broker.scheduler.LostScheduledMessagesTest
Running org.apache.activemq.broker.util.RedeliveryPluginTest
Tests run: 1, Failures: 0, Errors: 0, Skipped: 0, Time elapsed: 0.525 sec - in org.apache.activemq.broker.util.RedeliveryPluginTest
Running org.apache.activemq.broker.util.TimeStampingBrokerPluginTest
Tests run: 3, Failures: 0, Errors: 0, Skipped: 0, Time elapsed: 3.051 sec - in org.apache.activemq.broker.util.TimeStampingBrokerPluginTest
Running org.apache.activemq.broker.virtual.CompositeQueueTest
Tests run: 1, Failures: 0, Errors: 0, Skipped: 0, Time elapsed: 1.785 sec - in org.apache.activemq.broker.virtual.CompositeQueueTest
Running org.apache.activemq.broker.virtual.DestinationInterceptorDurableSubTest
Tests run: 1, Failures: 0, Errors: 0, Skipped: 0, Time elapsed: 2.05 sec - in org.apache.activemq.broker.virtual.DestinationInterceptorDurableSubTest
Running org.apache.activemq.broker.virtual.MirroredQueueTest
Tests run: 2, Failures: 0, Errors: 0, Skipped: 0, Time elapsed: 1.211 sec - in org.apache.activemq.broker.virtual.MirroredQueueTest
Running org.apache.activemq.broker.virtual.MirroredQueueUsingVirtualTopicQueueTest
Tests run: 2, Failures: 0, Errors: 0, Skipped: 0, Time elapsed: 1.258 sec - in org.apache.activemq.broker.virtual.MirroredQueueUsingVirtualTopicQueueTest
Running org.apache.activemq.broker.virtual.VirtualDestPerfTest
Tests run: 1, Failures: 0, Errors: 0, Skipped: 1, Time elapsed: 0.093 sec - in org.apache.activemq.broker.virtual.VirtualDestPerfTest
Running org.apache.activemq.broker.virtual.VirtualTopicPubSubTest
Tests run: 2, Failures: 0, Errors: 0, Skipped: 0, Time elapsed: 1.719 sec - in org.apache.activemq.broker.virtual.VirtualTopicPubSubTest
Running org.apache.activemq.broker.virtual.VirtualTopicPubSubUsingXBeanTest
Tests run: 2, Failures: 0, Errors: 0, Skipped: 0, Time elapsed: 1.336 sec - in org.apache.activemq.broker.virtual.VirtualTopicPubSubUsingXBeanTest
Running org.apache.activemq.broker.virtual.VirtualTopicSelectorTest
Tests run: 1, Failures: 0, Errors: 0, Skipped: 0, Time elapsed: 1.257 sec - in org.apache.activemq.broker.virtual.VirtualTopicSelectorTest
Running org.apache.activemq.broker.virtual.VirtualTopicsAndDurableSubsTest
Tests run: 25, Failures: 0, Errors: 0, Skipped: 0, Time elapsed: 20.825 sec - in org.apache.activemq.broker.virtual.VirtualTopicsAndDurableSubsTest
Running org.apache.activemq.bugs.AMQ2103Test
Tests run: 2, Failures: 0, Errors: 0, Skipped: 0, Time elapsed: 1.163 sec - in org.apache.activemq.bugs.AMQ2103Test
Running org.apache.activemq.bugs.AMQ2149LevelDBTest
Tests run: 4, Failures: 4, Errors: 0, Skipped: 0, Time elapsed: 1,027.805 sec <<<
FAILURE! - in org.apache.activemq.bugs.AMQ2149LevelDBTest
testQueueTransactionalOrderWithRestart(org.apache.activemq.bugs.AMQ2149LevelDBTest)  Time
elapsed: 243.212 sec  <<< FAILURE!
java.lang.AssertionError: No timeout waiting for senders/receivers to complete
	at org.junit.Assert.fail(Assert.java:88)
	at org.junit.Assert.assertTrue(Assert.java:41)
	at org.apache.activemq.bugs.AMQ2149Test.verifyOrderedMessageReceipt(AMQ2149Test.java:549)
	at org.apache.activemq.bugs.AMQ2149Test.doTestTransactionalOrderWithRestart(AMQ2149Test.java:435)
	at org.apache.activemq.bugs.AMQ2149Test.testQueueTransactionalOrderWithRestart(AMQ2149Test.java:412)
	at sun.reflect.NativeMethodAccessorImpl.invoke0(Native Method)
	at sun.reflect.NativeMethodAccessorImpl.invoke(NativeMethodAccessorImpl.java:57)
	at sun.reflect.DelegatingMethodAccessorImpl.invoke(DelegatingMethodAccessorImpl.java:43)
	at java.lang.reflect.Method.invoke(Method.java:606)
	at org.junit.runners.model.FrameworkMethod$1.runReflectiveCall(FrameworkMethod.java:47)
	at org.junit.internal.runners.model.ReflectiveCallable.run(ReflectiveCallable.java:12)
	at org.junit.runners.model.FrameworkMethod.invokeExplosively(FrameworkMethod.java:44)
	at org.junit.internal.runners.statements.InvokeMethod.evaluate(InvokeMethod.java:17)
	at org.junit.internal.runners.statements.FailOnTimeout$StatementThread.run(FailOnTimeout.java:74)

testOrderWithRestart(org.apache.activemq.bugs.AMQ2149LevelDBTest)  Time elapsed: 298.583 sec
 <<< FAILURE!
java.lang.AssertionError: No timeout waiting for senders/receivers to complete
	at org.junit.Assert.fail(Assert.java:88)
	at org.junit.Assert.assertTrue(Assert.java:41)
	at org.apache.activemq.bugs.AMQ2149Test.verifyOrderedMessageReceipt(AMQ2149Test.java:549)
	at org.apache.activemq.bugs.AMQ2149Test.verifyOrderedMessageReceipt(AMQ2149Test.java:505)
	at org.apache.activemq.bugs.AMQ2149Test.testOrderWithRestart(AMQ2149Test.java:382)
	at sun.reflect.NativeMethodAccessorImpl.invoke0(Native Method)
	at sun.reflect.NativeMethodAccessorImpl.invoke(NativeMethodAccessorImpl.java:57)
	at sun.reflect.DelegatingMethodAccessorImpl.invoke(DelegatingMethodAccessorImpl.java:43)
	at java.lang.reflect.Method.invoke(Method.java:606)
	at org.junit.runners.model.FrameworkMethod$1.runReflectiveCall(FrameworkMethod.java:47)
	at org.junit.internal.runners.model.ReflectiveCallable.run(ReflectiveCallable.java:12)
	at org.junit.runners.model.FrameworkMethod.invokeExplosively(FrameworkMethod.java:44)
	at org.junit.internal.runners.statements.InvokeMethod.evaluate(InvokeMethod.java:17)
	at org.junit.internal.runners.statements.FailOnTimeout$StatementThread.run(FailOnTimeout.java:74)

testTopicOrderWithRestart(org.apache.activemq.bugs.AMQ2149LevelDBTest)  Time elapsed: 244.748
sec  <<< FAILURE!
java.lang.AssertionError: No timeout waiting for senders/receivers to complete
	at org.junit.Assert.fail(Assert.java:88)
	at org.junit.Assert.assertTrue(Assert.java:41)
	at org.apache.activemq.bugs.AMQ2149Test.verifyOrderedMessageReceipt(AMQ2149Test.java:549)
	at org.apache.activemq.bugs.AMQ2149Test.verifyOrderedMessageReceipt(AMQ2149Test.java:501)
	at org.apache.activemq.bugs.AMQ2149Test.testTopicOrderWithRestart(AMQ2149Test.java:402)
	at sun.reflect.NativeMethodAccessorImpl.invoke0(Native Method)
	at sun.reflect.NativeMethodAccessorImpl.invoke(NativeMethodAccessorImpl.java:57)
	at sun.reflect.DelegatingMethodAccessorImpl.invoke(DelegatingMethodAccessorImpl.java:43)
	at java.lang.reflect.Method.invoke(Method.java:606)
	at org.junit.runners.model.FrameworkMethod$1.runReflectiveCall(FrameworkMethod.java:47)
	at org.junit.internal.runners.model.ReflectiveCallable.run(ReflectiveCallable.java:12)
	at org.junit.runners.model.FrameworkMethod.invokeExplosively(FrameworkMethod.java:44)
	at org.junit.internal.runners.statements.InvokeMethod.evaluate(InvokeMethod.java:17)
	at org.junit.internal.runners.statements.FailOnTimeout$StatementThread.run(FailOnTimeout.java:74)

testTopicTransactionalOrderWithRestart(org.apache.activemq.bugs.AMQ2149LevelDBTest)  Time
elapsed: 241.074 sec  <<< FAILURE!
java.lang.AssertionError: No timeout waiting for senders/receivers to complete
	at org.junit.Assert.fail(Assert.java:88)
	at org.junit.Assert.assertTrue(Assert.java:41)
	at org.apache.activemq.bugs.AMQ2149Test.verifyOrderedMessageReceipt(AMQ2149Test.java:549)
	at org.apache.activemq.bugs.AMQ2149Test.doTestTransactionalOrderWithRestart(AMQ2149Test.java:435)
	at org.apache.activemq.bugs.AMQ2149Test.testTopicTransactionalOrderWithRestart(AMQ2149Test.java:417)
	at sun.reflect.NativeMethodAccessorImpl.invoke0(Native Method)
	at sun.reflect.NativeMethodAccessorImpl.invoke(NativeMethodAccessorImpl.java:57)
	at sun.reflect.DelegatingMethodAccessorImpl.invoke(DelegatingMethodAccessorImpl.java:43)
	at java.lang.reflect.Method.invoke(Method.java:606)
	at org.junit.runners.model.FrameworkMethod$1.runReflectiveCall(FrameworkMethod.java:47)
	at org.junit.internal.runners.model.ReflectiveCallable.run(ReflectiveCallable.java:12)
	at org.junit.runners.model.FrameworkMethod.invokeExplosively(FrameworkMethod.java:44)
	at org.junit.internal.runners.statements.InvokeMethod.evaluate(InvokeMethod.java:17)
	at org.junit.internal.runners.statements.FailOnTimeout$StatementThread.run(FailOnTimeout.java:74)

Running org.apache.activemq.bugs.AMQ2383Test
Tests run: 1, Failures: 0, Errors: 0, Skipped: 0, Time elapsed: 1.091 sec - in org.apache.activemq.bugs.AMQ2383Test
Running org.apache.activemq.bugs.AMQ2528Test
Tests run: 1, Failures: 0, Errors: 0, Skipped: 0, Time elapsed: 1.254 sec - in org.apache.activemq.bugs.AMQ2528Test
Running org.apache.activemq.bugs.AMQ2571Test
Tests run: 1, Failures: 0, Errors: 0, Skipped: 0, Time elapsed: 1.623 sec - in org.apache.activemq.bugs.AMQ2571Test
Running org.apache.activemq.bugs.AMQ2585Test
Tests run: 1, Failures: 0, Errors: 0, Skipped: 0, Time elapsed: 1.169 sec - in org.apache.activemq.bugs.AMQ2585Test
Running org.apache.activemq.bugs.AMQ2736Test
Tests run: 1, Failures: 0, Errors: 0, Skipped: 0, Time elapsed: 3.076 sec - in org.apache.activemq.bugs.AMQ2736Test
Running org.apache.activemq.bugs.AMQ2801Test
Tests run: 1, Failures: 0, Errors: 0, Skipped: 0, Time elapsed: 150.432 sec - in org.apache.activemq.bugs.AMQ2801Test
Running org.apache.activemq.bugs.AMQ2902Test
Tests run: 2, Failures: 0, Errors: 0, Skipped: 0, Time elapsed: 1.144 sec - in org.apache.activemq.bugs.AMQ2902Test
Running org.apache.activemq.bugs.AMQ3014Test
Tests run: 2, Failures: 0, Errors: 0, Skipped: 0, Time elapsed: 1.652 sec - in org.apache.activemq.bugs.AMQ3014Test
Running org.apache.activemq.bugs.AMQ3465Test
Tests run: 2, Failures: 0, Errors: 0, Skipped: 0, Time elapsed: 1.085 sec - in org.apache.activemq.bugs.AMQ3465Test
Running org.apache.activemq.bugs.AMQ3537Test
Tests run: 1, Failures: 0, Errors: 0, Skipped: 0, Time elapsed: 0.204 sec - in org.apache.activemq.bugs.AMQ3537Test
Running org.apache.activemq.bugs.AMQ3779Test
Tests run: 1, Failures: 0, Errors: 0, Skipped: 0, Time elapsed: 2.542 sec - in org.apache.activemq.bugs.AMQ3779Test
Running org.apache.activemq.bugs.AMQ3879Test
Tests run: 1, Failures: 0, Errors: 0, Skipped: 0, Time elapsed: 1.514 sec - in org.apache.activemq.bugs.AMQ3879Test
Running org.apache.activemq.bugs.AMQ3903Test
Tests run: 2, Failures: 0, Errors: 0, Skipped: 0, Time elapsed: 0.996 sec - in org.apache.activemq.bugs.AMQ3903Test
Running org.apache.activemq.bugs.AMQ3932Test
Tests run: 3, Failures: 0, Errors: 0, Skipped: 0, Time elapsed: 22.531 sec - in org.apache.activemq.bugs.AMQ3932Test
Running org.apache.activemq.bugs.AMQ3934Test
Tests run: 1, Failures: 0, Errors: 0, Skipped: 0, Time elapsed: 1.191 sec - in org.apache.activemq.bugs.AMQ3934Test
Running org.apache.activemq.bugs.AMQ3961Test
Tests run: 1, Failures: 0, Errors: 0, Skipped: 0, Time elapsed: 5.026 sec - in org.apache.activemq.bugs.AMQ3961Test
Running org.apache.activemq.bugs.AMQ3992Test
Tests run: 1, Failures: 0, Errors: 0, Skipped: 0, Time elapsed: 4.286 sec - in org.apache.activemq.bugs.AMQ3992Test
Running org.apache.activemq.bugs.AMQ4062Test
Tests run: 1, Failures: 0, Errors: 0, Skipped: 0, Time elapsed: 7.958 sec - in org.apache.activemq.bugs.AMQ4062Test
Running org.apache.activemq.bugs.AMQ4083Test
Tests run: 6, Failures: 0, Errors: 0, Skipped: 0, Time elapsed: 56.657 sec - in org.apache.activemq.bugs.AMQ4083Test
Running org.apache.activemq.bugs.AMQ4116Test
Tests run: 2, Failures: 0, Errors: 0, Skipped: 0, Time elapsed: 1.337 sec - in org.apache.activemq.bugs.AMQ4116Test
Running org.apache.activemq.bugs.AMQ4126Test
Tests run: 9, Failures: 0, Errors: 0, Skipped: 0, Time elapsed: 30.55 sec - in org.apache.activemq.bugs.AMQ4126Test
Running org.apache.activemq.bugs.AMQ4133Test
Tests run: 4, Failures: 0, Errors: 0, Skipped: 0, Time elapsed: 16.932 sec - in org.apache.activemq.bugs.AMQ4133Test
Running org.apache.activemq.bugs.AMQ4147Test
Tests run: 2, Failures: 0, Errors: 0, Skipped: 0, Time elapsed: 8.528 sec - in org.apache.activemq.bugs.AMQ4147Test
Running org.apache.activemq.bugs.AMQ4148Test
Tests run: 1, Failures: 0, Errors: 0, Skipped: 0, Time elapsed: 11.215 sec - in org.apache.activemq.bugs.AMQ4148Test
Running org.apache.activemq.bugs.AMQ4157Test
Tests run: 1, Failures: 0, Errors: 0, Skipped: 0, Time elapsed: 11.819 sec - in org.apache.activemq.bugs.AMQ4157Test
Running org.apache.activemq.bugs.AMQ4160Test
Tests run: 3, Failures: 0, Errors: 0, Skipped: 0, Time elapsed: 44.225 sec - in org.apache.activemq.bugs.AMQ4160Test
Running org.apache.activemq.bugs.AMQ4212Test

Results :

Failed tests: 
  AMQ2149LevelDBTest>AMQ2149Test.testQueueTransactionalOrderWithRestart:412->AMQ2149Test.doTestTransactionalOrderWithRestart:435->AMQ2149Test.verifyOrderedMessageReceipt:549
No timeout waiting for senders/receivers to complete
  AMQ2149LevelDBTest>AMQ2149Test.testOrderWithRestart:382->AMQ2149Test.verifyOrderedMessageReceipt:505->AMQ2149Test.verifyOrderedMessageReceipt:549
No timeout waiting for senders/receivers to complete
  AMQ2149LevelDBTest>AMQ2149Test.testTopicOrderWithRestart:402->AMQ2149Test.verifyOrderedMessageReceipt:501->AMQ2149Test.verifyOrderedMessageReceipt:549
No timeout waiting for senders/receivers to complete
  AMQ2149LevelDBTest>AMQ2149Test.testTopicTransactionalOrderWithRestart:417->AMQ2149Test.doTestTransactionalOrderWithRestart:435->AMQ2149Test.verifyOrderedMessageReceipt:549
No timeout waiting for senders/receivers to complete

Tests run: 1058, Failures: 4, Errors: 0, Skipped: 1

[JENKINS] Recording test results

Mime
View raw message