activemq-commits mailing list archives

Site index · List index
Message view « Date » · « Thread »
Top « Date » · « Thread »
From Apache Jenkins Server <jenk...@builds.apache.org>
Subject Build failed in Jenkins: ActiveMQ-Java7 » ActiveMQ :: Unit Tests #328
Date Sat, 26 Apr 2014 11:12:37 GMT
See <https://builds.apache.org/job/ActiveMQ-Java7/org.apache.activemq$activemq-unit-tests/328/changes>

Changes:

[dejan] https://issues.apache.org/jira/browse/AMQ-5162 - handle io exception in lease database
locker start

------------------------------------------
[...truncated 259 lines...]
Running org.apache.activemq.broker.policy.PerDurableConsumerDeadLetterTest
Tests run: 4, Failures: 0, Errors: 0, Skipped: 0, Time elapsed: 84.14 sec - in org.apache.activemq.broker.policy.PerDurableConsumerDeadLetterTest
Running org.apache.activemq.broker.policy.PriorityNetworkDispatchPolicyTest
Tests run: 1, Failures: 0, Errors: 0, Skipped: 0, Time elapsed: 0.928 sec - in org.apache.activemq.broker.policy.PriorityNetworkDispatchPolicyTest
Running org.apache.activemq.broker.policy.SecureDLQTest
Tests run: 4, Failures: 0, Errors: 0, Skipped: 0, Time elapsed: 5.529 sec - in org.apache.activemq.broker.policy.SecureDLQTest
Running org.apache.activemq.broker.policy.StrictOrderDispatchPolicyTest
Tests run: 8, Failures: 0, Errors: 0, Skipped: 0, Time elapsed: 7.282 sec - in org.apache.activemq.broker.policy.StrictOrderDispatchPolicyTest
Running org.apache.activemq.broker.region.QueueOptimizedDispatchExceptionTest
Tests run: 1, Failures: 0, Errors: 0, Skipped: 0, Time elapsed: 0.805 sec - in org.apache.activemq.broker.region.QueueOptimizedDispatchExceptionTest
Running org.apache.activemq.broker.region.QueuePurgeTest
Running org.apache.activemq.broker.region.QueueResendDuringShutdownTest
Tests run: 3, Failures: 0, Errors: 0, Skipped: 0, Time elapsed: 10.416 sec - in org.apache.activemq.broker.region.QueueResendDuringShutdownTest
Running org.apache.activemq.broker.region.SubscriptionAddRemoveQueueTest
Tests run: 1, Failures: 0, Errors: 0, Skipped: 0, Time elapsed: 4.13 sec - in org.apache.activemq.broker.region.SubscriptionAddRemoveQueueTest
Running org.apache.activemq.broker.region.cursors.OrderPendingListTest
Tests run: 9, Failures: 0, Errors: 0, Skipped: 0, Time elapsed: 0.294 sec - in org.apache.activemq.broker.region.cursors.OrderPendingListTest
Running org.apache.activemq.broker.region.cursors.PrioritizedPendingListTest
Tests run: 7, Failures: 0, Errors: 0, Skipped: 0, Time elapsed: 0.305 sec - in org.apache.activemq.broker.region.cursors.PrioritizedPendingListTest
Running org.apache.activemq.broker.region.cursors.StoreQueueCursorKahaDBNoDuplicateTest
Tests run: 1, Failures: 0, Errors: 0, Skipped: 0, Time elapsed: 3.389 sec - in org.apache.activemq.broker.region.cursors.StoreQueueCursorKahaDBNoDuplicateTest
Running org.apache.activemq.broker.region.cursors.StoreQueueCursorLevelDBNoDuplicateTest
Tests run: 1, Failures: 0, Errors: 0, Skipped: 0, Time elapsed: 2.458 sec - in org.apache.activemq.broker.region.cursors.StoreQueueCursorLevelDBNoDuplicateTest
Running org.apache.activemq.broker.region.cursors.StoreQueueCursorMemoryNoDuplicateTest
Tests run: 1, Failures: 0, Errors: 0, Skipped: 0, Time elapsed: 0.757 sec - in org.apache.activemq.broker.region.cursors.StoreQueueCursorMemoryNoDuplicateTest
Running org.apache.activemq.broker.region.cursors.StoreQueueCursorNoDuplicateTest
Tests run: 1, Failures: 0, Errors: 0, Skipped: 0, Time elapsed: 3.828 sec - in org.apache.activemq.broker.region.cursors.StoreQueueCursorNoDuplicateTest
Running org.apache.activemq.broker.region.group.MessageGroupHashBucketTest
Tests run: 2, Failures: 0, Errors: 0, Skipped: 0, Time elapsed: 0.062 sec - in org.apache.activemq.broker.region.group.MessageGroupHashBucketTest
Running org.apache.activemq.broker.region.group.MessageGroupMapTest
Tests run: 2, Failures: 0, Errors: 0, Skipped: 0, Time elapsed: 0.061 sec - in org.apache.activemq.broker.region.group.MessageGroupMapTest
Running org.apache.activemq.broker.region.group.MessageGroupTest
Tests run: 3, Failures: 0, Errors: 0, Skipped: 0, Time elapsed: 1.61 sec - in org.apache.activemq.broker.region.group.MessageGroupTest
Running org.apache.activemq.broker.scheduler.JobSchedulerBrokerShutdownTest
Tests run: 1, Failures: 0, Errors: 0, Skipped: 0, Time elapsed: 9.599 sec - in org.apache.activemq.broker.scheduler.JobSchedulerBrokerShutdownTest
Running org.apache.activemq.broker.scheduler.JobSchedulerTxTest
Tests run: 2, Failures: 0, Errors: 0, Skipped: 0, Time elapsed: 16.078 sec - in org.apache.activemq.broker.scheduler.JobSchedulerTxTest
Running org.apache.activemq.broker.scheduler.LostScheduledMessagesTest
Tests run: 2, Failures: 0, Errors: 0, Skipped: 0, Time elapsed: 36.49 sec - in org.apache.activemq.broker.scheduler.LostScheduledMessagesTest
Running org.apache.activemq.broker.util.RedeliveryPluginTest
Tests run: 1, Failures: 0, Errors: 0, Skipped: 0, Time elapsed: 0.503 sec - in org.apache.activemq.broker.util.RedeliveryPluginTest
Running org.apache.activemq.broker.util.TimeStampingBrokerPluginTest
Tests run: 3, Failures: 0, Errors: 0, Skipped: 0, Time elapsed: 3.073 sec - in org.apache.activemq.broker.util.TimeStampingBrokerPluginTest
Running org.apache.activemq.broker.virtual.CompositeQueueTest
Tests run: 1, Failures: 0, Errors: 0, Skipped: 0, Time elapsed: 1.76 sec - in org.apache.activemq.broker.virtual.CompositeQueueTest
Running org.apache.activemq.broker.virtual.DestinationInterceptorDurableSubTest
Tests run: 1, Failures: 0, Errors: 0, Skipped: 0, Time elapsed: 1.944 sec - in org.apache.activemq.broker.virtual.DestinationInterceptorDurableSubTest
Running org.apache.activemq.broker.virtual.MirroredQueueTest
Tests run: 2, Failures: 0, Errors: 0, Skipped: 0, Time elapsed: 1.206 sec - in org.apache.activemq.broker.virtual.MirroredQueueTest
Running org.apache.activemq.broker.virtual.MirroredQueueUsingVirtualTopicQueueTest
Tests run: 2, Failures: 0, Errors: 0, Skipped: 0, Time elapsed: 1.243 sec - in org.apache.activemq.broker.virtual.MirroredQueueUsingVirtualTopicQueueTest
Running org.apache.activemq.broker.virtual.VirtualDestPerfTest
Tests run: 1, Failures: 0, Errors: 0, Skipped: 1, Time elapsed: 0.093 sec - in org.apache.activemq.broker.virtual.VirtualDestPerfTest
Running org.apache.activemq.broker.virtual.VirtualTopicPubSubTest
Tests run: 2, Failures: 0, Errors: 0, Skipped: 0, Time elapsed: 2.333 sec - in org.apache.activemq.broker.virtual.VirtualTopicPubSubTest
Running org.apache.activemq.broker.virtual.VirtualTopicPubSubUsingXBeanTest
Tests run: 2, Failures: 0, Errors: 0, Skipped: 0, Time elapsed: 1.341 sec - in org.apache.activemq.broker.virtual.VirtualTopicPubSubUsingXBeanTest
Running org.apache.activemq.broker.virtual.VirtualTopicSelectorTest
Tests run: 1, Failures: 0, Errors: 0, Skipped: 0, Time elapsed: 1.147 sec - in org.apache.activemq.broker.virtual.VirtualTopicSelectorTest
Running org.apache.activemq.broker.virtual.VirtualTopicsAndDurableSubsTest
Tests run: 25, Failures: 0, Errors: 0, Skipped: 0, Time elapsed: 23.492 sec - in org.apache.activemq.broker.virtual.VirtualTopicsAndDurableSubsTest
Running org.apache.activemq.bugs.AMQ2103Test
Tests run: 2, Failures: 0, Errors: 0, Skipped: 0, Time elapsed: 1.787 sec - in org.apache.activemq.bugs.AMQ2103Test
Running org.apache.activemq.bugs.AMQ2149LevelDBTest
Tests run: 5, Failures: 4, Errors: 1, Skipped: 0, Time elapsed: 1,069.951 sec <<<
FAILURE! - in org.apache.activemq.bugs.AMQ2149LevelDBTest
testQueueTransactionalOrderWithRestart(org.apache.activemq.bugs.AMQ2149LevelDBTest)  Time
elapsed: 332.178 sec  <<< ERROR!
java.lang.Exception: test timed out after 300000 milliseconds
	at sun.misc.Unsafe.park(Native Method)
	at java.util.concurrent.locks.LockSupport.park(LockSupport.java:186)
	at java.util.concurrent.locks.AbstractQueuedSynchronizer$ConditionObject.await(AbstractQueuedSynchronizer.java:2043)
	at java.util.concurrent.ArrayBlockingQueue.take(ArrayBlockingQueue.java:374)
	at org.apache.activemq.transport.FutureResponse.getResult(FutureResponse.java:40)
	at org.apache.activemq.transport.ResponseCorrelator.request(ResponseCorrelator.java:87)
	at org.apache.activemq.ActiveMQConnection.syncSendPacket(ActiveMQConnection.java:1397)
	at org.apache.activemq.TransactionContext.rollback(TransactionContext.java:283)
	at org.apache.activemq.ActiveMQSession.rollback(ActiveMQSession.java:583)
	at org.apache.activemq.ActiveMQSession.dispose(ActiveMQSession.java:725)
	at org.apache.activemq.ActiveMQConnection.close(ActiveMQConnection.java:675)
	at org.apache.activemq.bugs.AMQ2149Test$Receiver.close(AMQ2149Test.java:183)
	at org.apache.activemq.bugs.AMQ2149Test.verifyOrderedMessageReceipt(AMQ2149Test.java:537)
	at org.apache.activemq.bugs.AMQ2149Test.doTestTransactionalOrderWithRestart(AMQ2149Test.java:435)
	at org.apache.activemq.bugs.AMQ2149Test.testQueueTransactionalOrderWithRestart(AMQ2149Test.java:412)
	at sun.reflect.NativeMethodAccessorImpl.invoke0(Native Method)
	at sun.reflect.NativeMethodAccessorImpl.invoke(NativeMethodAccessorImpl.java:57)
	at sun.reflect.DelegatingMethodAccessorImpl.invoke(DelegatingMethodAccessorImpl.java:43)
	at java.lang.reflect.Method.invoke(Method.java:606)
	at org.junit.runners.model.FrameworkMethod$1.runReflectiveCall(FrameworkMethod.java:47)
	at org.junit.internal.runners.model.ReflectiveCallable.run(ReflectiveCallable.java:12)
	at org.junit.runners.model.FrameworkMethod.invokeExplosively(FrameworkMethod.java:44)
	at org.junit.internal.runners.statements.InvokeMethod.evaluate(InvokeMethod.java:17)
	at org.junit.internal.runners.statements.FailOnTimeout$StatementThread.run(FailOnTimeout.java:74)

testQueueTransactionalOrderWithRestart(org.apache.activemq.bugs.AMQ2149LevelDBTest)  Time
elapsed: 332.178 sec  <<< FAILURE!
java.lang.AssertionError: Teardown timed out
	at org.junit.Assert.fail(Assert.java:88)
	at org.apache.activemq.bugs.AMQ2149Test.tearDown(AMQ2149Test.java:132)
	at sun.reflect.NativeMethodAccessorImpl.invoke0(Native Method)
	at sun.reflect.NativeMethodAccessorImpl.invoke(NativeMethodAccessorImpl.java:57)
	at sun.reflect.DelegatingMethodAccessorImpl.invoke(DelegatingMethodAccessorImpl.java:43)
	at java.lang.reflect.Method.invoke(Method.java:606)
	at org.junit.runners.model.FrameworkMethod$1.runReflectiveCall(FrameworkMethod.java:47)
	at org.junit.internal.runners.model.ReflectiveCallable.run(ReflectiveCallable.java:12)
	at org.junit.runners.model.FrameworkMethod.invokeExplosively(FrameworkMethod.java:44)
	at org.junit.internal.runners.statements.RunAfters.evaluate(RunAfters.java:33)
	at org.junit.rules.TestWatcher$1.evaluate(TestWatcher.java:55)
	at org.junit.rules.RunRules.evaluate(RunRules.java:20)
	at org.junit.runners.ParentRunner.runLeaf(ParentRunner.java:271)
	at org.junit.runners.BlockJUnit4ClassRunner.runChild(BlockJUnit4ClassRunner.java:70)
	at org.junit.runners.BlockJUnit4ClassRunner.runChild(BlockJUnit4ClassRunner.java:50)
	at org.junit.runners.ParentRunner$3.run(ParentRunner.java:238)
	at org.junit.runners.ParentRunner$1.schedule(ParentRunner.java:63)
	at org.junit.runners.ParentRunner.runChildren(ParentRunner.java:236)
	at org.junit.runners.ParentRunner.access$000(ParentRunner.java:53)
	at org.junit.runners.ParentRunner$2.evaluate(ParentRunner.java:229)
	at org.junit.runners.ParentRunner.run(ParentRunner.java:309)
	at org.apache.maven.surefire.junit4.JUnit4Provider.execute(JUnit4Provider.java:264)
	at org.apache.maven.surefire.junit4.JUnit4Provider.executeTestSet(JUnit4Provider.java:153)
	at org.apache.maven.surefire.junit4.JUnit4Provider.invoke(JUnit4Provider.java:124)
	at org.apache.maven.surefire.booter.ForkedBooter.invokeProviderInSameClassLoader(ForkedBooter.java:200)
	at org.apache.maven.surefire.booter.ForkedBooter.runSuitesInProcess(ForkedBooter.java:153)
	at org.apache.maven.surefire.booter.ForkedBooter.main(ForkedBooter.java:103)

testOrderWithRestart(org.apache.activemq.bugs.AMQ2149LevelDBTest)  Time elapsed: 253.012 sec
 <<< FAILURE!
java.lang.AssertionError: No timeout waiting for senders/receivers to complete
	at org.junit.Assert.fail(Assert.java:88)
	at org.junit.Assert.assertTrue(Assert.java:41)
	at org.apache.activemq.bugs.AMQ2149Test.verifyOrderedMessageReceipt(AMQ2149Test.java:549)
	at org.apache.activemq.bugs.AMQ2149Test.verifyOrderedMessageReceipt(AMQ2149Test.java:505)
	at org.apache.activemq.bugs.AMQ2149Test.testOrderWithRestart(AMQ2149Test.java:382)
	at sun.reflect.NativeMethodAccessorImpl.invoke0(Native Method)
	at sun.reflect.NativeMethodAccessorImpl.invoke(NativeMethodAccessorImpl.java:57)
	at sun.reflect.DelegatingMethodAccessorImpl.invoke(DelegatingMethodAccessorImpl.java:43)
	at java.lang.reflect.Method.invoke(Method.java:606)
	at org.junit.runners.model.FrameworkMethod$1.runReflectiveCall(FrameworkMethod.java:47)
	at org.junit.internal.runners.model.ReflectiveCallable.run(ReflectiveCallable.java:12)
	at org.junit.runners.model.FrameworkMethod.invokeExplosively(FrameworkMethod.java:44)
	at org.junit.internal.runners.statements.InvokeMethod.evaluate(InvokeMethod.java:17)
	at org.junit.internal.runners.statements.FailOnTimeout$StatementThread.run(FailOnTimeout.java:74)

testTopicOrderWithRestart(org.apache.activemq.bugs.AMQ2149LevelDBTest)  Time elapsed: 243.832
sec  <<< FAILURE!
java.lang.AssertionError: No timeout waiting for senders/receivers to complete
	at org.junit.Assert.fail(Assert.java:88)
	at org.junit.Assert.assertTrue(Assert.java:41)
	at org.apache.activemq.bugs.AMQ2149Test.verifyOrderedMessageReceipt(AMQ2149Test.java:549)
	at org.apache.activemq.bugs.AMQ2149Test.verifyOrderedMessageReceipt(AMQ2149Test.java:501)
	at org.apache.activemq.bugs.AMQ2149Test.testTopicOrderWithRestart(AMQ2149Test.java:402)
	at sun.reflect.NativeMethodAccessorImpl.invoke0(Native Method)
	at sun.reflect.NativeMethodAccessorImpl.invoke(NativeMethodAccessorImpl.java:57)
	at sun.reflect.DelegatingMethodAccessorImpl.invoke(DelegatingMethodAccessorImpl.java:43)
	at java.lang.reflect.Method.invoke(Method.java:606)
	at org.junit.runners.model.FrameworkMethod$1.runReflectiveCall(FrameworkMethod.java:47)
	at org.junit.internal.runners.model.ReflectiveCallable.run(ReflectiveCallable.java:12)
	at org.junit.runners.model.FrameworkMethod.invokeExplosively(FrameworkMethod.java:44)
	at org.junit.internal.runners.statements.InvokeMethod.evaluate(InvokeMethod.java:17)
	at org.junit.internal.runners.statements.FailOnTimeout$StatementThread.run(FailOnTimeout.java:74)

testTopicTransactionalOrderWithRestart(org.apache.activemq.bugs.AMQ2149LevelDBTest)  Time
elapsed: 240.745 sec  <<< FAILURE!
java.lang.AssertionError: No timeout waiting for senders/receivers to complete
	at org.junit.Assert.fail(Assert.java:88)
	at org.junit.Assert.assertTrue(Assert.java:41)
	at org.apache.activemq.bugs.AMQ2149Test.verifyOrderedMessageReceipt(AMQ2149Test.java:549)
	at org.apache.activemq.bugs.AMQ2149Test.doTestTransactionalOrderWithRestart(AMQ2149Test.java:435)
	at org.apache.activemq.bugs.AMQ2149Test.testTopicTransactionalOrderWithRestart(AMQ2149Test.java:417)
	at sun.reflect.NativeMethodAccessorImpl.invoke0(Native Method)
	at sun.reflect.NativeMethodAccessorImpl.invoke(NativeMethodAccessorImpl.java:57)
	at sun.reflect.DelegatingMethodAccessorImpl.invoke(DelegatingMethodAccessorImpl.java:43)
	at java.lang.reflect.Method.invoke(Method.java:606)
	at org.junit.runners.model.FrameworkMethod$1.runReflectiveCall(FrameworkMethod.java:47)
	at org.junit.internal.runners.model.ReflectiveCallable.run(ReflectiveCallable.java:12)
	at org.junit.runners.model.FrameworkMethod.invokeExplosively(FrameworkMethod.java:44)
	at org.junit.internal.runners.statements.InvokeMethod.evaluate(InvokeMethod.java:17)
	at org.junit.internal.runners.statements.FailOnTimeout$StatementThread.run(FailOnTimeout.java:74)

Running org.apache.activemq.bugs.AMQ2383Test
Tests run: 1, Failures: 0, Errors: 0, Skipped: 0, Time elapsed: 0.94 sec - in org.apache.activemq.bugs.AMQ2383Test
Running org.apache.activemq.bugs.AMQ2528Test
Tests run: 1, Failures: 0, Errors: 0, Skipped: 0, Time elapsed: 1.131 sec - in org.apache.activemq.bugs.AMQ2528Test
Running org.apache.activemq.bugs.AMQ2571Test
Tests run: 1, Failures: 0, Errors: 0, Skipped: 0, Time elapsed: 0.916 sec - in org.apache.activemq.bugs.AMQ2571Test
Running org.apache.activemq.bugs.AMQ2585Test
Tests run: 1, Failures: 0, Errors: 0, Skipped: 0, Time elapsed: 1.175 sec - in org.apache.activemq.bugs.AMQ2585Test
Running org.apache.activemq.bugs.AMQ2736Test
Tests run: 1, Failures: 0, Errors: 0, Skipped: 0, Time elapsed: 3.196 sec - in org.apache.activemq.bugs.AMQ2736Test
Running org.apache.activemq.bugs.AMQ2801Test
Tests run: 1, Failures: 0, Errors: 0, Skipped: 0, Time elapsed: 89.626 sec - in org.apache.activemq.bugs.AMQ2801Test
Running org.apache.activemq.bugs.AMQ2902Test
Tests run: 2, Failures: 0, Errors: 0, Skipped: 0, Time elapsed: 1.055 sec - in org.apache.activemq.bugs.AMQ2902Test
Running org.apache.activemq.bugs.AMQ3014Test
Tests run: 2, Failures: 0, Errors: 0, Skipped: 0, Time elapsed: 1.687 sec - in org.apache.activemq.bugs.AMQ3014Test
Running org.apache.activemq.bugs.AMQ3465Test
Tests run: 2, Failures: 0, Errors: 0, Skipped: 0, Time elapsed: 1.091 sec - in org.apache.activemq.bugs.AMQ3465Test
Running org.apache.activemq.bugs.AMQ3537Test
Tests run: 1, Failures: 0, Errors: 0, Skipped: 0, Time elapsed: 0.199 sec - in org.apache.activemq.bugs.AMQ3537Test
Running org.apache.activemq.bugs.AMQ3779Test
Tests run: 1, Failures: 0, Errors: 0, Skipped: 0, Time elapsed: 1.896 sec - in org.apache.activemq.bugs.AMQ3779Test
Running org.apache.activemq.bugs.AMQ3879Test
Tests run: 1, Failures: 0, Errors: 0, Skipped: 0, Time elapsed: 1.511 sec - in org.apache.activemq.bugs.AMQ3879Test
Running org.apache.activemq.bugs.AMQ3903Test
Tests run: 2, Failures: 0, Errors: 0, Skipped: 0, Time elapsed: 0.994 sec - in org.apache.activemq.bugs.AMQ3903Test
Running org.apache.activemq.bugs.AMQ3932Test
Tests run: 3, Failures: 0, Errors: 0, Skipped: 0, Time elapsed: 21.081 sec - in org.apache.activemq.bugs.AMQ3932Test
Running org.apache.activemq.bugs.AMQ3934Test
Tests run: 1, Failures: 0, Errors: 0, Skipped: 0, Time elapsed: 1.174 sec - in org.apache.activemq.bugs.AMQ3934Test
Running org.apache.activemq.bugs.AMQ3961Test
Tests run: 1, Failures: 0, Errors: 0, Skipped: 0, Time elapsed: 5.028 sec - in org.apache.activemq.bugs.AMQ3961Test
Running org.apache.activemq.bugs.AMQ3992Test
Tests run: 1, Failures: 0, Errors: 0, Skipped: 0, Time elapsed: 4.245 sec - in org.apache.activemq.bugs.AMQ3992Test
Running org.apache.activemq.bugs.AMQ4062Test
Tests run: 1, Failures: 0, Errors: 0, Skipped: 0, Time elapsed: 4.412 sec - in org.apache.activemq.bugs.AMQ4062Test
Running org.apache.activemq.bugs.AMQ4083Test
Tests run: 6, Failures: 0, Errors: 0, Skipped: 0, Time elapsed: 55.475 sec - in org.apache.activemq.bugs.AMQ4083Test
Running org.apache.activemq.bugs.AMQ4116Test
Tests run: 2, Failures: 0, Errors: 0, Skipped: 0, Time elapsed: 1.309 sec - in org.apache.activemq.bugs.AMQ4116Test
Running org.apache.activemq.bugs.AMQ4126Test
Tests run: 9, Failures: 0, Errors: 0, Skipped: 0, Time elapsed: 30.402 sec - in org.apache.activemq.bugs.AMQ4126Test
Running org.apache.activemq.bugs.AMQ4133Test
Tests run: 4, Failures: 0, Errors: 0, Skipped: 0, Time elapsed: 16.825 sec - in org.apache.activemq.bugs.AMQ4133Test
Running org.apache.activemq.bugs.AMQ4147Test
Tests run: 2, Failures: 0, Errors: 0, Skipped: 0, Time elapsed: 10.45 sec - in org.apache.activemq.bugs.AMQ4147Test
Running org.apache.activemq.bugs.AMQ4148Test
Tests run: 1, Failures: 0, Errors: 0, Skipped: 0, Time elapsed: 11.214 sec - in org.apache.activemq.bugs.AMQ4148Test
Running org.apache.activemq.bugs.AMQ4157Test
Tests run: 1, Failures: 0, Errors: 0, Skipped: 0, Time elapsed: 8.686 sec - in org.apache.activemq.bugs.AMQ4157Test
Running org.apache.activemq.bugs.AMQ4160Test
Tests run: 3, Failures: 0, Errors: 0, Skipped: 0, Time elapsed: 44.139 sec - in org.apache.activemq.bugs.AMQ4160Test
Running org.apache.activemq.bugs.AMQ4212Test
Tests run: 2, Failures: 0, Errors: 0, Skipped: 0, Time elapsed: 79.022 sec - in org.apache.activemq.bugs.AMQ4212Test
Running org.apache.activemq.bugs.AMQ4213Test
Tests run: 1, Failures: 0, Errors: 0, Skipped: 0, Time elapsed: 1.091 sec - in org.apache.activemq.bugs.AMQ4213Test
Running org.apache.activemq.bugs.AMQ4220Test
Tests run: 1, Failures: 0, Errors: 0, Skipped: 0, Time elapsed: 2.603 sec - in org.apache.activemq.bugs.AMQ4220Test
Running org.apache.activemq.bugs.AMQ4222Test
Tests run: 1, Failures: 0, Errors: 0, Skipped: 0, Time elapsed: 1.135 sec - in org.apache.activemq.bugs.AMQ4222Test
Running org.apache.activemq.bugs.AMQ4323Test

Results :

Failed tests: 
  AMQ2149LevelDBTest>AMQ2149Test.tearDown:132 Teardown timed out
  AMQ2149LevelDBTest>AMQ2149Test.testOrderWithRestart:382->AMQ2149Test.verifyOrderedMessageReceipt:505->AMQ2149Test.verifyOrderedMessageReceipt:549
No timeout waiting for senders/receivers to complete
  AMQ2149LevelDBTest>AMQ2149Test.testTopicOrderWithRestart:402->AMQ2149Test.verifyOrderedMessageReceipt:501->AMQ2149Test.verifyOrderedMessageReceipt:549
No timeout waiting for senders/receivers to complete
  AMQ2149LevelDBTest>AMQ2149Test.testTopicTransactionalOrderWithRestart:417->AMQ2149Test.doTestTransactionalOrderWithRestart:435->AMQ2149Test.verifyOrderedMessageReceipt:549
No timeout waiting for senders/receivers to complete

Tests in error: 
  AMQ2149LevelDBTest>AMQ2149Test.testQueueTransactionalOrderWithRestart:412->AMQ2149Test.doTestTransactionalOrderWithRestart:435->AMQ2149Test.verifyOrderedMessageReceipt:537
? 

Tests run: 1064, Failures: 4, Errors: 1, Skipped: 1

[JENKINS] Recording test results

Mime
View raw message