activemq-commits mailing list archives

Site index · List index
Message view « Date » · « Thread »
Top « Date » · « Thread »
From Apache Jenkins Server <jenk...@builds.apache.org>
Subject Build failed in Jenkins: ActiveMQ-Java7 » ActiveMQ :: Unit Tests #331
Date Tue, 29 Apr 2014 11:16:42 GMT
See <https://builds.apache.org/job/ActiveMQ-Java7/org.apache.activemq$activemq-unit-tests/331/changes>

Changes:

[tabish121] https://issues.apache.org/jira/browse/AMQ-5163

------------------------------------------
[...truncated 205 lines...]
Tests run: 6, Failures: 0, Errors: 0, Skipped: 0, Time elapsed: 1.272 sec - in org.apache.activemq.broker.advisory.AdvisoryBrokerTest
Running org.apache.activemq.broker.advisory.AdvisoryJmxTest
Tests run: 1, Failures: 0, Errors: 0, Skipped: 0, Time elapsed: 1.141 sec - in org.apache.activemq.broker.advisory.AdvisoryJmxTest
Running org.apache.activemq.broker.ft.DbRestartJDBCQueueMasterSlaveLeaseQuiesceTest
Tests run: 4, Failures: 0, Errors: 0, Skipped: 0, Time elapsed: 66.54 sec - in org.apache.activemq.broker.ft.DbRestartJDBCQueueMasterSlaveLeaseQuiesceTest
Running org.apache.activemq.broker.ft.DbRestartJDBCQueueMasterSlaveLeaseTest
Running org.apache.activemq.broker.ft.kahaDbJdbcLeaseQueueMasterSlaveTest
Tests run: 3, Failures: 0, Errors: 0, Skipped: 0, Time elapsed: 26.923 sec - in org.apache.activemq.broker.ft.kahaDbJdbcLeaseQueueMasterSlaveTest
Running org.apache.activemq.broker.ft.mKahaDbQueueMasterSlaveTest
Tests run: 3, Failures: 0, Errors: 0, Skipped: 0, Time elapsed: 41.619 sec - in org.apache.activemq.broker.ft.mKahaDbQueueMasterSlaveTest
Running org.apache.activemq.broker.jmx.BrokerViewSlowStoreStartupTest
Tests run: 1, Failures: 0, Errors: 0, Skipped: 0, Time elapsed: 1.571 sec - in org.apache.activemq.broker.jmx.BrokerViewSlowStoreStartupTest
Running org.apache.activemq.broker.jmx.HealthViewMBeanTest
Tests run: 1, Failures: 0, Errors: 0, Skipped: 0, Time elapsed: 5.556 sec - in org.apache.activemq.broker.jmx.HealthViewMBeanTest
Running org.apache.activemq.broker.jmx.MBeanOperationTimeoutTest
Tests run: 1, Failures: 0, Errors: 0, Skipped: 0, Time elapsed: 26.316 sec - in org.apache.activemq.broker.jmx.MBeanOperationTimeoutTest
Running org.apache.activemq.broker.jmx.TransportConnectorMBeanTest
Tests run: 4, Failures: 0, Errors: 0, Skipped: 0, Time elapsed: 2.023 sec - in org.apache.activemq.broker.jmx.TransportConnectorMBeanTest
Running org.apache.activemq.broker.mLevelDBXARecoveryBrokerTest
Tests run: 17, Failures: 0, Errors: 0, Skipped: 0, Time elapsed: 167.151 sec - in org.apache.activemq.broker.mLevelDBXARecoveryBrokerTest
Running org.apache.activemq.broker.message.security.MessageAuthenticationTest
Tests run: 1, Failures: 0, Errors: 0, Skipped: 0, Time elapsed: 1.117 sec - in org.apache.activemq.broker.message.security.MessageAuthenticationTest
Running org.apache.activemq.broker.partition.SpringPartitionBrokerTest
Tests run: 1, Failures: 0, Errors: 0, Skipped: 0, Time elapsed: 1.882 sec - in org.apache.activemq.broker.partition.SpringPartitionBrokerTest
Running org.apache.activemq.broker.policy.AbortSlowAckConsumer0Test
Tests run: 16, Failures: 0, Errors: 0, Skipped: 0, Time elapsed: 160.578 sec - in org.apache.activemq.broker.policy.AbortSlowAckConsumer0Test
Running org.apache.activemq.broker.policy.AbortSlowAckConsumer1Test
Tests run: 12, Failures: 0, Errors: 0, Skipped: 0, Time elapsed: 81.941 sec - in org.apache.activemq.broker.policy.AbortSlowAckConsumer1Test
Running org.apache.activemq.broker.policy.AbortSlowAckConsumer2Test
Tests run: 2, Failures: 0, Errors: 0, Skipped: 0, Time elapsed: 11.162 sec - in org.apache.activemq.broker.policy.AbortSlowAckConsumer2Test
Running org.apache.activemq.broker.policy.AbortSlowConsumer0Test
Tests run: 10, Failures: 0, Errors: 0, Skipped: 0, Time elapsed: 62.834 sec - in org.apache.activemq.broker.policy.AbortSlowConsumer0Test
Running org.apache.activemq.broker.policy.AbortSlowConsumer1Test
Tests run: 12, Failures: 0, Errors: 0, Skipped: 0, Time elapsed: 81.868 sec - in org.apache.activemq.broker.policy.AbortSlowConsumer1Test
Running org.apache.activemq.broker.policy.AbortSlowConsumer2Test
Tests run: 2, Failures: 0, Errors: 0, Skipped: 0, Time elapsed: 11.162 sec - in org.apache.activemq.broker.policy.AbortSlowConsumer2Test
Running org.apache.activemq.broker.policy.DeadLetterTest
Tests run: 4, Failures: 0, Errors: 0, Skipped: 0, Time elapsed: 82.564 sec - in org.apache.activemq.broker.policy.DeadLetterTest
Running org.apache.activemq.broker.policy.DestinationCursorConfigTest
Tests run: 2, Failures: 0, Errors: 0, Skipped: 0, Time elapsed: 2.079 sec - in org.apache.activemq.broker.policy.DestinationCursorConfigTest
Running org.apache.activemq.broker.policy.DiscardingDeadLetterPolicyTest
Tests run: 4, Failures: 0, Errors: 0, Skipped: 0, Time elapsed: 125.666 sec - in org.apache.activemq.broker.policy.DiscardingDeadLetterPolicyTest
Running org.apache.activemq.broker.policy.IndividualDeadLetterTest
Tests run: 5, Failures: 0, Errors: 0, Skipped: 0, Time elapsed: 114.644 sec - in org.apache.activemq.broker.policy.IndividualDeadLetterTest
Running org.apache.activemq.broker.policy.IndividualDeadLetterViaXmlTest
Tests run: 4, Failures: 0, Errors: 0, Skipped: 0, Time elapsed: 83.995 sec - in org.apache.activemq.broker.policy.IndividualDeadLetterViaXmlTest
Running org.apache.activemq.broker.policy.MessageGroupConfigTest
Tests run: 5, Failures: 0, Errors: 0, Skipped: 0, Time elapsed: 5.222 sec - in org.apache.activemq.broker.policy.MessageGroupConfigTest
Running org.apache.activemq.broker.policy.MessageListenerDeadLetterTest
Tests run: 4, Failures: 0, Errors: 0, Skipped: 0, Time elapsed: 3.712 sec - in org.apache.activemq.broker.policy.MessageListenerDeadLetterTest
Running org.apache.activemq.broker.policy.NoConsumerDeadLetterTest
Tests run: 5, Failures: 0, Errors: 0, Skipped: 0, Time elapsed: 2.405 sec - in org.apache.activemq.broker.policy.NoConsumerDeadLetterTest
Running org.apache.activemq.broker.policy.NoRetryDeadLetterTest
Tests run: 4, Failures: 0, Errors: 0, Skipped: 0, Time elapsed: 1.772 sec - in org.apache.activemq.broker.policy.NoRetryDeadLetterTest
Running org.apache.activemq.broker.policy.PerDurableConsumerDeadLetterTest
Tests run: 4, Failures: 0, Errors: 0, Skipped: 0, Time elapsed: 82.668 sec - in org.apache.activemq.broker.policy.PerDurableConsumerDeadLetterTest
Running org.apache.activemq.broker.policy.PriorityNetworkDispatchPolicyTest
Tests run: 1, Failures: 0, Errors: 0, Skipped: 0, Time elapsed: 0.879 sec - in org.apache.activemq.broker.policy.PriorityNetworkDispatchPolicyTest
Running org.apache.activemq.broker.policy.SecureDLQTest
Tests run: 4, Failures: 0, Errors: 0, Skipped: 0, Time elapsed: 5.536 sec - in org.apache.activemq.broker.policy.SecureDLQTest
Running org.apache.activemq.broker.policy.StrictOrderDispatchPolicyTest
Tests run: 8, Failures: 0, Errors: 0, Skipped: 0, Time elapsed: 5.264 sec - in org.apache.activemq.broker.policy.StrictOrderDispatchPolicyTest
Running org.apache.activemq.broker.region.QueueOptimizedDispatchExceptionTest
Tests run: 1, Failures: 0, Errors: 0, Skipped: 0, Time elapsed: 0.778 sec - in org.apache.activemq.broker.region.QueueOptimizedDispatchExceptionTest
Running org.apache.activemq.broker.region.QueuePurgeTest
Running org.apache.activemq.broker.region.QueueResendDuringShutdownTest
Tests run: 3, Failures: 0, Errors: 0, Skipped: 0, Time elapsed: 10.392 sec - in org.apache.activemq.broker.region.QueueResendDuringShutdownTest
Running org.apache.activemq.broker.region.SubscriptionAddRemoveQueueTest
Tests run: 1, Failures: 0, Errors: 0, Skipped: 0, Time elapsed: 3.631 sec - in org.apache.activemq.broker.region.SubscriptionAddRemoveQueueTest
Running org.apache.activemq.broker.region.cursors.OrderPendingListTest
Tests run: 9, Failures: 0, Errors: 0, Skipped: 0, Time elapsed: 0.289 sec - in org.apache.activemq.broker.region.cursors.OrderPendingListTest
Running org.apache.activemq.broker.region.cursors.PrioritizedPendingListTest
Tests run: 7, Failures: 0, Errors: 0, Skipped: 0, Time elapsed: 0.303 sec - in org.apache.activemq.broker.region.cursors.PrioritizedPendingListTest
Running org.apache.activemq.broker.region.cursors.StoreQueueCursorKahaDBNoDuplicateTest
Tests run: 1, Failures: 0, Errors: 0, Skipped: 0, Time elapsed: 2.366 sec - in org.apache.activemq.broker.region.cursors.StoreQueueCursorKahaDBNoDuplicateTest
Running org.apache.activemq.broker.region.cursors.StoreQueueCursorLevelDBNoDuplicateTest
Tests run: 1, Failures: 0, Errors: 0, Skipped: 0, Time elapsed: 2.54 sec - in org.apache.activemq.broker.region.cursors.StoreQueueCursorLevelDBNoDuplicateTest
Running org.apache.activemq.broker.region.cursors.StoreQueueCursorMemoryNoDuplicateTest
Tests run: 1, Failures: 0, Errors: 0, Skipped: 0, Time elapsed: 0.766 sec - in org.apache.activemq.broker.region.cursors.StoreQueueCursorMemoryNoDuplicateTest
Running org.apache.activemq.broker.region.cursors.StoreQueueCursorNoDuplicateTest
Tests run: 1, Failures: 0, Errors: 0, Skipped: 0, Time elapsed: 2.455 sec - in org.apache.activemq.broker.region.cursors.StoreQueueCursorNoDuplicateTest
Running org.apache.activemq.broker.region.group.MessageGroupHashBucketTest
Tests run: 2, Failures: 0, Errors: 0, Skipped: 0, Time elapsed: 0.062 sec - in org.apache.activemq.broker.region.group.MessageGroupHashBucketTest
Running org.apache.activemq.broker.region.group.MessageGroupMapTest
Tests run: 2, Failures: 0, Errors: 0, Skipped: 0, Time elapsed: 0.062 sec - in org.apache.activemq.broker.region.group.MessageGroupMapTest
Running org.apache.activemq.broker.region.group.MessageGroupTest
Tests run: 3, Failures: 0, Errors: 0, Skipped: 0, Time elapsed: 1.604 sec - in org.apache.activemq.broker.region.group.MessageGroupTest
Running org.apache.activemq.broker.scheduler.JobSchedulerBrokerShutdownTest
Tests run: 1, Failures: 0, Errors: 0, Skipped: 0, Time elapsed: 8.664 sec - in org.apache.activemq.broker.scheduler.JobSchedulerBrokerShutdownTest
Running org.apache.activemq.broker.scheduler.JobSchedulerTxTest
Tests run: 2, Failures: 0, Errors: 0, Skipped: 0, Time elapsed: 16.292 sec - in org.apache.activemq.broker.scheduler.JobSchedulerTxTest
Running org.apache.activemq.broker.scheduler.LostScheduledMessagesTest
Tests run: 2, Failures: 0, Errors: 0, Skipped: 0, Time elapsed: 36.547 sec - in org.apache.activemq.broker.scheduler.LostScheduledMessagesTest
Running org.apache.activemq.broker.util.RedeliveryPluginTest
Tests run: 1, Failures: 0, Errors: 0, Skipped: 0, Time elapsed: 0.506 sec - in org.apache.activemq.broker.util.RedeliveryPluginTest
Running org.apache.activemq.broker.util.TimeStampingBrokerPluginTest
Tests run: 3, Failures: 0, Errors: 0, Skipped: 0, Time elapsed: 3.103 sec - in org.apache.activemq.broker.util.TimeStampingBrokerPluginTest
Running org.apache.activemq.broker.virtual.CompositeQueueTest
Tests run: 1, Failures: 0, Errors: 0, Skipped: 0, Time elapsed: 2.176 sec - in org.apache.activemq.broker.virtual.CompositeQueueTest
Running org.apache.activemq.broker.virtual.DestinationInterceptorDurableSubTest
Tests run: 1, Failures: 0, Errors: 0, Skipped: 0, Time elapsed: 1.955 sec - in org.apache.activemq.broker.virtual.DestinationInterceptorDurableSubTest
Running org.apache.activemq.broker.virtual.MirroredQueueTest
Tests run: 2, Failures: 0, Errors: 0, Skipped: 0, Time elapsed: 2.227 sec - in org.apache.activemq.broker.virtual.MirroredQueueTest
Running org.apache.activemq.broker.virtual.MirroredQueueUsingVirtualTopicQueueTest
Tests run: 2, Failures: 0, Errors: 0, Skipped: 0, Time elapsed: 1.545 sec - in org.apache.activemq.broker.virtual.MirroredQueueUsingVirtualTopicQueueTest
Running org.apache.activemq.broker.virtual.VirtualDestPerfTest
Tests run: 1, Failures: 0, Errors: 0, Skipped: 1, Time elapsed: 0.094 sec - in org.apache.activemq.broker.virtual.VirtualDestPerfTest
Running org.apache.activemq.broker.virtual.VirtualTopicPubSubTest
Tests run: 2, Failures: 0, Errors: 0, Skipped: 0, Time elapsed: 1.456 sec - in org.apache.activemq.broker.virtual.VirtualTopicPubSubTest
Running org.apache.activemq.broker.virtual.VirtualTopicPubSubUsingXBeanTest
Tests run: 2, Failures: 0, Errors: 0, Skipped: 0, Time elapsed: 1.408 sec - in org.apache.activemq.broker.virtual.VirtualTopicPubSubUsingXBeanTest
Running org.apache.activemq.broker.virtual.VirtualTopicSelectorTest
Tests run: 1, Failures: 0, Errors: 0, Skipped: 0, Time elapsed: 1.233 sec - in org.apache.activemq.broker.virtual.VirtualTopicSelectorTest
Running org.apache.activemq.broker.virtual.VirtualTopicsAndDurableSubsTest
Tests run: 25, Failures: 0, Errors: 0, Skipped: 0, Time elapsed: 26.421 sec - in org.apache.activemq.broker.virtual.VirtualTopicsAndDurableSubsTest
Running org.apache.activemq.bugs.AMQ2103Test
Tests run: 2, Failures: 0, Errors: 0, Skipped: 0, Time elapsed: 1.14 sec - in org.apache.activemq.bugs.AMQ2103Test
Running org.apache.activemq.bugs.AMQ2149LevelDBTest
Tests run: 4, Failures: 2, Errors: 0, Skipped: 0, Time elapsed: 763.739 sec <<< FAILURE!
- in org.apache.activemq.bugs.AMQ2149LevelDBTest
testQueueTransactionalOrderWithRestart(org.apache.activemq.bugs.AMQ2149LevelDBTest)  Time
elapsed: 62.575 sec  <<< FAILURE!
java.lang.AssertionError: No exceptions
	at org.junit.Assert.fail(Assert.java:88)
	at org.junit.Assert.assertTrue(Assert.java:41)
	at org.apache.activemq.bugs.AMQ2149Test.verifyOrderedMessageReceipt(AMQ2149Test.java:560)
	at org.apache.activemq.bugs.AMQ2149Test.doTestTransactionalOrderWithRestart(AMQ2149Test.java:435)
	at org.apache.activemq.bugs.AMQ2149Test.testQueueTransactionalOrderWithRestart(AMQ2149Test.java:412)
	at sun.reflect.NativeMethodAccessorImpl.invoke0(Native Method)
	at sun.reflect.NativeMethodAccessorImpl.invoke(NativeMethodAccessorImpl.java:57)
	at sun.reflect.DelegatingMethodAccessorImpl.invoke(DelegatingMethodAccessorImpl.java:43)
	at java.lang.reflect.Method.invoke(Method.java:606)
	at org.junit.runners.model.FrameworkMethod$1.runReflectiveCall(FrameworkMethod.java:47)
	at org.junit.internal.runners.model.ReflectiveCallable.run(ReflectiveCallable.java:12)
	at org.junit.runners.model.FrameworkMethod.invokeExplosively(FrameworkMethod.java:44)
	at org.junit.internal.runners.statements.InvokeMethod.evaluate(InvokeMethod.java:17)
	at org.junit.internal.runners.statements.FailOnTimeout$StatementThread.run(FailOnTimeout.java:74)

testTopicTransactionalOrderWithRestart(org.apache.activemq.bugs.AMQ2149LevelDBTest)  Time
elapsed: 240.701 sec  <<< FAILURE!
java.lang.AssertionError: No timeout waiting for senders/receivers to complete
	at org.junit.Assert.fail(Assert.java:88)
	at org.junit.Assert.assertTrue(Assert.java:41)
	at org.apache.activemq.bugs.AMQ2149Test.verifyOrderedMessageReceipt(AMQ2149Test.java:549)
	at org.apache.activemq.bugs.AMQ2149Test.doTestTransactionalOrderWithRestart(AMQ2149Test.java:435)
	at org.apache.activemq.bugs.AMQ2149Test.testTopicTransactionalOrderWithRestart(AMQ2149Test.java:417)
	at sun.reflect.NativeMethodAccessorImpl.invoke0(Native Method)
	at sun.reflect.NativeMethodAccessorImpl.invoke(NativeMethodAccessorImpl.java:57)
	at sun.reflect.DelegatingMethodAccessorImpl.invoke(DelegatingMethodAccessorImpl.java:43)
	at java.lang.reflect.Method.invoke(Method.java:606)
	at org.junit.runners.model.FrameworkMethod$1.runReflectiveCall(FrameworkMethod.java:47)
	at org.junit.internal.runners.model.ReflectiveCallable.run(ReflectiveCallable.java:12)
	at org.junit.runners.model.FrameworkMethod.invokeExplosively(FrameworkMethod.java:44)
	at org.junit.internal.runners.statements.InvokeMethod.evaluate(InvokeMethod.java:17)
	at org.junit.internal.runners.statements.FailOnTimeout$StatementThread.run(FailOnTimeout.java:74)

Running org.apache.activemq.bugs.AMQ2383Test
Tests run: 1, Failures: 0, Errors: 0, Skipped: 0, Time elapsed: 0.939 sec - in org.apache.activemq.bugs.AMQ2383Test
Running org.apache.activemq.bugs.AMQ2528Test
Tests run: 1, Failures: 0, Errors: 0, Skipped: 0, Time elapsed: 1.215 sec - in org.apache.activemq.bugs.AMQ2528Test
Running org.apache.activemq.bugs.AMQ2571Test
Tests run: 1, Failures: 0, Errors: 0, Skipped: 0, Time elapsed: 0.903 sec - in org.apache.activemq.bugs.AMQ2571Test
Running org.apache.activemq.bugs.AMQ2585Test
Tests run: 1, Failures: 0, Errors: 0, Skipped: 0, Time elapsed: 1.173 sec - in org.apache.activemq.bugs.AMQ2585Test
Running org.apache.activemq.bugs.AMQ2736Test
Tests run: 1, Failures: 0, Errors: 0, Skipped: 0, Time elapsed: 3.221 sec - in org.apache.activemq.bugs.AMQ2736Test
Running org.apache.activemq.bugs.AMQ2801Test
Tests run: 1, Failures: 0, Errors: 0, Skipped: 0, Time elapsed: 77.294 sec - in org.apache.activemq.bugs.AMQ2801Test
Running org.apache.activemq.bugs.AMQ2902Test
Tests run: 2, Failures: 0, Errors: 0, Skipped: 0, Time elapsed: 0.986 sec - in org.apache.activemq.bugs.AMQ2902Test
Running org.apache.activemq.bugs.AMQ3014Test
Tests run: 2, Failures: 0, Errors: 0, Skipped: 0, Time elapsed: 1.595 sec - in org.apache.activemq.bugs.AMQ3014Test
Running org.apache.activemq.bugs.AMQ3465Test
Tests run: 2, Failures: 0, Errors: 0, Skipped: 0, Time elapsed: 1.013 sec - in org.apache.activemq.bugs.AMQ3465Test
Running org.apache.activemq.bugs.AMQ3537Test
Tests run: 1, Failures: 0, Errors: 0, Skipped: 0, Time elapsed: 0.189 sec - in org.apache.activemq.bugs.AMQ3537Test
Running org.apache.activemq.bugs.AMQ3779Test
Tests run: 1, Failures: 0, Errors: 0, Skipped: 0, Time elapsed: 1.895 sec - in org.apache.activemq.bugs.AMQ3779Test
Running org.apache.activemq.bugs.AMQ3879Test
Tests run: 1, Failures: 0, Errors: 0, Skipped: 0, Time elapsed: 1.503 sec - in org.apache.activemq.bugs.AMQ3879Test
Running org.apache.activemq.bugs.AMQ3903Test
Tests run: 2, Failures: 0, Errors: 0, Skipped: 0, Time elapsed: 1.009 sec - in org.apache.activemq.bugs.AMQ3903Test
Running org.apache.activemq.bugs.AMQ3932Test
Tests run: 3, Failures: 0, Errors: 0, Skipped: 0, Time elapsed: 21.026 sec - in org.apache.activemq.bugs.AMQ3932Test
Running org.apache.activemq.bugs.AMQ3934Test
Tests run: 1, Failures: 0, Errors: 0, Skipped: 0, Time elapsed: 1.177 sec - in org.apache.activemq.bugs.AMQ3934Test
Running org.apache.activemq.bugs.AMQ3961Test
Tests run: 1, Failures: 0, Errors: 0, Skipped: 0, Time elapsed: 5.009 sec - in org.apache.activemq.bugs.AMQ3961Test
Running org.apache.activemq.bugs.AMQ3992Test
Tests run: 1, Failures: 0, Errors: 0, Skipped: 0, Time elapsed: 4.318 sec - in org.apache.activemq.bugs.AMQ3992Test
Running org.apache.activemq.bugs.AMQ4062Test
Tests run: 1, Failures: 0, Errors: 0, Skipped: 0, Time elapsed: 7.767 sec - in org.apache.activemq.bugs.AMQ4062Test
Running org.apache.activemq.bugs.AMQ4083Test
Tests run: 6, Failures: 0, Errors: 0, Skipped: 0, Time elapsed: 55.451 sec - in org.apache.activemq.bugs.AMQ4083Test
Running org.apache.activemq.bugs.AMQ4116Test
Tests run: 2, Failures: 0, Errors: 0, Skipped: 0, Time elapsed: 1.356 sec - in org.apache.activemq.bugs.AMQ4116Test
Running org.apache.activemq.bugs.AMQ4126Test
Tests run: 9, Failures: 0, Errors: 0, Skipped: 0, Time elapsed: 29.633 sec - in org.apache.activemq.bugs.AMQ4126Test
Running org.apache.activemq.bugs.AMQ4133Test
Tests run: 4, Failures: 0, Errors: 0, Skipped: 0, Time elapsed: 18.944 sec - in org.apache.activemq.bugs.AMQ4133Test
Running org.apache.activemq.bugs.AMQ4147Test
Tests run: 2, Failures: 0, Errors: 0, Skipped: 0, Time elapsed: 10.432 sec - in org.apache.activemq.bugs.AMQ4147Test
Running org.apache.activemq.bugs.AMQ4148Test
Tests run: 1, Failures: 0, Errors: 0, Skipped: 0, Time elapsed: 11.185 sec - in org.apache.activemq.bugs.AMQ4148Test
Running org.apache.activemq.bugs.AMQ4157Test
Tests run: 1, Failures: 0, Errors: 0, Skipped: 0, Time elapsed: 8.718 sec - in org.apache.activemq.bugs.AMQ4157Test
Running org.apache.activemq.bugs.AMQ4160Test
Tests run: 3, Failures: 0, Errors: 0, Skipped: 0, Time elapsed: 44.112 sec - in org.apache.activemq.bugs.AMQ4160Test
Running org.apache.activemq.bugs.AMQ4212Test
Tests run: 2, Failures: 0, Errors: 0, Skipped: 0, Time elapsed: 78.905 sec - in org.apache.activemq.bugs.AMQ4212Test
Running org.apache.activemq.bugs.AMQ4213Test
Tests run: 1, Failures: 0, Errors: 0, Skipped: 0, Time elapsed: 1.081 sec - in org.apache.activemq.bugs.AMQ4213Test
Running org.apache.activemq.bugs.AMQ4220Test
Tests run: 1, Failures: 0, Errors: 0, Skipped: 0, Time elapsed: 2.841 sec - in org.apache.activemq.bugs.AMQ4220Test
Running org.apache.activemq.bugs.AMQ4222Test
Tests run: 1, Failures: 0, Errors: 0, Skipped: 0, Time elapsed: 1.131 sec - in org.apache.activemq.bugs.AMQ4222Test
Running org.apache.activemq.bugs.AMQ4323Test
Tests run: 1, Failures: 0, Errors: 0, Skipped: 0, Time elapsed: 92.065 sec - in org.apache.activemq.bugs.AMQ4323Test
Running org.apache.activemq.bugs.AMQ4356Test
Tests run: 1, Failures: 0, Errors: 0, Skipped: 0, Time elapsed: 4.803 sec - in org.apache.activemq.bugs.AMQ4356Test
Running org.apache.activemq.bugs.AMQ4361Test
Tests run: 1, Failures: 0, Errors: 0, Skipped: 0, Time elapsed: 4.779 sec - in org.apache.activemq.bugs.AMQ4361Test
Running org.apache.activemq.bugs.AMQ4368Test
Tests run: 1, Failures: 1, Errors: 0, Skipped: 0, Time elapsed: 19.744 sec <<< FAILURE!
- in org.apache.activemq.bugs.AMQ4368Test
testENTMQ220(org.apache.activemq.bugs.AMQ4368Test)  Time elapsed: 19.556 sec  <<<
FAILURE!
java.lang.AssertionError: No messages received on iteration: 2
	at org.junit.Assert.fail(Assert.java:88)
	at org.junit.Assert.assertTrue(Assert.java:41)
	at org.apache.activemq.bugs.AMQ4368Test.testENTMQ220(AMQ4368Test.java:220)

Running org.apache.activemq.bugs.AMQ4407Test
Tests run: 1, Failures: 0, Errors: 0, Skipped: 0, Time elapsed: 5.823 sec - in org.apache.activemq.bugs.AMQ4407Test
Running org.apache.activemq.bugs.AMQ4413Test
Tests run: 1, Failures: 0, Errors: 0, Skipped: 0, Time elapsed: 6.048 sec - in org.apache.activemq.bugs.AMQ4413Test
Running org.apache.activemq.bugs.AMQ4469Test
Tests run: 1, Failures: 0, Errors: 0, Skipped: 0, Time elapsed: 5.926 sec - in org.apache.activemq.bugs.AMQ4469Test
Running org.apache.activemq.bugs.AMQ4472Test
Tests run: 1, Failures: 0, Errors: 0, Skipped: 0, Time elapsed: 2.474 sec - in org.apache.activemq.bugs.AMQ4472Test
Running org.apache.activemq.bugs.AMQ4475Test
Tests run: 1, Failures: 0, Errors: 0, Skipped: 0, Time elapsed: 4.771 sec - in org.apache.activemq.bugs.AMQ4475Test
Running org.apache.activemq.bugs.AMQ4485NetworkOfXBrokersWithNDestsFanoutTransactionTest

Results :

Failed tests: 
  AMQ2149LevelDBTest>AMQ2149Test.testQueueTransactionalOrderWithRestart:412->AMQ2149Test.doTestTransactionalOrderWithRestart:435->AMQ2149Test.verifyOrderedMessageReceipt:560
No exceptions
  AMQ2149LevelDBTest>AMQ2149Test.testTopicTransactionalOrderWithRestart:417->AMQ2149Test.doTestTransactionalOrderWithRestart:435->AMQ2149Test.verifyOrderedMessageReceipt:549
No timeout waiting for senders/receivers to complete
  AMQ4368Test.testENTMQ220:220 No messages received on iteration: 2

Tests run: 1071, Failures: 3, Errors: 0, Skipped: 1

[JENKINS] Recording test results

Mime
View raw message