activemq-commits mailing list archives

Site index · List index
Message view « Date » · « Thread »
Top « Date » · « Thread »
From Apache Jenkins Server <jenk...@builds.apache.org>
Subject Build failed in Jenkins: ActiveMQ-Java7 » ActiveMQ :: Unit Tests #311
Date Mon, 07 Apr 2014 07:23:12 GMT
See <https://builds.apache.org/job/ActiveMQ-Java7/org.apache.activemq$activemq-unit-tests/311/>

------------------------------------------
[...truncated 450 lines...]
java.lang.AssertionError: No messages received on iteration: 5
	at org.junit.Assert.fail(Assert.java:88)
	at org.junit.Assert.assertTrue(Assert.java:41)
	at org.apache.activemq.bugs.AMQ4368Test.testENTMQ220(AMQ4368Test.java:220)

Running org.apache.activemq.bugs.AMQ4407Test
Tests run: 1, Failures: 0, Errors: 0, Skipped: 0, Time elapsed: 5.568 sec - in org.apache.activemq.bugs.AMQ4407Test
Running org.apache.activemq.bugs.AMQ4413Test
Tests run: 1, Failures: 0, Errors: 0, Skipped: 0, Time elapsed: 5.621 sec - in org.apache.activemq.bugs.AMQ4413Test
Running org.apache.activemq.bugs.AMQ4469Test
Tests run: 1, Failures: 0, Errors: 0, Skipped: 0, Time elapsed: 5.906 sec - in org.apache.activemq.bugs.AMQ4469Test
Running org.apache.activemq.bugs.AMQ4472Test
Tests run: 1, Failures: 0, Errors: 0, Skipped: 0, Time elapsed: 2.237 sec - in org.apache.activemq.bugs.AMQ4472Test
Running org.apache.activemq.bugs.AMQ4475Test
Tests run: 1, Failures: 0, Errors: 0, Skipped: 0, Time elapsed: 4.512 sec - in org.apache.activemq.bugs.AMQ4475Test
Running org.apache.activemq.bugs.AMQ4485NetworkOfXBrokersWithNDestsFanoutTransactionTest
Tests run: 1, Failures: 0, Errors: 0, Skipped: 0, Time elapsed: 306.31 sec - in org.apache.activemq.bugs.AMQ4485NetworkOfXBrokersWithNDestsFanoutTransactionTest
Running org.apache.activemq.bugs.AMQ4485Test
Tests run: 1, Failures: 0, Errors: 0, Skipped: 0, Time elapsed: 11.455 sec - in org.apache.activemq.bugs.AMQ4485Test
Running org.apache.activemq.bugs.AMQ4487Test
Tests run: 2, Failures: 0, Errors: 0, Skipped: 0, Time elapsed: 28.059 sec - in org.apache.activemq.bugs.AMQ4487Test
Running org.apache.activemq.bugs.AMQ4504Test
Tests run: 1, Failures: 0, Errors: 0, Skipped: 0, Time elapsed: 2.479 sec - in org.apache.activemq.bugs.AMQ4504Test
Running org.apache.activemq.bugs.AMQ4513Test
Tests run: 1, Failures: 0, Errors: 0, Skipped: 0, Time elapsed: 24.855 sec - in org.apache.activemq.bugs.AMQ4513Test
Running org.apache.activemq.bugs.AMQ4517Test
Tests run: 1, Failures: 0, Errors: 0, Skipped: 0, Time elapsed: 1.695 sec - in org.apache.activemq.bugs.AMQ4517Test
Running org.apache.activemq.bugs.AMQ4518Test
Tests run: 1, Failures: 0, Errors: 0, Skipped: 0, Time elapsed: 1.724 sec - in org.apache.activemq.bugs.AMQ4518Test
Running org.apache.activemq.bugs.AMQ4530Test
Tests run: 1, Failures: 0, Errors: 0, Skipped: 0, Time elapsed: 1.158 sec - in org.apache.activemq.bugs.AMQ4530Test
Running org.apache.activemq.bugs.AMQ4531Test
Tests run: 1, Failures: 0, Errors: 0, Skipped: 0, Time elapsed: 1.127 sec - in org.apache.activemq.bugs.AMQ4531Test
Running org.apache.activemq.bugs.AMQ4554Test
Tests run: 1, Failures: 0, Errors: 0, Skipped: 0, Time elapsed: 1.125 sec - in org.apache.activemq.bugs.AMQ4554Test
Running org.apache.activemq.bugs.AMQ4582Test
Tests run: 1, Failures: 0, Errors: 0, Skipped: 0, Time elapsed: 1.175 sec - in org.apache.activemq.bugs.AMQ4582Test
Running org.apache.activemq.bugs.AMQ4595Test
Tests run: 3, Failures: 0, Errors: 0, Skipped: 0, Time elapsed: 99.522 sec - in org.apache.activemq.bugs.AMQ4595Test
Running org.apache.activemq.bugs.AMQ4636Test
Tests run: 3, Failures: 0, Errors: 0, Skipped: 0, Time elapsed: 44.571 sec - in org.apache.activemq.bugs.AMQ4636Test
Running org.apache.activemq.bugs.AMQ4656Test
Tests run: 2, Failures: 0, Errors: 0, Skipped: 0, Time elapsed: 7.314 sec - in org.apache.activemq.bugs.AMQ4656Test
Running org.apache.activemq.bugs.AMQ4671Test
Tests run: 1, Failures: 0, Errors: 0, Skipped: 0, Time elapsed: 1.069 sec - in org.apache.activemq.bugs.AMQ4671Test
Running org.apache.activemq.bugs.AMQ4853Test
Tests run: 3, Failures: 0, Errors: 0, Skipped: 2, Time elapsed: 0.851 sec - in org.apache.activemq.bugs.AMQ4853Test
Running org.apache.activemq.bugs.AMQ4887Test
Tests run: 4, Failures: 0, Errors: 0, Skipped: 0, Time elapsed: 3.987 sec - in org.apache.activemq.bugs.AMQ4887Test
Running org.apache.activemq.bugs.AMQ4893Test
Tests run: 4, Failures: 0, Errors: 0, Skipped: 0, Time elapsed: 0.239 sec - in org.apache.activemq.bugs.AMQ4893Test
Running org.apache.activemq.bugs.AMQ4899Test
Tests run: 1, Failures: 0, Errors: 0, Skipped: 0, Time elapsed: 6.492 sec - in org.apache.activemq.bugs.AMQ4899Test
Running org.apache.activemq.bugs.AMQ4930Test
Tests run: 2, Failures: 0, Errors: 0, Skipped: 0, Time elapsed: 31.02 sec - in org.apache.activemq.bugs.AMQ4930Test
Running org.apache.activemq.bugs.AMQ4950Test
Tests run: 1, Failures: 0, Errors: 0, Skipped: 0, Time elapsed: 2.16 sec - in org.apache.activemq.bugs.AMQ4950Test
Running org.apache.activemq.bugs.AMQ4952Test
Tests run: 2, Failures: 0, Errors: 0, Skipped: 0, Time elapsed: 77.27 sec - in org.apache.activemq.bugs.AMQ4952Test
Running org.apache.activemq.bugs.AMQ5035Test
Tests run: 1, Failures: 0, Errors: 0, Skipped: 0, Time elapsed: 3.926 sec - in org.apache.activemq.bugs.AMQ5035Test
Running org.apache.activemq.bugs.MemoryUsageBrokerTest
Tests run: 1, Failures: 0, Errors: 0, Skipped: 0, Time elapsed: 137.433 sec - in org.apache.activemq.bugs.MemoryUsageBrokerTest
Running org.apache.activemq.bugs.OptimizeAcknowledgeWithExpiredMsgsTest
Tests run: 3, Failures: 0, Errors: 0, Skipped: 0, Time elapsed: 3.491 sec - in org.apache.activemq.bugs.OptimizeAcknowledgeWithExpiredMsgsTest
Running org.apache.activemq.bugs.RedeliveryPluginHeaderTest
Tests run: 1, Failures: 0, Errors: 0, Skipped: 0, Time elapsed: 8.059 sec - in org.apache.activemq.bugs.RedeliveryPluginHeaderTest
Running org.apache.activemq.bugs.SparseAckReplayAfterStoreCleanupLevelDBStoreTest
Tests run: 2, Failures: 0, Errors: 0, Skipped: 0, Time elapsed: 12.776 sec - in org.apache.activemq.bugs.SparseAckReplayAfterStoreCleanupLevelDBStoreTest
Running org.apache.activemq.bugs.TempQueueDeleteOnCloseTest
Tests run: 1, Failures: 0, Errors: 0, Skipped: 0, Time elapsed: 2.149 sec - in org.apache.activemq.bugs.TempQueueDeleteOnCloseTest
Running org.apache.activemq.bugs.TempStorageConfigBrokerTest
Tests run: 2, Failures: 0, Errors: 0, Skipped: 2, Time elapsed: 0.089 sec - in org.apache.activemq.bugs.TempStorageConfigBrokerTest
Running org.apache.activemq.bugs.TransactedStoreUsageSuspendResumeTest
Tests run: 1, Failures: 1, Errors: 0, Skipped: 0, Time elapsed: 422.163 sec <<< FAILURE!
- in org.apache.activemq.bugs.TransactedStoreUsageSuspendResumeTest
testTransactedStoreUsageSuspendResume(org.apache.activemq.bugs.TransactedStoreUsageSuspendResumeTest)
 Time elapsed: 421.989 sec  <<< FAILURE!
java.lang.AssertionError: Got all messages: java.util.concurrent.CountDownLatch@15807eb[Count
= 9919]
	at org.junit.Assert.fail(Assert.java:88)
	at org.junit.Assert.assertTrue(Assert.java:41)
	at org.apache.activemq.bugs.TransactedStoreUsageSuspendResumeTest.testTransactedStoreUsageSuspendResume(TransactedStoreUsageSuspendResumeTest.java:143)

Running org.apache.activemq.bugs.TrapMessageInJDBCStoreTest
Tests run: 1, Failures: 0, Errors: 0, Skipped: 0, Time elapsed: 24.115 sec - in org.apache.activemq.bugs.TrapMessageInJDBCStoreTest
Running org.apache.activemq.command.ActiveMQBytesMessageTest
Tests run: 19, Failures: 0, Errors: 0, Skipped: 0, Time elapsed: 0.094 sec - in org.apache.activemq.command.ActiveMQBytesMessageTest
Running org.apache.activemq.command.ActiveMQDestinationTest
Tests run: 12, Failures: 0, Errors: 0, Skipped: 0, Time elapsed: 0.213 sec - in org.apache.activemq.command.ActiveMQDestinationTest
Running org.apache.activemq.command.ActiveMQMapMessageTest
Tests run: 17, Failures: 0, Errors: 0, Skipped: 0, Time elapsed: 0.349 sec - in org.apache.activemq.command.ActiveMQMapMessageTest
Running org.apache.activemq.command.ActiveMQMessageTest
Tests run: 50, Failures: 0, Errors: 0, Skipped: 0, Time elapsed: 0.304 sec - in org.apache.activemq.command.ActiveMQMessageTest
Running org.apache.activemq.command.ActiveMQObjectMessageTest
Tests run: 5, Failures: 0, Errors: 0, Skipped: 0, Time elapsed: 0.18 sec - in org.apache.activemq.command.ActiveMQObjectMessageTest
Running org.apache.activemq.command.ActiveMQStreamMessageTest
Tests run: 18, Failures: 0, Errors: 0, Skipped: 0, Time elapsed: 0.486 sec - in org.apache.activemq.command.ActiveMQStreamMessageTest
Running org.apache.activemq.command.ActiveMQTextMessageTest
Tests run: 9, Failures: 0, Errors: 0, Skipped: 0, Time elapsed: 0.189 sec - in org.apache.activemq.command.ActiveMQTextMessageTest
Running org.apache.activemq.command.MessageSendTest
Tests run: 2, Failures: 0, Errors: 0, Skipped: 0, Time elapsed: 0.257 sec - in org.apache.activemq.command.MessageSendTest
Running org.apache.activemq.command.MessageTest
Tests run: 7, Failures: 0, Errors: 0, Skipped: 0, Time elapsed: 0.275 sec - in org.apache.activemq.command.MessageTest
Running org.apache.activemq.config.BrokerPropertiesTest
Tests run: 2, Failures: 0, Errors: 0, Skipped: 0, Time elapsed: 0.798 sec - in org.apache.activemq.config.BrokerPropertiesTest
Running org.apache.activemq.config.BrokerXmlConfigTest
Tests run: 1, Failures: 0, Errors: 0, Skipped: 0, Time elapsed: 3.895 sec - in org.apache.activemq.config.BrokerXmlConfigTest
Running org.apache.activemq.config.JDBCConfigTest
Tests run: 1, Failures: 0, Errors: 0, Skipped: 0, Time elapsed: 13.746 sec - in org.apache.activemq.config.JDBCConfigTest
Running org.apache.activemq.console.command.AMQ3410Test
Tests run: 5, Failures: 0, Errors: 0, Skipped: 0, Time elapsed: 33.838 sec - in org.apache.activemq.console.command.AMQ3410Test
Running org.apache.activemq.console.command.AMQ3411Test
Tests run: 5, Failures: 0, Errors: 0, Skipped: 0, Time elapsed: 21.984 sec - in org.apache.activemq.console.command.AMQ3411Test
Running org.apache.activemq.console.command.PurgeCommandTest
Tests run: 6, Failures: 0, Errors: 0, Skipped: 0, Time elapsed: 23.063 sec - in org.apache.activemq.console.command.PurgeCommandTest
Running org.apache.activemq.conversions.AmqpAndMqttTest
Tests run: 1, Failures: 0, Errors: 0, Skipped: 0, Time elapsed: 1.538 sec - in org.apache.activemq.conversions.AmqpAndMqttTest
Running org.apache.activemq.filter.DestinationFilterTest
Tests run: 5, Failures: 0, Errors: 0, Skipped: 0, Time elapsed: 0.074 sec - in org.apache.activemq.filter.DestinationFilterTest
Running org.apache.activemq.filter.DestinationMapMemoryTest
Tests run: 2, Failures: 0, Errors: 0, Skipped: 0, Time elapsed: 0.106 sec - in org.apache.activemq.filter.DestinationMapMemoryTest
Running org.apache.activemq.filter.DestinationMapTempDestinationTest
Tests run: 1, Failures: 0, Errors: 0, Skipped: 0, Time elapsed: 0.334 sec - in org.apache.activemq.filter.DestinationMapTempDestinationTest
Running org.apache.activemq.filter.DestinationMapTest
Tests run: 16, Failures: 0, Errors: 0, Skipped: 0, Time elapsed: 0.092 sec - in org.apache.activemq.filter.DestinationMapTest
Running org.apache.activemq.filter.DestinationPathTest
Tests run: 1, Failures: 0, Errors: 0, Skipped: 0, Time elapsed: 0.159 sec - in org.apache.activemq.filter.DestinationPathTest
Running org.apache.activemq.filter.DummyPolicyTest
Tests run: 1, Failures: 0, Errors: 0, Skipped: 0, Time elapsed: 0.534 sec - in org.apache.activemq.filter.DummyPolicyTest
Running org.apache.activemq.jmx.JmxCreateNCTest
Tests run: 1, Failures: 0, Errors: 0, Skipped: 0, Time elapsed: 1.513 sec - in org.apache.activemq.jmx.JmxCreateNCTest
Running org.apache.activemq.jmx.OpenTypeSupportTest
Tests run: 2, Failures: 0, Errors: 0, Skipped: 0, Time elapsed: 1.245 sec - in org.apache.activemq.jmx.OpenTypeSupportTest
Running org.apache.activemq.jndi.ActiveMQInitialContextFactoryTest
Tests run: 3, Failures: 0, Errors: 0, Skipped: 0, Time elapsed: 0.235 sec - in org.apache.activemq.jndi.ActiveMQInitialContextFactoryTest
Running org.apache.activemq.jndi.ActiveMQWASInitialContextFactoryTest
Tests run: 1, Failures: 0, Errors: 0, Skipped: 0, Time elapsed: 0.225 sec - in org.apache.activemq.jndi.ActiveMQWASInitialContextFactoryTest
Running org.apache.activemq.jndi.CustomConnectionFactoryNameTest
Tests run: 4, Failures: 0, Errors: 0, Skipped: 0, Time elapsed: 0.248 sec - in org.apache.activemq.jndi.CustomConnectionFactoryNameTest
Running org.apache.activemq.jndi.DestinationNameWithSlashTest
Tests run: 1, Failures: 0, Errors: 0, Skipped: 0, Time elapsed: 0.232 sec - in org.apache.activemq.jndi.DestinationNameWithSlashTest
Running org.apache.activemq.jndi.InitialContextTest
Tests run: 4, Failures: 0, Errors: 0, Skipped: 0, Time elapsed: 0.265 sec - in org.apache.activemq.jndi.InitialContextTest
Running org.apache.activemq.jndi.ObjectFactoryTest
Tests run: 2, Failures: 0, Errors: 0, Skipped: 0, Time elapsed: 0.217 sec - in org.apache.activemq.jndi.ObjectFactoryTest
Running org.apache.activemq.jndi.XAConnectionFactoryTest
Tests run: 4, Failures: 0, Errors: 0, Skipped: 0, Time elapsed: 0.24 sec - in org.apache.activemq.jndi.XAConnectionFactoryTest
Running org.apache.activemq.joramtests.JoramJmsTest
Tests run: 196, Failures: 0, Errors: 0, Skipped: 0, Time elapsed: 17.669 sec - in org.apache.activemq.joramtests.JoramJmsTest
Running org.apache.activemq.leveldb.LevelDBStoreBrokerTest
Tests run: 129, Failures: 0, Errors: 0, Skipped: 0, Time elapsed: 134.868 sec - in org.apache.activemq.leveldb.LevelDBStoreBrokerTest
Running org.apache.activemq.management.BoundaryStatisticTest
Tests run: 1, Failures: 0, Errors: 0, Skipped: 0, Time elapsed: 0.184 sec - in org.apache.activemq.management.BoundaryStatisticTest
Running org.apache.activemq.management.BoundedRangeStatisticTest
Tests run: 1, Failures: 0, Errors: 0, Skipped: 0, Time elapsed: 0.659 sec - in org.apache.activemq.management.BoundedRangeStatisticTest
Running org.apache.activemq.management.CountStatisticTest
Tests run: 1, Failures: 0, Errors: 0, Skipped: 0, Time elapsed: 0.659 sec - in org.apache.activemq.management.CountStatisticTest
Running org.apache.activemq.management.RangeStatisticTest
Tests run: 1, Failures: 0, Errors: 0, Skipped: 0, Time elapsed: 0.66 sec - in org.apache.activemq.management.RangeStatisticTest
Running org.apache.activemq.management.TimeStatisticTest
Tests run: 1, Failures: 0, Errors: 0, Skipped: 0, Time elapsed: 0.659 sec - in org.apache.activemq.management.TimeStatisticTest
Running org.apache.activemq.memory.MemoryPropertyTest
Tests run: 1, Failures: 0, Errors: 0, Skipped: 0, Time elapsed: 1.995 sec - in org.apache.activemq.memory.MemoryPropertyTest
Running org.apache.activemq.memory.buffer.OrderBasedMemoryBufferTest
Tests run: 1, Failures: 0, Errors: 0, Skipped: 0, Time elapsed: 0.174 sec - in org.apache.activemq.memory.buffer.OrderBasedMemoryBufferTest
Running org.apache.activemq.memory.buffer.SizeBasedMessageBufferTest
Tests run: 1, Failures: 0, Errors: 0, Skipped: 0, Time elapsed: 0.175 sec - in org.apache.activemq.memory.buffer.SizeBasedMessageBufferTest
Running org.apache.activemq.network.CheckDuplicateMessagesOnDuplexTest
Tests run: 1, Failures: 0, Errors: 0, Skipped: 0, Time elapsed: 13.152 sec - in org.apache.activemq.network.CheckDuplicateMessagesOnDuplexTest
Running org.apache.activemq.network.CompressionOverNetworkTest
Tests run: 6, Failures: 0, Errors: 0, Skipped: 0, Time elapsed: 24.792 sec - in org.apache.activemq.network.CompressionOverNetworkTest
Running org.apache.activemq.network.DemandForwardingBridgeTest
Tests run: 6, Failures: 0, Errors: 0, Skipped: 0, Time elapsed: 5.071 sec - in org.apache.activemq.network.DemandForwardingBridgeTest
Running org.apache.activemq.network.DynamicallyIncludedDestinationsDuplexNetworkTest
Tests run: 7, Failures: 0, Errors: 0, Skipped: 0, Time elapsed: 35.9 sec - in org.apache.activemq.network.DynamicallyIncludedDestinationsDuplexNetworkTest
Running org.apache.activemq.network.ForwardingBridgeTest
Tests run: 8, Failures: 0, Errors: 0, Skipped: 0, Time elapsed: 17.045 sec - in org.apache.activemq.network.ForwardingBridgeTest
Running org.apache.activemq.network.NetworkDestinationFilterTest
Tests run: 1, Failures: 0, Errors: 0, Skipped: 0, Time elapsed: 0.163 sec - in org.apache.activemq.network.NetworkDestinationFilterTest
Running org.apache.activemq.network.NetworkLoopBackTest
Tests run: 1, Failures: 0, Errors: 0, Skipped: 0, Time elapsed: 4.05 sec - in org.apache.activemq.network.NetworkLoopBackTest
Running org.apache.activemq.network.NetworkRouteTest
Tests run: 3, Failures: 0, Errors: 0, Skipped: 0, Time elapsed: 0.968 sec - in org.apache.activemq.network.NetworkRouteTest
Running org.apache.activemq.openwire.BooleanStreamTest
Tests run: 4, Failures: 0, Errors: 0, Skipped: 0, Time elapsed: 1.397 sec - in org.apache.activemq.openwire.BooleanStreamTest
Running org.apache.activemq.openwire.ItStillMarshallsTheSameTest
Tests run: 1, Failures: 0, Errors: 0, Skipped: 0, Time elapsed: 0.212 sec - in org.apache.activemq.openwire.ItStillMarshallsTheSameTest
Running org.apache.activemq.openwire.NumberRangesWhileMarshallingTest
Tests run: 3, Failures: 0, Errors: 0, Skipped: 0, Time elapsed: 0.257 sec - in org.apache.activemq.openwire.NumberRangesWhileMarshallingTest
Running org.apache.activemq.pool.JmsSendReceiveTwoConnectionsWithSenderUsingPoolTest
Tests run: 1, Failures: 0, Errors: 0, Skipped: 0, Time elapsed: 2.198 sec - in org.apache.activemq.pool.JmsSendReceiveTwoConnectionsWithSenderUsingPoolTest
Running org.apache.activemq.proxy.AMQ4889Test
Tests run: 1, Failures: 0, Errors: 0, Skipped: 0, Time elapsed: 2.029 sec - in org.apache.activemq.proxy.AMQ4889Test
Running org.apache.activemq.security.AuthorizationMapTest
Tests run: 4, Failures: 0, Errors: 0, Skipped: 0, Time elapsed: 0.079 sec - in org.apache.activemq.security.AuthorizationMapTest
Running org.apache.activemq.security.CachedLDAPAuthorizationModuleLegacyOpenLDAPTest
Tests run: 1, Failures: 0, Errors: 0, Skipped: 1, Time elapsed: 0.035 sec - in org.apache.activemq.security.CachedLDAPAuthorizationModuleLegacyOpenLDAPTest
Running org.apache.activemq.security.CachedLDAPAuthorizationModuleLegacyTest
Tests run: 12, Failures: 0, Errors: 0, Skipped: 0, Time elapsed: 42.979 sec - in org.apache.activemq.security.CachedLDAPAuthorizationModuleLegacyTest
Running org.apache.activemq.security.CachedLDAPAuthorizationModuleOpenLDAPTest
Tests run: 1, Failures: 0, Errors: 0, Skipped: 1, Time elapsed: 0.035 sec - in org.apache.activemq.security.CachedLDAPAuthorizationModuleOpenLDAPTest
Running org.apache.activemq.security.CachedLDAPAuthorizationModuleTest
Tests run: 12, Failures: 0, Errors: 0, Skipped: 0, Time elapsed: 35.733 sec - in org.apache.activemq.security.CachedLDAPAuthorizationModuleTest
Running org.apache.activemq.security.CachedLDAPSecurityLegacyTest
Tests run: 4, Failures: 0, Errors: 0, Skipped: 0, Time elapsed: 7.566 sec - in org.apache.activemq.security.CachedLDAPSecurityLegacyTest
Running org.apache.activemq.security.CachedLDAPSecurityTest
Tests run: 4, Failures: 0, Errors: 0, Skipped: 0, Time elapsed: 7.455 sec - in org.apache.activemq.security.CachedLDAPSecurityTest
Running org.apache.activemq.security.JaasCertificateAuthenticationBrokerTest
Tests run: 3, Failures: 0, Errors: 0, Skipped: 0, Time elapsed: 0.124 sec - in org.apache.activemq.security.JaasCertificateAuthenticationBrokerTest
Running org.apache.activemq.security.JaasDualAuthenticationBrokerTest
Tests run: 2, Failures: 0, Errors: 0, Skipped: 0, Time elapsed: 0.23 sec - in org.apache.activemq.security.JaasDualAuthenticationBrokerTest
Running org.apache.activemq.security.LDAPAuthorizationMapTest
Tests run: 7, Failures: 0, Errors: 0, Skipped: 0, Time elapsed: 4.656 sec - in org.apache.activemq.security.LDAPAuthorizationMapTest
Running org.apache.activemq.security.SimpleAnonymousPluginTest
Tests run: 45, Failures: 0, Errors: 0, Skipped: 0, Time elapsed: 28.114 sec - in org.apache.activemq.security.SimpleAnonymousPluginTest
Running org.apache.activemq.security.SimpleAuthenticationPluginSeparatorTest
Tests run: 29, Failures: 0, Errors: 0, Skipped: 0, Time elapsed: 18.103 sec - in org.apache.activemq.security.SimpleAuthenticationPluginSeparatorTest
Running org.apache.activemq.security.SimpleAuthenticationPluginTest
Tests run: 33, Failures: 0, Errors: 0, Skipped: 0, Time elapsed: 20.495 sec - in org.apache.activemq.security.SimpleAuthenticationPluginTest
Running org.apache.activemq.security.SimpleAuthorizationMapTest
Tests run: 4, Failures: 0, Errors: 0, Skipped: 0, Time elapsed: 0.177 sec - in org.apache.activemq.security.SimpleAuthorizationMapTest
Running org.apache.activemq.security.SimpleSecurityBrokerSystemTest
Tests run: 60, Failures: 0, Errors: 0, Skipped: 0, Time elapsed: 19.231 sec - in org.apache.activemq.security.SimpleSecurityBrokerSystemTest
Running org.apache.activemq.security.XBeanSecurityTest
Tests run: 29, Failures: 0, Errors: 0, Skipped: 0, Time elapsed: 14.138 sec - in org.apache.activemq.security.XBeanSecurityTest
Running org.apache.activemq.security.XBeanSecurityWithGuestTest
Tests run: 7, Failures: 0, Errors: 0, Skipped: 0, Time elapsed: 3.882 sec - in org.apache.activemq.security.XBeanSecurityWithGuestTest
Running org.apache.activemq.selector.SelectorParserTest
Tests run: 3, Failures: 0, Errors: 0, Skipped: 0, Time elapsed: 0.328 sec - in org.apache.activemq.selector.SelectorParserTest
Running org.apache.activemq.selector.SelectorTest
Tests run: 21, Failures: 0, Errors: 0, Skipped: 0, Time elapsed: 0.498 sec - in org.apache.activemq.selector.SelectorTest
Running org.apache.activemq.spring.ActiveMQConnectionFactoryFactoryBeanTest
Tests run: 6, Failures: 0, Errors: 0, Skipped: 0, Time elapsed: 0.201 sec - in org.apache.activemq.spring.ActiveMQConnectionFactoryFactoryBeanTest
Running org.apache.activemq.spring.SpringTest
Tests run: 7, Failures: 0, Errors: 0, Skipped: 0, Time elapsed: 15.561 sec - in org.apache.activemq.spring.SpringTest
Running org.apache.activemq.store.LevelDBStorePerDestinationTest

[JENKINS] Recording test resultsResults :


Failed tests: 
  AMQ4351Test>CombinationTestSupport.runBare:107->testAMQ4351:248 null
  BrokerRedeliveryTest>CombinationTestSupport.runBare:113->CombinationTestSupport.runBare:107->testInfiniteRedelivery:53->doTestScheduledRedelivery:98
got message
  BrokerRedeliveryTest>CombinationTestSupport.runBare:113->CombinationTestSupport.runBare:107->testScheduledRedelivery:47->doTestScheduledRedelivery:76
did not get message after redelivery count exceeded: ActiveMQMessage {commandId = 5, responseRequired
= true, messageId = ID:quirinus.apache.org-40414-1396848750302-7:1:1:1:1, originalDestination
= null, originalTransactionId = null, producerId = ID:quirinus.apache.org-40414-1396848750302-7:1:1:1,
destination = queue://Redelivery, transactionId = null, expiration = 0, timestamp = 1396848791532,
arrival = 0, brokerInTime = 1396848791532, brokerOutTime = 1396848791764, correlationId =
null, replyTo = null, persistent = true, type = null, priority = 4, groupID = null, groupSequence
= 0, targetConsumerId = null, compressed = false, userID = null, content = null, marshalledProperties
= org.apache.activemq.util.ByteSequence@1a9fb0f, dataStructure = null, redeliveryCounter =
0, size = 1024, properties = {data=hi}, readOnlyProperties = true, readOnlyBody = true, droppable
= false, jmsXGroupFirstForConsumer = false}
  AMQ2149LevelDBTest>AMQ2149Test.testQueueTransactionalOrderWithRestart:412->AMQ2149Test.doTestTransactionalOrderWithRestart:435->AMQ2149Test.verifyOrderedMessageReceipt:560
No exceptions
  AMQ2149LevelDBTest>AMQ2149Test.testTopicTransactionalOrderWithRestart:417->AMQ2149Test.doTestTransactionalOrderWithRestart:435->AMQ2149Test.verifyOrderedMessageReceipt:549
No timeout waiting for senders/receivers to complete
  AMQ4368Test.testENTMQ220:220 No messages received on iteration: 5
  TransactedStoreUsageSuspendResumeTest.testTransactedStoreUsageSuspendResume:143 Got all
messages: java.util.concurrent.CountDownLatch@15807eb[Count = 9919]

Tests run: 1996, Failures: 7, Errors: 0, Skipped: 6


Mime
View raw message