activemq-commits mailing list archives

Site index · List index
Message view « Date » · « Thread »
Top « Date » · « Thread »
From Apache Jenkins Server <jenk...@builds.apache.org>
Subject Build failed in Jenkins: ActiveMQ-Java7 » ActiveMQ :: Unit Tests #320
Date Wed, 16 Apr 2014 10:13:51 GMT
See <https://builds.apache.org/job/ActiveMQ-Java7/org.apache.activemq$activemq-unit-tests/320/>

------------------------------------------
[...truncated 484 lines...]
Tests run: 1, Failures: 0, Errors: 0, Skipped: 0, Time elapsed: 1.429 sec - in org.apache.activemq.bugs.AMQ4582Test
Running org.apache.activemq.bugs.AMQ4595Test
Tests run: 3, Failures: 0, Errors: 0, Skipped: 0, Time elapsed: 94.987 sec - in org.apache.activemq.bugs.AMQ4595Test
Running org.apache.activemq.bugs.AMQ4636Test
Tests run: 3, Failures: 0, Errors: 0, Skipped: 0, Time elapsed: 22.503 sec - in org.apache.activemq.bugs.AMQ4636Test
Running org.apache.activemq.bugs.AMQ4656Test
Tests run: 2, Failures: 0, Errors: 0, Skipped: 0, Time elapsed: 7.546 sec - in org.apache.activemq.bugs.AMQ4656Test
Running org.apache.activemq.bugs.AMQ4671Test
Tests run: 1, Failures: 0, Errors: 0, Skipped: 0, Time elapsed: 1.051 sec - in org.apache.activemq.bugs.AMQ4671Test
Running org.apache.activemq.bugs.AMQ4853Test
Tests run: 3, Failures: 0, Errors: 0, Skipped: 2, Time elapsed: 0.875 sec - in org.apache.activemq.bugs.AMQ4853Test
Running org.apache.activemq.bugs.AMQ4887Test
Tests run: 4, Failures: 0, Errors: 0, Skipped: 0, Time elapsed: 3.21 sec - in org.apache.activemq.bugs.AMQ4887Test
Running org.apache.activemq.bugs.AMQ4893Test
Tests run: 4, Failures: 0, Errors: 0, Skipped: 0, Time elapsed: 0.252 sec - in org.apache.activemq.bugs.AMQ4893Test
Running org.apache.activemq.bugs.AMQ4899Test
Tests run: 1, Failures: 0, Errors: 0, Skipped: 0, Time elapsed: 5.761 sec - in org.apache.activemq.bugs.AMQ4899Test
Running org.apache.activemq.bugs.AMQ4930Test
Tests run: 2, Failures: 0, Errors: 0, Skipped: 0, Time elapsed: 15.388 sec - in org.apache.activemq.bugs.AMQ4930Test
Running org.apache.activemq.bugs.AMQ4950Test
Tests run: 1, Failures: 0, Errors: 0, Skipped: 0, Time elapsed: 1.617 sec - in org.apache.activemq.bugs.AMQ4950Test
Running org.apache.activemq.bugs.AMQ4952Test
Tests run: 2, Failures: 0, Errors: 0, Skipped: 0, Time elapsed: 40.911 sec - in org.apache.activemq.bugs.AMQ4952Test
Running org.apache.activemq.bugs.AMQ5035Test
Tests run: 1, Failures: 0, Errors: 0, Skipped: 0, Time elapsed: 3.455 sec - in org.apache.activemq.bugs.AMQ5035Test
Running org.apache.activemq.bugs.MemoryUsageBrokerTest
Tests run: 1, Failures: 0, Errors: 0, Skipped: 0, Time elapsed: 56.728 sec - in org.apache.activemq.bugs.MemoryUsageBrokerTest
Running org.apache.activemq.bugs.OptimizeAcknowledgeWithExpiredMsgsTest
Tests run: 3, Failures: 0, Errors: 0, Skipped: 0, Time elapsed: 3.538 sec - in org.apache.activemq.bugs.OptimizeAcknowledgeWithExpiredMsgsTest
Running org.apache.activemq.bugs.RedeliveryPluginHeaderTest
Tests run: 1, Failures: 0, Errors: 0, Skipped: 0, Time elapsed: 7.636 sec - in org.apache.activemq.bugs.RedeliveryPluginHeaderTest
Running org.apache.activemq.bugs.SparseAckReplayAfterStoreCleanupLevelDBStoreTest
Tests run: 2, Failures: 0, Errors: 0, Skipped: 0, Time elapsed: 9.234 sec - in org.apache.activemq.bugs.SparseAckReplayAfterStoreCleanupLevelDBStoreTest
Running org.apache.activemq.bugs.TempQueueDeleteOnCloseTest
Tests run: 1, Failures: 0, Errors: 0, Skipped: 0, Time elapsed: 1.88 sec - in org.apache.activemq.bugs.TempQueueDeleteOnCloseTest
Running org.apache.activemq.bugs.TempStorageConfigBrokerTest
Tests run: 2, Failures: 0, Errors: 0, Skipped: 2, Time elapsed: 0.094 sec - in org.apache.activemq.bugs.TempStorageConfigBrokerTest
Running org.apache.activemq.bugs.TransactedStoreUsageSuspendResumeTest
Tests run: 1, Failures: 1, Errors: 0, Skipped: 0, Time elapsed: 422.142 sec <<< FAILURE!
- in org.apache.activemq.bugs.TransactedStoreUsageSuspendResumeTest
testTransactedStoreUsageSuspendResume(org.apache.activemq.bugs.TransactedStoreUsageSuspendResumeTest)
 Time elapsed: 421.949 sec  <<< FAILURE!
java.lang.AssertionError: Got all messages: java.util.concurrent.CountDownLatch@1da07be[Count
= 8778]
	at org.junit.Assert.fail(Assert.java:88)
	at org.junit.Assert.assertTrue(Assert.java:41)
	at org.apache.activemq.bugs.TransactedStoreUsageSuspendResumeTest.testTransactedStoreUsageSuspendResume(TransactedStoreUsageSuspendResumeTest.java:143)

Running org.apache.activemq.bugs.TrapMessageInJDBCStoreTest
Tests run: 1, Failures: 0, Errors: 0, Skipped: 0, Time elapsed: 15.971 sec - in org.apache.activemq.bugs.TrapMessageInJDBCStoreTest
Running org.apache.activemq.command.ActiveMQBytesMessageTest
Tests run: 19, Failures: 0, Errors: 0, Skipped: 0, Time elapsed: 0.097 sec - in org.apache.activemq.command.ActiveMQBytesMessageTest
Running org.apache.activemq.command.ActiveMQDestinationTest
Tests run: 12, Failures: 0, Errors: 0, Skipped: 0, Time elapsed: 0.248 sec - in org.apache.activemq.command.ActiveMQDestinationTest
Running org.apache.activemq.command.ActiveMQMapMessageTest
Tests run: 17, Failures: 0, Errors: 0, Skipped: 0, Time elapsed: 0.421 sec - in org.apache.activemq.command.ActiveMQMapMessageTest
Running org.apache.activemq.command.ActiveMQMessageTest
Tests run: 50, Failures: 0, Errors: 0, Skipped: 0, Time elapsed: 0.334 sec - in org.apache.activemq.command.ActiveMQMessageTest
Running org.apache.activemq.command.ActiveMQObjectMessageTest
Tests run: 5, Failures: 0, Errors: 0, Skipped: 0, Time elapsed: 0.182 sec - in org.apache.activemq.command.ActiveMQObjectMessageTest
Running org.apache.activemq.command.ActiveMQStreamMessageTest
Tests run: 18, Failures: 0, Errors: 0, Skipped: 0, Time elapsed: 0.469 sec - in org.apache.activemq.command.ActiveMQStreamMessageTest
Running org.apache.activemq.command.ActiveMQTextMessageTest
Tests run: 9, Failures: 0, Errors: 0, Skipped: 0, Time elapsed: 0.194 sec - in org.apache.activemq.command.ActiveMQTextMessageTest
Running org.apache.activemq.command.MessageSendTest
Tests run: 2, Failures: 0, Errors: 0, Skipped: 0, Time elapsed: 0.258 sec - in org.apache.activemq.command.MessageSendTest
Running org.apache.activemq.command.MessageTest
Tests run: 7, Failures: 0, Errors: 0, Skipped: 0, Time elapsed: 0.286 sec - in org.apache.activemq.command.MessageTest
Running org.apache.activemq.config.BrokerPropertiesTest
Tests run: 2, Failures: 0, Errors: 0, Skipped: 0, Time elapsed: 0.824 sec - in org.apache.activemq.config.BrokerPropertiesTest
Running org.apache.activemq.config.BrokerXmlConfigTest
Tests run: 1, Failures: 0, Errors: 0, Skipped: 0, Time elapsed: 3.958 sec - in org.apache.activemq.config.BrokerXmlConfigTest
Running org.apache.activemq.config.JDBCConfigTest
Tests run: 1, Failures: 0, Errors: 0, Skipped: 0, Time elapsed: 8.487 sec - in org.apache.activemq.config.JDBCConfigTest
Running org.apache.activemq.console.command.AMQ3410Test
Tests run: 5, Failures: 0, Errors: 0, Skipped: 0, Time elapsed: 18.816 sec - in org.apache.activemq.console.command.AMQ3410Test
Running org.apache.activemq.console.command.AMQ3411Test
Tests run: 5, Failures: 0, Errors: 0, Skipped: 0, Time elapsed: 11.425 sec - in org.apache.activemq.console.command.AMQ3411Test
Running org.apache.activemq.console.command.PurgeCommandTest
Tests run: 6, Failures: 0, Errors: 0, Skipped: 0, Time elapsed: 12.403 sec - in org.apache.activemq.console.command.PurgeCommandTest
Running org.apache.activemq.conversions.AmqpAndMqttTest
Tests run: 1, Failures: 0, Errors: 0, Skipped: 0, Time elapsed: 1.886 sec - in org.apache.activemq.conversions.AmqpAndMqttTest
Running org.apache.activemq.filter.DestinationFilterTest
Tests run: 5, Failures: 0, Errors: 0, Skipped: 0, Time elapsed: 0.072 sec - in org.apache.activemq.filter.DestinationFilterTest
Running org.apache.activemq.filter.DestinationMapMemoryTest
Tests run: 2, Failures: 0, Errors: 0, Skipped: 0, Time elapsed: 0.125 sec - in org.apache.activemq.filter.DestinationMapMemoryTest
Running org.apache.activemq.filter.DestinationMapTempDestinationTest
Tests run: 1, Failures: 0, Errors: 0, Skipped: 0, Time elapsed: 0.391 sec - in org.apache.activemq.filter.DestinationMapTempDestinationTest
Running org.apache.activemq.filter.DestinationMapTest
Tests run: 16, Failures: 0, Errors: 0, Skipped: 0, Time elapsed: 0.101 sec - in org.apache.activemq.filter.DestinationMapTest
Running org.apache.activemq.filter.DestinationPathTest
Tests run: 1, Failures: 0, Errors: 0, Skipped: 0, Time elapsed: 0.195 sec - in org.apache.activemq.filter.DestinationPathTest
Running org.apache.activemq.filter.DummyPolicyTest
Tests run: 1, Failures: 0, Errors: 0, Skipped: 0, Time elapsed: 0.577 sec - in org.apache.activemq.filter.DummyPolicyTest
Running org.apache.activemq.jmx.JmxCreateNCTest
Tests run: 1, Failures: 0, Errors: 0, Skipped: 0, Time elapsed: 1.266 sec - in org.apache.activemq.jmx.JmxCreateNCTest
Running org.apache.activemq.jmx.OpenTypeSupportTest
Tests run: 2, Failures: 0, Errors: 0, Skipped: 0, Time elapsed: 1.294 sec - in org.apache.activemq.jmx.OpenTypeSupportTest
Running org.apache.activemq.jndi.ActiveMQInitialContextFactoryTest
Tests run: 3, Failures: 0, Errors: 0, Skipped: 0, Time elapsed: 0.283 sec - in org.apache.activemq.jndi.ActiveMQInitialContextFactoryTest
Running org.apache.activemq.jndi.ActiveMQWASInitialContextFactoryTest
Tests run: 1, Failures: 0, Errors: 0, Skipped: 0, Time elapsed: 0.284 sec - in org.apache.activemq.jndi.ActiveMQWASInitialContextFactoryTest
Running org.apache.activemq.jndi.CustomConnectionFactoryNameTest
Tests run: 4, Failures: 0, Errors: 0, Skipped: 0, Time elapsed: 0.293 sec - in org.apache.activemq.jndi.CustomConnectionFactoryNameTest
Running org.apache.activemq.jndi.DestinationNameWithSlashTest
Tests run: 1, Failures: 0, Errors: 0, Skipped: 0, Time elapsed: 0.246 sec - in org.apache.activemq.jndi.DestinationNameWithSlashTest
Running org.apache.activemq.jndi.InitialContextTest
Tests run: 4, Failures: 0, Errors: 0, Skipped: 0, Time elapsed: 0.288 sec - in org.apache.activemq.jndi.InitialContextTest
Running org.apache.activemq.jndi.ObjectFactoryTest
Tests run: 2, Failures: 0, Errors: 0, Skipped: 0, Time elapsed: 0.247 sec - in org.apache.activemq.jndi.ObjectFactoryTest
Running org.apache.activemq.jndi.XAConnectionFactoryTest
Tests run: 4, Failures: 0, Errors: 0, Skipped: 0, Time elapsed: 0.258 sec - in org.apache.activemq.jndi.XAConnectionFactoryTest
Running org.apache.activemq.joramtests.JoramJmsTest
Tests run: 196, Failures: 0, Errors: 0, Skipped: 0, Time elapsed: 24.662 sec - in org.apache.activemq.joramtests.JoramJmsTest
Running org.apache.activemq.leveldb.LevelDBStoreBrokerTest
Tests run: 129, Failures: 0, Errors: 0, Skipped: 0, Time elapsed: 65.368 sec - in org.apache.activemq.leveldb.LevelDBStoreBrokerTest
Running org.apache.activemq.management.BoundaryStatisticTest
Tests run: 1, Failures: 0, Errors: 0, Skipped: 0, Time elapsed: 0.184 sec - in org.apache.activemq.management.BoundaryStatisticTest
Running org.apache.activemq.management.BoundedRangeStatisticTest
Tests run: 1, Failures: 0, Errors: 0, Skipped: 0, Time elapsed: 0.675 sec - in org.apache.activemq.management.BoundedRangeStatisticTest
Running org.apache.activemq.management.CountStatisticTest
Tests run: 1, Failures: 0, Errors: 0, Skipped: 0, Time elapsed: 0.663 sec - in org.apache.activemq.management.CountStatisticTest
Running org.apache.activemq.management.RangeStatisticTest
Tests run: 1, Failures: 0, Errors: 0, Skipped: 0, Time elapsed: 0.651 sec - in org.apache.activemq.management.RangeStatisticTest
Running org.apache.activemq.management.TimeStatisticTest
Tests run: 1, Failures: 0, Errors: 0, Skipped: 0, Time elapsed: 0.699 sec - in org.apache.activemq.management.TimeStatisticTest
Running org.apache.activemq.memory.MemoryPropertyTest
Tests run: 1, Failures: 0, Errors: 0, Skipped: 0, Time elapsed: 1.869 sec - in org.apache.activemq.memory.MemoryPropertyTest
Running org.apache.activemq.memory.buffer.OrderBasedMemoryBufferTest
Tests run: 1, Failures: 0, Errors: 0, Skipped: 0, Time elapsed: 0.184 sec - in org.apache.activemq.memory.buffer.OrderBasedMemoryBufferTest
Running org.apache.activemq.memory.buffer.SizeBasedMessageBufferTest
Tests run: 1, Failures: 0, Errors: 0, Skipped: 0, Time elapsed: 0.238 sec - in org.apache.activemq.memory.buffer.SizeBasedMessageBufferTest
Running org.apache.activemq.network.CheckDuplicateMessagesOnDuplexTest
Tests run: 1, Failures: 0, Errors: 0, Skipped: 0, Time elapsed: 12.041 sec - in org.apache.activemq.network.CheckDuplicateMessagesOnDuplexTest
Running org.apache.activemq.network.CompressionOverNetworkTest
Tests run: 6, Failures: 0, Errors: 0, Skipped: 0, Time elapsed: 18.293 sec - in org.apache.activemq.network.CompressionOverNetworkTest
Running org.apache.activemq.network.DemandForwardingBridgeTest
Tests run: 6, Failures: 0, Errors: 0, Skipped: 0, Time elapsed: 5.164 sec - in org.apache.activemq.network.DemandForwardingBridgeTest
Running org.apache.activemq.network.DynamicallyIncludedDestinationsDuplexNetworkTest
Tests run: 7, Failures: 0, Errors: 0, Skipped: 0, Time elapsed: 25.648 sec - in org.apache.activemq.network.DynamicallyIncludedDestinationsDuplexNetworkTest
Running org.apache.activemq.network.ForwardingBridgeTest
Tests run: 8, Failures: 0, Errors: 0, Skipped: 0, Time elapsed: 18.133 sec - in org.apache.activemq.network.ForwardingBridgeTest
Running org.apache.activemq.network.NetworkDestinationFilterTest
Tests run: 1, Failures: 0, Errors: 0, Skipped: 0, Time elapsed: 0.196 sec - in org.apache.activemq.network.NetworkDestinationFilterTest
Running org.apache.activemq.network.NetworkLoopBackTest
Tests run: 1, Failures: 0, Errors: 0, Skipped: 0, Time elapsed: 3.108 sec - in org.apache.activemq.network.NetworkLoopBackTest
Running org.apache.activemq.network.NetworkRouteTest
Tests run: 3, Failures: 0, Errors: 0, Skipped: 0, Time elapsed: 0.932 sec - in org.apache.activemq.network.NetworkRouteTest
Running org.apache.activemq.openwire.BooleanStreamTest
Tests run: 4, Failures: 0, Errors: 0, Skipped: 0, Time elapsed: 1.333 sec - in org.apache.activemq.openwire.BooleanStreamTest
Running org.apache.activemq.openwire.ItStillMarshallsTheSameTest
Tests run: 1, Failures: 0, Errors: 0, Skipped: 0, Time elapsed: 0.169 sec - in org.apache.activemq.openwire.ItStillMarshallsTheSameTest
Running org.apache.activemq.openwire.NumberRangesWhileMarshallingTest
Tests run: 3, Failures: 0, Errors: 0, Skipped: 0, Time elapsed: 0.263 sec - in org.apache.activemq.openwire.NumberRangesWhileMarshallingTest
Running org.apache.activemq.pool.JmsSendReceiveTwoConnectionsWithSenderUsingPoolTest
Tests run: 1, Failures: 0, Errors: 0, Skipped: 0, Time elapsed: 2.369 sec - in org.apache.activemq.pool.JmsSendReceiveTwoConnectionsWithSenderUsingPoolTest
Running org.apache.activemq.proxy.AMQ4889Test
Tests run: 1, Failures: 0, Errors: 0, Skipped: 0, Time elapsed: 2.431 sec - in org.apache.activemq.proxy.AMQ4889Test
Running org.apache.activemq.security.AuthorizationMapTest
Tests run: 4, Failures: 0, Errors: 0, Skipped: 0, Time elapsed: 0.082 sec - in org.apache.activemq.security.AuthorizationMapTest
Running org.apache.activemq.security.CachedLDAPAuthorizationModuleLegacyOpenLDAPTest
Tests run: 1, Failures: 0, Errors: 0, Skipped: 1, Time elapsed: 0.044 sec - in org.apache.activemq.security.CachedLDAPAuthorizationModuleLegacyOpenLDAPTest
Running org.apache.activemq.security.CachedLDAPAuthorizationModuleLegacyTest
Tests run: 12, Failures: 0, Errors: 0, Skipped: 0, Time elapsed: 29.251 sec - in org.apache.activemq.security.CachedLDAPAuthorizationModuleLegacyTest
Running org.apache.activemq.security.CachedLDAPAuthorizationModuleOpenLDAPTest
Tests run: 1, Failures: 0, Errors: 0, Skipped: 1, Time elapsed: 0.035 sec - in org.apache.activemq.security.CachedLDAPAuthorizationModuleOpenLDAPTest
Running org.apache.activemq.security.CachedLDAPAuthorizationModuleTest
Tests run: 12, Failures: 0, Errors: 0, Skipped: 0, Time elapsed: 30.534 sec - in org.apache.activemq.security.CachedLDAPAuthorizationModuleTest
Running org.apache.activemq.security.CachedLDAPSecurityLegacyTest
Tests run: 4, Failures: 0, Errors: 0, Skipped: 0, Time elapsed: 7.329 sec - in org.apache.activemq.security.CachedLDAPSecurityLegacyTest
Running org.apache.activemq.security.CachedLDAPSecurityTest
Tests run: 4, Failures: 0, Errors: 0, Skipped: 0, Time elapsed: 7.562 sec - in org.apache.activemq.security.CachedLDAPSecurityTest
Running org.apache.activemq.security.JaasCertificateAuthenticationBrokerTest
Tests run: 3, Failures: 0, Errors: 0, Skipped: 0, Time elapsed: 0.091 sec - in org.apache.activemq.security.JaasCertificateAuthenticationBrokerTest
Running org.apache.activemq.security.JaasDualAuthenticationBrokerTest
Tests run: 2, Failures: 0, Errors: 0, Skipped: 0, Time elapsed: 0.224 sec - in org.apache.activemq.security.JaasDualAuthenticationBrokerTest
Running org.apache.activemq.security.LDAPAuthorizationMapTest
Tests run: 7, Failures: 0, Errors: 0, Skipped: 0, Time elapsed: 4.763 sec - in org.apache.activemq.security.LDAPAuthorizationMapTest
Running org.apache.activemq.security.SimpleAnonymousPluginTest
Tests run: 45, Failures: 0, Errors: 0, Skipped: 0, Time elapsed: 29.171 sec - in org.apache.activemq.security.SimpleAnonymousPluginTest
Running org.apache.activemq.security.SimpleAuthenticationPluginSeparatorTest
Tests run: 29, Failures: 0, Errors: 0, Skipped: 0, Time elapsed: 20.18 sec - in org.apache.activemq.security.SimpleAuthenticationPluginSeparatorTest
Running org.apache.activemq.security.SimpleAuthenticationPluginTest
Tests run: 33, Failures: 0, Errors: 0, Skipped: 0, Time elapsed: 22.885 sec - in org.apache.activemq.security.SimpleAuthenticationPluginTest
Running org.apache.activemq.security.SimpleAuthorizationMapTest
Tests run: 4, Failures: 0, Errors: 0, Skipped: 0, Time elapsed: 0.211 sec - in org.apache.activemq.security.SimpleAuthorizationMapTest
Running org.apache.activemq.security.SimpleSecurityBrokerSystemTest
Tests run: 60, Failures: 0, Errors: 0, Skipped: 0, Time elapsed: 20.733 sec - in org.apache.activemq.security.SimpleSecurityBrokerSystemTest
Running org.apache.activemq.security.XBeanSecurityTest
Tests run: 29, Failures: 0, Errors: 0, Skipped: 0, Time elapsed: 18.702 sec - in org.apache.activemq.security.XBeanSecurityTest
Running org.apache.activemq.security.XBeanSecurityWithGuestTest
Tests run: 7, Failures: 0, Errors: 0, Skipped: 0, Time elapsed: 3.032 sec - in org.apache.activemq.security.XBeanSecurityWithGuestTest
Running org.apache.activemq.selector.SelectorParserTest
Tests run: 3, Failures: 0, Errors: 0, Skipped: 0, Time elapsed: 0.37 sec - in org.apache.activemq.selector.SelectorParserTest
Running org.apache.activemq.selector.SelectorTest
Tests run: 21, Failures: 0, Errors: 0, Skipped: 0, Time elapsed: 0.548 sec - in org.apache.activemq.selector.SelectorTest
Running org.apache.activemq.spring.ActiveMQConnectionFactoryFactoryBeanTest
Tests run: 6, Failures: 0, Errors: 0, Skipped: 0, Time elapsed: 0.216 sec - in org.apache.activemq.spring.ActiveMQConnectionFactoryFactoryBeanTest
Running org.apache.activemq.spring.SpringTest
Tests run: 7, Failures: 0, Errors: 0, Skipped: 0, Time elapsed: 14.548 sec - in org.apache.activemq.spring.SpringTest
Running org.apache.activemq.store.LevelDBStorePerDestinationTest
Tests run: 6, Failures: 0, Errors: 0, Skipped: 0, Time elapsed: 162.197 sec - in org.apache.activemq.store.LevelDBStorePerDestinationTest
Running org.apache.activemq.store.jdbc.DatabaseLockerConfigTest
Tests run: 4, Failures: 0, Errors: 0, Skipped: 0, Time elapsed: 0.204 sec - in org.apache.activemq.store.jdbc.DatabaseLockerConfigTest
Running org.apache.activemq.store.jdbc.JDBCIOExceptionHandlerMockeryTest
Tests run: 1, Failures: 0, Errors: 0, Skipped: 0, Time elapsed: 2.286 sec - in org.apache.activemq.store.jdbc.JDBCIOExceptionHandlerMockeryTest
Running org.apache.activemq.store.jdbc.JDBCIOExceptionHandlerTest
Tests run: 2, Failures: 1, Errors: 0, Skipped: 0, Time elapsed: 20.946 sec <<< FAILURE!
- in org.apache.activemq.store.jdbc.JDBCIOExceptionHandlerTest
testRecoverWithOutJMX(org.apache.activemq.store.jdbc.JDBCIOExceptionHandlerTest)  Time elapsed:
8.155 sec  <<< FAILURE!
junit.framework.AssertionFailedError: Transport connector should have been started
	at junit.framework.Assert.fail(Assert.java:57)
	at junit.framework.TestCase.fail(TestCase.java:227)
	at org.apache.activemq.store.jdbc.JDBCIOExceptionHandlerTest.checkTransportConnectorStarted(JDBCIOExceptionHandlerTest.java:145)
	at org.apache.activemq.store.jdbc.JDBCIOExceptionHandlerTest.recoverFromDisconnectDB(JDBCIOExceptionHandlerTest.java:119)
	at org.apache.activemq.store.jdbc.JDBCIOExceptionHandlerTest.testRecoverWithOutJMX(JDBCIOExceptionHandlerTest.java:85)

Running org.apache.activemq.store.jdbc.JDBCLockTablePrefixTest
Tests run: 1, Failures: 0, Errors: 0, Skipped: 0, Time elapsed: 15.1 sec - in org.apache.activemq.store.jdbc.JDBCLockTablePrefixTest
Running org.apache.activemq.store.jdbc.JDBCTablePrefixAssignedTest
Tests run: 1, Failures: 0, Errors: 0, Skipped: 0, Time elapsed: 10.556 sec - in org.apache.activemq.store.jdbc.JDBCTablePrefixAssignedTest
Running org.apache.activemq.store.jdbc.LeaseDatabaseLockerTest
Tests run: 5, Failures: 0, Errors: 0, Skipped: 0, Time elapsed: 61.759 sec - in org.apache.activemq.store.jdbc.LeaseDatabaseLockerTest
Running org.apache.activemq.store.kahadb.CustomLockerTest
Tests run: 1, Failures: 0, Errors: 0, Skipped: 0, Time elapsed: 2.923 sec - in org.apache.activemq.store.kahadb.CustomLockerTest
Running org.apache.activemq.store.kahadb.KahaDBPersistenceAdapterTest
Tests run: 2, Failures: 0, Errors: 0, Skipped: 0, Time elapsed: 3.505 sec - in org.apache.activemq.store.kahadb.KahaDBPersistenceAdapterTest
Running org.apache.activemq.store.kahadb.KahaDBStoreBrokerTest
Tests run: 129, Failures: 0, Errors: 0, Skipped: 0, Time elapsed: 118.895 sec - in org.apache.activemq.store.kahadb.KahaDBStoreBrokerTest
Running org.apache.activemq.store.kahadb.KahaDBStoreOrderTest
Tests run: 2, Failures: 0, Errors: 0, Skipped: 0, Time elapsed: 6.157 sec - in org.apache.activemq.store.kahadb.KahaDBStoreOrderTest
Running org.apache.activemq.store.kahadb.NoSpaceIOTest
Tests run: 1, Failures: 0, Errors: 0, Skipped: 1, Time elapsed: 0.066 sec - in org.apache.activemq.store.kahadb.NoSpaceIOTest
Running org.apache.activemq.store.kahadb.PBMesssagesTest
Tests run: 1, Failures: 0, Errors: 0, Skipped: 0, Time elapsed: 0.074 sec - in org.apache.activemq.store.kahadb.PBMesssagesTest
Running org.apache.activemq.store.kahadb.TempKahaDBStoreBrokerTest
Tests run: 129, Failures: 0, Errors: 0, Skipped: 0, Time elapsed: 140.368 sec - in org.apache.activemq.store.kahadb.TempKahaDBStoreBrokerTest
Running org.apache.activemq.store.kahadb.plist.KahaDBFilePendingMessageCursorTest
Tests run: 3, Failures: 0, Errors: 0, Skipped: 0, Time elapsed: 3.897 sec - in org.apache.activemq.store.kahadb.plist.KahaDBFilePendingMessageCursorTest
Running org.apache.activemq.store.leveldb.LevelDBNegativeQueueTest

Results :

Failed tests: 
  DbRestartJDBCQueueMasterSlaveLeaseQuiesceTest>CombinationTestSupport.runBare:113->CombinationTestSupport.runBare:107->QueueMasterSlaveTestSupport.testVirtualTopicFailover:132
slave started
  AMQ2149LevelDBTest>AMQ2149Test.testQueueTransactionalOrderWithRestart:412->AMQ2149Test.doTestTransactionalOrderWithRestart:435->AMQ2149Test.verifyOrderedMessageReceipt:560
No exceptions
  AMQ2149LevelDBTest>AMQ2149Test.testTopicTransactionalOrderWithRestart:417->AMQ2149Test.doTestTransactionalOrderWithRestart:435->AMQ2149Test.verifyOrderedMessageReceipt:549
No timeout waiting for senders/receivers to complete
  TransactedStoreUsageSuspendResumeTest.testTransactedStoreUsageSuspendResume:143 Got all
messages: java.util.concurrent.CountDownLatch@1da07be[Count = 8778]
  JDBCIOExceptionHandlerTest.testRecoverWithOutJMX:85->recoverFromDisconnectDB:119->checkTransportConnectorStarted:145
Transport connector should have been started

Tests run: 2288, Failures: 5, Errors: 0, Skipped: 7

[JENKINS] Recording test results

Mime
View raw message