activemq-commits mailing list archives

Site index · List index
Message view « Date » · « Thread »
Top « Date » · « Thread »
From Apache Jenkins Server <jenk...@builds.apache.org>
Subject Build failed in Jenkins: ActiveMQ-Java7 » ActiveMQ :: Unit Tests #316
Date Sat, 12 Apr 2014 08:00:16 GMT
See <https://builds.apache.org/job/ActiveMQ-Java7/org.apache.activemq$activemq-unit-tests/316/>

------------------------------------------
[...truncated 490 lines...]
Tests run: 1, Failures: 0, Errors: 0, Skipped: 0, Time elapsed: 5.797 sec - in org.apache.activemq.bugs.AMQ4413Test
Running org.apache.activemq.bugs.AMQ4469Test
Tests run: 1, Failures: 0, Errors: 0, Skipped: 0, Time elapsed: 5.941 sec - in org.apache.activemq.bugs.AMQ4469Test
Running org.apache.activemq.bugs.AMQ4472Test
Tests run: 1, Failures: 0, Errors: 0, Skipped: 0, Time elapsed: 2.2 sec - in org.apache.activemq.bugs.AMQ4472Test
Running org.apache.activemq.bugs.AMQ4475Test
Tests run: 1, Failures: 0, Errors: 0, Skipped: 0, Time elapsed: 4.588 sec - in org.apache.activemq.bugs.AMQ4475Test
Running org.apache.activemq.bugs.AMQ4485NetworkOfXBrokersWithNDestsFanoutTransactionTest
Tests run: 1, Failures: 0, Errors: 0, Skipped: 0, Time elapsed: 392.133 sec - in org.apache.activemq.bugs.AMQ4485NetworkOfXBrokersWithNDestsFanoutTransactionTest
Running org.apache.activemq.bugs.AMQ4485Test
Tests run: 1, Failures: 0, Errors: 0, Skipped: 0, Time elapsed: 11.175 sec - in org.apache.activemq.bugs.AMQ4485Test
Running org.apache.activemq.bugs.AMQ4487Test
Tests run: 2, Failures: 0, Errors: 0, Skipped: 0, Time elapsed: 37.277 sec - in org.apache.activemq.bugs.AMQ4487Test
Running org.apache.activemq.bugs.AMQ4504Test
Tests run: 1, Failures: 0, Errors: 0, Skipped: 0, Time elapsed: 2.713 sec - in org.apache.activemq.bugs.AMQ4504Test
Running org.apache.activemq.bugs.AMQ4513Test
Tests run: 1, Failures: 0, Errors: 0, Skipped: 0, Time elapsed: 25.937 sec - in org.apache.activemq.bugs.AMQ4513Test
Running org.apache.activemq.bugs.AMQ4517Test
Tests run: 1, Failures: 0, Errors: 0, Skipped: 0, Time elapsed: 1.747 sec - in org.apache.activemq.bugs.AMQ4517Test
Running org.apache.activemq.bugs.AMQ4518Test
Tests run: 1, Failures: 0, Errors: 0, Skipped: 0, Time elapsed: 1.792 sec - in org.apache.activemq.bugs.AMQ4518Test
Running org.apache.activemq.bugs.AMQ4530Test
Tests run: 1, Failures: 0, Errors: 0, Skipped: 0, Time elapsed: 1.256 sec - in org.apache.activemq.bugs.AMQ4530Test
Running org.apache.activemq.bugs.AMQ4531Test
Tests run: 1, Failures: 0, Errors: 0, Skipped: 0, Time elapsed: 1.207 sec - in org.apache.activemq.bugs.AMQ4531Test
Running org.apache.activemq.bugs.AMQ4554Test
Tests run: 1, Failures: 0, Errors: 0, Skipped: 0, Time elapsed: 1.27 sec - in org.apache.activemq.bugs.AMQ4554Test
Running org.apache.activemq.bugs.AMQ4582Test
Tests run: 1, Failures: 0, Errors: 0, Skipped: 0, Time elapsed: 1.187 sec - in org.apache.activemq.bugs.AMQ4582Test
Running org.apache.activemq.bugs.AMQ4595Test
Tests run: 3, Failures: 0, Errors: 0, Skipped: 0, Time elapsed: 96.7 sec - in org.apache.activemq.bugs.AMQ4595Test
Running org.apache.activemq.bugs.AMQ4636Test
Tests run: 3, Failures: 0, Errors: 0, Skipped: 0, Time elapsed: 51.663 sec - in org.apache.activemq.bugs.AMQ4636Test
Running org.apache.activemq.bugs.AMQ4656Test
Tests run: 2, Failures: 0, Errors: 0, Skipped: 0, Time elapsed: 7.286 sec - in org.apache.activemq.bugs.AMQ4656Test
Running org.apache.activemq.bugs.AMQ4671Test
Tests run: 1, Failures: 0, Errors: 0, Skipped: 0, Time elapsed: 1.148 sec - in org.apache.activemq.bugs.AMQ4671Test
Running org.apache.activemq.bugs.AMQ4853Test
Tests run: 3, Failures: 0, Errors: 0, Skipped: 2, Time elapsed: 0.811 sec - in org.apache.activemq.bugs.AMQ4853Test
Running org.apache.activemq.bugs.AMQ4887Test
Tests run: 4, Failures: 0, Errors: 0, Skipped: 0, Time elapsed: 3.971 sec - in org.apache.activemq.bugs.AMQ4887Test
Running org.apache.activemq.bugs.AMQ4893Test
Tests run: 4, Failures: 0, Errors: 0, Skipped: 0, Time elapsed: 0.252 sec - in org.apache.activemq.bugs.AMQ4893Test
Running org.apache.activemq.bugs.AMQ4899Test
Tests run: 1, Failures: 0, Errors: 0, Skipped: 0, Time elapsed: 7.02 sec - in org.apache.activemq.bugs.AMQ4899Test
Running org.apache.activemq.bugs.AMQ4930Test
Tests run: 2, Failures: 1, Errors: 0, Skipped: 0, Time elapsed: 33.215 sec <<< FAILURE!
- in org.apache.activemq.bugs.AMQ4930Test
testBrowsePendingNonPersistent(org.apache.activemq.bugs.AMQ4930Test)  Time elapsed: 7.458
sec  <<< FAILURE!
junit.framework.AssertionFailedError: No growth: 110920
	at junit.framework.Assert.fail(Assert.java:57)
	at junit.framework.Assert.assertTrue(Assert.java:22)
	at junit.framework.TestCase.assertTrue(TestCase.java:192)
	at org.apache.activemq.bugs.AMQ4930Test.doTestBrowsePending(AMQ4930Test.java:108)
	at org.apache.activemq.bugs.AMQ4930Test.testBrowsePendingNonPersistent(AMQ4930Test.java:61)

Running org.apache.activemq.bugs.AMQ4950Test
Tests run: 1, Failures: 0, Errors: 0, Skipped: 0, Time elapsed: 2.132 sec - in org.apache.activemq.bugs.AMQ4950Test
Running org.apache.activemq.bugs.AMQ4952Test
Tests run: 2, Failures: 1, Errors: 0, Skipped: 0, Time elapsed: 105.214 sec <<< FAILURE!
- in org.apache.activemq.bugs.AMQ4952Test
testConsumerBrokerRestart[enableAudit=false](org.apache.activemq.bugs.AMQ4952Test)  Time elapsed:
26.615 sec  <<< FAILURE!
java.lang.AssertionError: number of messages received expected:<2> but was:<1>
	at org.junit.Assert.fail(Assert.java:88)
	at org.junit.Assert.failNotEquals(Assert.java:743)
	at org.junit.Assert.assertEquals(Assert.java:118)
	at org.junit.Assert.assertEquals(Assert.java:555)
	at org.apache.activemq.bugs.AMQ4952Test.testConsumerBrokerRestart(AMQ4952Test.java:226)

Running org.apache.activemq.bugs.AMQ5035Test
Tests run: 1, Failures: 0, Errors: 0, Skipped: 0, Time elapsed: 4.079 sec - in org.apache.activemq.bugs.AMQ5035Test
Running org.apache.activemq.bugs.MemoryUsageBrokerTest
Tests run: 1, Failures: 0, Errors: 0, Skipped: 0, Time elapsed: 146.155 sec - in org.apache.activemq.bugs.MemoryUsageBrokerTest
Running org.apache.activemq.bugs.OptimizeAcknowledgeWithExpiredMsgsTest
Tests run: 3, Failures: 0, Errors: 0, Skipped: 0, Time elapsed: 5.147 sec - in org.apache.activemq.bugs.OptimizeAcknowledgeWithExpiredMsgsTest
Running org.apache.activemq.bugs.RedeliveryPluginHeaderTest
Tests run: 1, Failures: 0, Errors: 0, Skipped: 0, Time elapsed: 8.021 sec - in org.apache.activemq.bugs.RedeliveryPluginHeaderTest
Running org.apache.activemq.bugs.SparseAckReplayAfterStoreCleanupLevelDBStoreTest
Tests run: 2, Failures: 0, Errors: 0, Skipped: 0, Time elapsed: 13.211 sec - in org.apache.activemq.bugs.SparseAckReplayAfterStoreCleanupLevelDBStoreTest
Running org.apache.activemq.bugs.TempQueueDeleteOnCloseTest
Tests run: 1, Failures: 0, Errors: 0, Skipped: 0, Time elapsed: 3.352 sec - in org.apache.activemq.bugs.TempQueueDeleteOnCloseTest
Running org.apache.activemq.bugs.TempStorageConfigBrokerTest
Tests run: 2, Failures: 0, Errors: 0, Skipped: 2, Time elapsed: 0.089 sec - in org.apache.activemq.bugs.TempStorageConfigBrokerTest
Running org.apache.activemq.bugs.TransactedStoreUsageSuspendResumeTest
Tests run: 1, Failures: 1, Errors: 0, Skipped: 0, Time elapsed: 424.59 sec <<< FAILURE!
- in org.apache.activemq.bugs.TransactedStoreUsageSuspendResumeTest
testTransactedStoreUsageSuspendResume(org.apache.activemq.bugs.TransactedStoreUsageSuspendResumeTest)
 Time elapsed: 424.412 sec  <<< FAILURE!
java.lang.AssertionError: Got all messages: java.util.concurrent.CountDownLatch@ae8c15[Count
= 10000]
	at org.junit.Assert.fail(Assert.java:88)
	at org.junit.Assert.assertTrue(Assert.java:41)
	at org.apache.activemq.bugs.TransactedStoreUsageSuspendResumeTest.testTransactedStoreUsageSuspendResume(TransactedStoreUsageSuspendResumeTest.java:143)

Running org.apache.activemq.bugs.TrapMessageInJDBCStoreTest
Tests run: 1, Failures: 0, Errors: 0, Skipped: 0, Time elapsed: 40.407 sec - in org.apache.activemq.bugs.TrapMessageInJDBCStoreTest
Running org.apache.activemq.command.ActiveMQBytesMessageTest
Tests run: 19, Failures: 0, Errors: 0, Skipped: 0, Time elapsed: 0.095 sec - in org.apache.activemq.command.ActiveMQBytesMessageTest
Running org.apache.activemq.command.ActiveMQDestinationTest
Tests run: 12, Failures: 0, Errors: 0, Skipped: 0, Time elapsed: 0.217 sec - in org.apache.activemq.command.ActiveMQDestinationTest
Running org.apache.activemq.command.ActiveMQMapMessageTest
Tests run: 17, Failures: 0, Errors: 0, Skipped: 0, Time elapsed: 0.352 sec - in org.apache.activemq.command.ActiveMQMapMessageTest
Running org.apache.activemq.command.ActiveMQMessageTest
Tests run: 50, Failures: 0, Errors: 0, Skipped: 0, Time elapsed: 0.321 sec - in org.apache.activemq.command.ActiveMQMessageTest
Running org.apache.activemq.command.ActiveMQObjectMessageTest
Tests run: 5, Failures: 0, Errors: 0, Skipped: 0, Time elapsed: 0.178 sec - in org.apache.activemq.command.ActiveMQObjectMessageTest
Running org.apache.activemq.command.ActiveMQStreamMessageTest
Tests run: 18, Failures: 0, Errors: 0, Skipped: 0, Time elapsed: 0.492 sec - in org.apache.activemq.command.ActiveMQStreamMessageTest
Running org.apache.activemq.command.ActiveMQTextMessageTest
Tests run: 9, Failures: 0, Errors: 0, Skipped: 0, Time elapsed: 0.191 sec - in org.apache.activemq.command.ActiveMQTextMessageTest
Running org.apache.activemq.command.MessageSendTest
Tests run: 2, Failures: 0, Errors: 0, Skipped: 0, Time elapsed: 0.261 sec - in org.apache.activemq.command.MessageSendTest
Running org.apache.activemq.command.MessageTest
Tests run: 7, Failures: 0, Errors: 0, Skipped: 0, Time elapsed: 0.282 sec - in org.apache.activemq.command.MessageTest
Running org.apache.activemq.config.BrokerPropertiesTest
Tests run: 2, Failures: 0, Errors: 0, Skipped: 0, Time elapsed: 0.825 sec - in org.apache.activemq.config.BrokerPropertiesTest
Running org.apache.activemq.config.BrokerXmlConfigTest
Tests run: 1, Failures: 0, Errors: 0, Skipped: 0, Time elapsed: 4.551 sec - in org.apache.activemq.config.BrokerXmlConfigTest
Running org.apache.activemq.config.JDBCConfigTest
Tests run: 1, Failures: 0, Errors: 0, Skipped: 0, Time elapsed: 14.346 sec - in org.apache.activemq.config.JDBCConfigTest
Running org.apache.activemq.console.command.AMQ3410Test
Tests run: 5, Failures: 0, Errors: 0, Skipped: 0, Time elapsed: 35.201 sec - in org.apache.activemq.console.command.AMQ3410Test
Running org.apache.activemq.console.command.AMQ3411Test
Tests run: 5, Failures: 0, Errors: 0, Skipped: 0, Time elapsed: 16.468 sec - in org.apache.activemq.console.command.AMQ3411Test
Running org.apache.activemq.console.command.PurgeCommandTest
Tests run: 6, Failures: 0, Errors: 0, Skipped: 0, Time elapsed: 18.765 sec - in org.apache.activemq.console.command.PurgeCommandTest
Running org.apache.activemq.conversions.AmqpAndMqttTest
Tests run: 1, Failures: 0, Errors: 0, Skipped: 0, Time elapsed: 1.581 sec - in org.apache.activemq.conversions.AmqpAndMqttTest
Running org.apache.activemq.filter.DestinationFilterTest
Tests run: 5, Failures: 0, Errors: 0, Skipped: 0, Time elapsed: 0.076 sec - in org.apache.activemq.filter.DestinationFilterTest
Running org.apache.activemq.filter.DestinationMapMemoryTest
Tests run: 2, Failures: 0, Errors: 0, Skipped: 0, Time elapsed: 0.107 sec - in org.apache.activemq.filter.DestinationMapMemoryTest
Running org.apache.activemq.filter.DestinationMapTempDestinationTest
Tests run: 1, Failures: 0, Errors: 0, Skipped: 0, Time elapsed: 0.34 sec - in org.apache.activemq.filter.DestinationMapTempDestinationTest
Running org.apache.activemq.filter.DestinationMapTest
Tests run: 16, Failures: 0, Errors: 0, Skipped: 0, Time elapsed: 0.092 sec - in org.apache.activemq.filter.DestinationMapTest
Running org.apache.activemq.filter.DestinationPathTest
Tests run: 1, Failures: 0, Errors: 0, Skipped: 0, Time elapsed: 0.162 sec - in org.apache.activemq.filter.DestinationPathTest
Running org.apache.activemq.filter.DummyPolicyTest
Tests run: 1, Failures: 0, Errors: 0, Skipped: 0, Time elapsed: 0.599 sec - in org.apache.activemq.filter.DummyPolicyTest
Running org.apache.activemq.jmx.JmxCreateNCTest
Tests run: 1, Failures: 0, Errors: 0, Skipped: 0, Time elapsed: 1.547 sec - in org.apache.activemq.jmx.JmxCreateNCTest
Running org.apache.activemq.jmx.OpenTypeSupportTest
Tests run: 2, Failures: 0, Errors: 0, Skipped: 0, Time elapsed: 1.256 sec - in org.apache.activemq.jmx.OpenTypeSupportTest
Running org.apache.activemq.jndi.ActiveMQInitialContextFactoryTest
Tests run: 3, Failures: 0, Errors: 0, Skipped: 0, Time elapsed: 0.241 sec - in org.apache.activemq.jndi.ActiveMQInitialContextFactoryTest
Running org.apache.activemq.jndi.ActiveMQWASInitialContextFactoryTest
Tests run: 1, Failures: 0, Errors: 0, Skipped: 0, Time elapsed: 0.234 sec - in org.apache.activemq.jndi.ActiveMQWASInitialContextFactoryTest
Running org.apache.activemq.jndi.CustomConnectionFactoryNameTest
Tests run: 4, Failures: 0, Errors: 0, Skipped: 0, Time elapsed: 0.25 sec - in org.apache.activemq.jndi.CustomConnectionFactoryNameTest
Running org.apache.activemq.jndi.DestinationNameWithSlashTest
Tests run: 1, Failures: 0, Errors: 0, Skipped: 0, Time elapsed: 0.226 sec - in org.apache.activemq.jndi.DestinationNameWithSlashTest
Running org.apache.activemq.jndi.InitialContextTest
Tests run: 4, Failures: 0, Errors: 0, Skipped: 0, Time elapsed: 0.361 sec - in org.apache.activemq.jndi.InitialContextTest
Running org.apache.activemq.jndi.ObjectFactoryTest
Tests run: 2, Failures: 0, Errors: 0, Skipped: 0, Time elapsed: 0.223 sec - in org.apache.activemq.jndi.ObjectFactoryTest
Running org.apache.activemq.jndi.XAConnectionFactoryTest
Tests run: 4, Failures: 0, Errors: 0, Skipped: 0, Time elapsed: 0.25 sec - in org.apache.activemq.jndi.XAConnectionFactoryTest
Running org.apache.activemq.joramtests.JoramJmsTest
Tests run: 196, Failures: 0, Errors: 0, Skipped: 0, Time elapsed: 21.762 sec - in org.apache.activemq.joramtests.JoramJmsTest
Running org.apache.activemq.leveldb.LevelDBStoreBrokerTest
Tests run: 129, Failures: 0, Errors: 0, Skipped: 0, Time elapsed: 104.056 sec - in org.apache.activemq.leveldb.LevelDBStoreBrokerTest
Running org.apache.activemq.management.BoundaryStatisticTest
Tests run: 1, Failures: 0, Errors: 0, Skipped: 0, Time elapsed: 0.159 sec - in org.apache.activemq.management.BoundaryStatisticTest
Running org.apache.activemq.management.BoundedRangeStatisticTest
Tests run: 1, Failures: 0, Errors: 0, Skipped: 0, Time elapsed: 0.659 sec - in org.apache.activemq.management.BoundedRangeStatisticTest
Running org.apache.activemq.management.CountStatisticTest
Tests run: 1, Failures: 0, Errors: 0, Skipped: 0, Time elapsed: 0.662 sec - in org.apache.activemq.management.CountStatisticTest
Running org.apache.activemq.management.RangeStatisticTest
Tests run: 1, Failures: 0, Errors: 0, Skipped: 0, Time elapsed: 0.661 sec - in org.apache.activemq.management.RangeStatisticTest
Running org.apache.activemq.management.TimeStatisticTest
Tests run: 1, Failures: 0, Errors: 0, Skipped: 0, Time elapsed: 0.661 sec - in org.apache.activemq.management.TimeStatisticTest
Running org.apache.activemq.memory.MemoryPropertyTest
Tests run: 1, Failures: 0, Errors: 0, Skipped: 0, Time elapsed: 1.776 sec - in org.apache.activemq.memory.MemoryPropertyTest
Running org.apache.activemq.memory.buffer.OrderBasedMemoryBufferTest
Tests run: 1, Failures: 0, Errors: 0, Skipped: 0, Time elapsed: 0.204 sec - in org.apache.activemq.memory.buffer.OrderBasedMemoryBufferTest
Running org.apache.activemq.memory.buffer.SizeBasedMessageBufferTest
Tests run: 1, Failures: 0, Errors: 0, Skipped: 0, Time elapsed: 0.177 sec - in org.apache.activemq.memory.buffer.SizeBasedMessageBufferTest
Running org.apache.activemq.network.CheckDuplicateMessagesOnDuplexTest
Tests run: 1, Failures: 0, Errors: 0, Skipped: 0, Time elapsed: 12.52 sec - in org.apache.activemq.network.CheckDuplicateMessagesOnDuplexTest
Running org.apache.activemq.network.CompressionOverNetworkTest
Tests run: 6, Failures: 0, Errors: 0, Skipped: 0, Time elapsed: 25.348 sec - in org.apache.activemq.network.CompressionOverNetworkTest
Running org.apache.activemq.network.DemandForwardingBridgeTest
Tests run: 6, Failures: 0, Errors: 0, Skipped: 0, Time elapsed: 4.97 sec - in org.apache.activemq.network.DemandForwardingBridgeTest
Running org.apache.activemq.network.DynamicallyIncludedDestinationsDuplexNetworkTest
Tests run: 7, Failures: 0, Errors: 0, Skipped: 0, Time elapsed: 37.287 sec - in org.apache.activemq.network.DynamicallyIncludedDestinationsDuplexNetworkTest
Running org.apache.activemq.network.ForwardingBridgeTest
Tests run: 8, Failures: 0, Errors: 0, Skipped: 0, Time elapsed: 19.747 sec - in org.apache.activemq.network.ForwardingBridgeTest
Running org.apache.activemq.network.NetworkDestinationFilterTest
Tests run: 1, Failures: 0, Errors: 0, Skipped: 0, Time elapsed: 0.166 sec - in org.apache.activemq.network.NetworkDestinationFilterTest
Running org.apache.activemq.network.NetworkLoopBackTest
Tests run: 1, Failures: 0, Errors: 0, Skipped: 0, Time elapsed: 3.028 sec - in org.apache.activemq.network.NetworkLoopBackTest
Running org.apache.activemq.network.NetworkRouteTest
Tests run: 3, Failures: 0, Errors: 0, Skipped: 0, Time elapsed: 0.954 sec - in org.apache.activemq.network.NetworkRouteTest
Running org.apache.activemq.openwire.BooleanStreamTest
Tests run: 4, Failures: 0, Errors: 0, Skipped: 0, Time elapsed: 1.464 sec - in org.apache.activemq.openwire.BooleanStreamTest
Running org.apache.activemq.openwire.ItStillMarshallsTheSameTest
Tests run: 1, Failures: 0, Errors: 0, Skipped: 0, Time elapsed: 0.206 sec - in org.apache.activemq.openwire.ItStillMarshallsTheSameTest
Running org.apache.activemq.openwire.NumberRangesWhileMarshallingTest
Tests run: 3, Failures: 0, Errors: 0, Skipped: 0, Time elapsed: 0.262 sec - in org.apache.activemq.openwire.NumberRangesWhileMarshallingTest
Running org.apache.activemq.pool.JmsSendReceiveTwoConnectionsWithSenderUsingPoolTest
Tests run: 1, Failures: 0, Errors: 0, Skipped: 0, Time elapsed: 2.202 sec - in org.apache.activemq.pool.JmsSendReceiveTwoConnectionsWithSenderUsingPoolTest
Running org.apache.activemq.proxy.AMQ4889Test
Tests run: 1, Failures: 0, Errors: 0, Skipped: 0, Time elapsed: 1.983 sec - in org.apache.activemq.proxy.AMQ4889Test
Running org.apache.activemq.security.AuthorizationMapTest
Tests run: 4, Failures: 0, Errors: 0, Skipped: 0, Time elapsed: 0.08 sec - in org.apache.activemq.security.AuthorizationMapTest
Running org.apache.activemq.security.CachedLDAPAuthorizationModuleLegacyOpenLDAPTest
Tests run: 1, Failures: 0, Errors: 0, Skipped: 1, Time elapsed: 0.035 sec - in org.apache.activemq.security.CachedLDAPAuthorizationModuleLegacyOpenLDAPTest
Running org.apache.activemq.security.CachedLDAPAuthorizationModuleLegacyTest
Tests run: 12, Failures: 0, Errors: 0, Skipped: 0, Time elapsed: 31.788 sec - in org.apache.activemq.security.CachedLDAPAuthorizationModuleLegacyTest
Running org.apache.activemq.security.CachedLDAPAuthorizationModuleOpenLDAPTest
Tests run: 1, Failures: 0, Errors: 0, Skipped: 1, Time elapsed: 0.035 sec - in org.apache.activemq.security.CachedLDAPAuthorizationModuleOpenLDAPTest
Running org.apache.activemq.security.CachedLDAPAuthorizationModuleTest
Tests run: 12, Failures: 0, Errors: 0, Skipped: 0, Time elapsed: 33.775 sec - in org.apache.activemq.security.CachedLDAPAuthorizationModuleTest
Running org.apache.activemq.security.CachedLDAPSecurityLegacyTest
Tests run: 4, Failures: 0, Errors: 0, Skipped: 0, Time elapsed: 6.694 sec - in org.apache.activemq.security.CachedLDAPSecurityLegacyTest
Running org.apache.activemq.security.CachedLDAPSecurityTest
Tests run: 4, Failures: 0, Errors: 0, Skipped: 0, Time elapsed: 7.099 sec - in org.apache.activemq.security.CachedLDAPSecurityTest
Running org.apache.activemq.security.JaasCertificateAuthenticationBrokerTest
Tests run: 3, Failures: 0, Errors: 0, Skipped: 0, Time elapsed: 0.159 sec - in org.apache.activemq.security.JaasCertificateAuthenticationBrokerTest
Running org.apache.activemq.security.JaasDualAuthenticationBrokerTest
Tests run: 2, Failures: 0, Errors: 0, Skipped: 0, Time elapsed: 0.229 sec - in org.apache.activemq.security.JaasDualAuthenticationBrokerTest
Running org.apache.activemq.security.LDAPAuthorizationMapTest
Tests run: 7, Failures: 0, Errors: 0, Skipped: 0, Time elapsed: 5.604 sec - in org.apache.activemq.security.LDAPAuthorizationMapTest
Running org.apache.activemq.security.SimpleAnonymousPluginTest
Tests run: 45, Failures: 0, Errors: 0, Skipped: 0, Time elapsed: 26.429 sec - in org.apache.activemq.security.SimpleAnonymousPluginTest
Running org.apache.activemq.security.SimpleAuthenticationPluginSeparatorTest
Tests run: 29, Failures: 0, Errors: 0, Skipped: 0, Time elapsed: 19.206 sec - in org.apache.activemq.security.SimpleAuthenticationPluginSeparatorTest
Running org.apache.activemq.security.SimpleAuthenticationPluginTest
Tests run: 33, Failures: 0, Errors: 0, Skipped: 0, Time elapsed: 21.819 sec - in org.apache.activemq.security.SimpleAuthenticationPluginTest
Running org.apache.activemq.security.SimpleAuthorizationMapTest
Tests run: 4, Failures: 0, Errors: 0, Skipped: 0, Time elapsed: 0.186 sec - in org.apache.activemq.security.SimpleAuthorizationMapTest
Running org.apache.activemq.security.SimpleSecurityBrokerSystemTest
[JENKINS] Recording test results
Results :

Failed tests: 

  BrokerRedeliveryTest>CombinationTestSupport.runBare:113->CombinationTestSupport.runBare:107->testInfiniteRedelivery:53->doTestScheduledRedelivery:82
got message via broker redelivery after delay
  BrokerRedeliveryTest>CombinationTestSupport.runBare:113->CombinationTestSupport.runBare:107->testScheduledRedelivery:47->doTestScheduledRedelivery:76
did not get message after redelivery count exceeded: ActiveMQMessage {commandId = 5, responseRequired
= true, messageId = ID:quirinus.apache.org-53919-1397283184376-7:1:1:1:1, originalDestination
= null, originalTransactionId = null, producerId = ID:quirinus.apache.org-53919-1397283184376-7:1:1:1,
destination = queue://Redelivery, transactionId = null, expiration = 0, timestamp = 1397283212346,
arrival = 0, brokerInTime = 1397283212346, brokerOutTime = 1397283212443, correlationId =
null, replyTo = null, persistent = true, type = null, priority = 4, groupID = null, groupSequence
= 0, targetConsumerId = null, compressed = false, userID = null, content = null, marshalledProperties
= org.apache.activemq.util.ByteSequence@2ff9fa, dataStructure = null, redeliveryCounter =
0, size = 1024, properties = {data=hi}, readOnlyProperties = true, readOnlyBody = true, droppable
= false, jmsXGroupFirstForConsumer = false}
  AMQ2149LevelDBTest>AMQ2149Test.testQueueTransactionalOrderWithRestart:412->AMQ2149Test.doTestTransactionalOrderWithRestart:435->AMQ2149Test.verifyOrderedMessageReceipt:549
No timeout waiting for senders/receivers to complete
  AMQ2149LevelDBTest>AMQ2149Test.testTopicOrderWithRestart:402->AMQ2149Test.verifyOrderedMessageReceipt:501->AMQ2149Test.verifyOrderedMessageReceipt:560
No exceptions
  AMQ2149LevelDBTest>AMQ2149Test.testTopicTransactionalOrderWithRestart:417->AMQ2149Test.doTestTransactionalOrderWithRestart:435->AMQ2149Test.verifyOrderedMessageReceipt:549
No timeout waiting for senders/receivers to complete
  AMQ4368Test.testENTMQ220:220 No messages received on iteration: 8
  AMQ4930Test.testBrowsePendingNonPersistent:61->doTestBrowsePending:108 No growth: 110920
  AMQ4952Test.testConsumerBrokerRestart:226 number of messages received expected:<2>
but was:<1>
  TransactedStoreUsageSuspendResumeTest.testTransactedStoreUsageSuspendResume:143 Got all
messages: java.util.concurrent.CountDownLatch@ae8c15[Count = 10000]

Tests in error: 
  AMQ2149LevelDBTest>AMQ2149Test.testOrderWithRestart:382->AMQ2149Test.verifyOrderedMessageReceipt:505->AMQ2149Test.verifyOrderedMessageReceipt:544
? 

Tests run: 1861, Failures: 9, Errors: 1, Skipped: 6

Tests run: 60, Failures: 0, Errors: 0, Skipped: 0, Time elapsed: 20.336 sec - in org.apache.activemq.security.SimpleSecurityBrokerSystemTest

Mime
View raw message