activemq-commits mailing list archives

Site index · List index
Message view « Date » · « Thread »
Top « Date » · « Thread »
From Apache Jenkins Server <jenk...@builds.apache.org>
Subject Build failed in Jenkins: ActiveMQ-Java7 » ActiveMQ :: Unit Tests #287
Date Wed, 12 Mar 2014 06:00:47 GMT
See <https://builds.apache.org/job/ActiveMQ-Java7/org.apache.activemq$activemq-unit-tests/287/changes>

Changes:

[gtully] https://issues.apache.org/jira/browse/AMQ-5087 fix and test

[hadrian] [minor] Use MemoryPersistenceAdapter for testing when choice of persistence adapter
is indifferent

[gtully] https://issues.apache.org/jira/browse/AMQ-5087 - fix up test use of initial delay

[gtully] https://issues.apache.org/jira/browse/AMQ-4656 - fix regression for FilePendingDurableSubscriberMessageStoragePolicy

------------------------------------------
[...truncated 621 lines...]
Running org.apache.activemq.jndi.ObjectFactoryTest
Tests run: 2, Failures: 0, Errors: 0, Skipped: 0, Time elapsed: 0.264 sec - in org.apache.activemq.jndi.ObjectFactoryTest
Running org.apache.activemq.jndi.XAConnectionFactoryTest
Tests run: 4, Failures: 0, Errors: 0, Skipped: 0, Time elapsed: 0.28 sec - in org.apache.activemq.jndi.XAConnectionFactoryTest
Running org.apache.activemq.joramtests.JoramJmsTest
Tests run: 196, Failures: 0, Errors: 0, Skipped: 0, Time elapsed: 14.253 sec - in org.apache.activemq.joramtests.JoramJmsTest
Running org.apache.activemq.leveldb.LevelDBStoreBrokerTest
Tests run: 129, Failures: 0, Errors: 0, Skipped: 0, Time elapsed: 58.297 sec - in org.apache.activemq.leveldb.LevelDBStoreBrokerTest
Running org.apache.activemq.management.BoundaryStatisticTest
Tests run: 1, Failures: 0, Errors: 0, Skipped: 0, Time elapsed: 0.17 sec - in org.apache.activemq.management.BoundaryStatisticTest
Running org.apache.activemq.management.BoundedRangeStatisticTest
Tests run: 1, Failures: 0, Errors: 0, Skipped: 0, Time elapsed: 0.671 sec - in org.apache.activemq.management.BoundedRangeStatisticTest
Running org.apache.activemq.management.CountStatisticTest
Tests run: 1, Failures: 0, Errors: 0, Skipped: 0, Time elapsed: 0.67 sec - in org.apache.activemq.management.CountStatisticTest
Running org.apache.activemq.management.RangeStatisticTest
Tests run: 1, Failures: 0, Errors: 0, Skipped: 0, Time elapsed: 0.675 sec - in org.apache.activemq.management.RangeStatisticTest
Running org.apache.activemq.management.TimeStatisticTest
Tests run: 1, Failures: 0, Errors: 0, Skipped: 0, Time elapsed: 0.67 sec - in org.apache.activemq.management.TimeStatisticTest
Running org.apache.activemq.memory.MemoryPropertyTest
Tests run: 1, Failures: 0, Errors: 0, Skipped: 0, Time elapsed: 1.817 sec - in org.apache.activemq.memory.MemoryPropertyTest
Running org.apache.activemq.memory.buffer.OrderBasedMemoryBufferTest
Tests run: 1, Failures: 0, Errors: 0, Skipped: 0, Time elapsed: 0.192 sec - in org.apache.activemq.memory.buffer.OrderBasedMemoryBufferTest
Running org.apache.activemq.memory.buffer.SizeBasedMessageBufferTest
Tests run: 1, Failures: 0, Errors: 0, Skipped: 0, Time elapsed: 0.191 sec - in org.apache.activemq.memory.buffer.SizeBasedMessageBufferTest
Running org.apache.activemq.network.CheckDuplicateMessagesOnDuplexTest
Tests run: 1, Failures: 0, Errors: 0, Skipped: 0, Time elapsed: 12.023 sec - in org.apache.activemq.network.CheckDuplicateMessagesOnDuplexTest
Running org.apache.activemq.network.CompressionOverNetworkTest
Tests run: 6, Failures: 0, Errors: 0, Skipped: 0, Time elapsed: 16.166 sec - in org.apache.activemq.network.CompressionOverNetworkTest
Running org.apache.activemq.network.DemandForwardingBridgeTest
Tests run: 6, Failures: 0, Errors: 0, Skipped: 0, Time elapsed: 4.994 sec - in org.apache.activemq.network.DemandForwardingBridgeTest
Running org.apache.activemq.network.DynamicallyIncludedDestinationsDuplexNetworkTest
Tests run: 7, Failures: 0, Errors: 0, Skipped: 0, Time elapsed: 25.157 sec - in org.apache.activemq.network.DynamicallyIncludedDestinationsDuplexNetworkTest
Running org.apache.activemq.network.ForwardingBridgeTest
Tests run: 8, Failures: 0, Errors: 0, Skipped: 0, Time elapsed: 17.019 sec - in org.apache.activemq.network.ForwardingBridgeTest
Running org.apache.activemq.network.NetworkDestinationFilterTest
Tests run: 1, Failures: 0, Errors: 0, Skipped: 0, Time elapsed: 0.174 sec - in org.apache.activemq.network.NetworkDestinationFilterTest
Running org.apache.activemq.network.NetworkLoopBackTest
Tests run: 1, Failures: 0, Errors: 0, Skipped: 0, Time elapsed: 3.016 sec - in org.apache.activemq.network.NetworkLoopBackTest
Running org.apache.activemq.network.NetworkRouteTest
Tests run: 3, Failures: 0, Errors: 0, Skipped: 0, Time elapsed: 0.947 sec - in org.apache.activemq.network.NetworkRouteTest
Running org.apache.activemq.openwire.BooleanStreamTest
Tests run: 4, Failures: 0, Errors: 0, Skipped: 0, Time elapsed: 1.358 sec - in org.apache.activemq.openwire.BooleanStreamTest
Running org.apache.activemq.openwire.ItStillMarshallsTheSameTest
Tests run: 1, Failures: 0, Errors: 0, Skipped: 0, Time elapsed: 0.175 sec - in org.apache.activemq.openwire.ItStillMarshallsTheSameTest
Running org.apache.activemq.openwire.NumberRangesWhileMarshallingTest
Tests run: 3, Failures: 0, Errors: 0, Skipped: 0, Time elapsed: 0.277 sec - in org.apache.activemq.openwire.NumberRangesWhileMarshallingTest
Running org.apache.activemq.pool.JmsSendReceiveTwoConnectionsWithSenderUsingPoolTest
Tests run: 1, Failures: 0, Errors: 0, Skipped: 0, Time elapsed: 2.255 sec - in org.apache.activemq.pool.JmsSendReceiveTwoConnectionsWithSenderUsingPoolTest
Running org.apache.activemq.proxy.AMQ4889Test
Tests run: 1, Failures: 1, Errors: 0, Skipped: 0, Time elapsed: 4.42 sec <<< FAILURE!
- in org.apache.activemq.proxy.AMQ4889Test
testForConnectionLeak(org.apache.activemq.proxy.AMQ4889Test)  Time elapsed: 4.228 sec  <<<
FAILURE!
java.lang.AssertionError: expected:<27> but was:<28>
	at org.junit.Assert.fail(Assert.java:88)
	at org.junit.Assert.failNotEquals(Assert.java:743)
	at org.junit.Assert.assertEquals(Assert.java:118)
	at org.junit.Assert.assertEquals(Assert.java:144)
	at org.apache.activemq.proxy.AMQ4889Test.testForConnectionLeak(AMQ4889Test.java:108)

Running org.apache.activemq.security.AuthorizationMapTest
Tests run: 4, Failures: 0, Errors: 0, Skipped: 0, Time elapsed: 0.084 sec - in org.apache.activemq.security.AuthorizationMapTest
Running org.apache.activemq.security.CachedLDAPAuthorizationModuleLegacyOpenLDAPTest
Tests run: 1, Failures: 0, Errors: 0, Skipped: 1, Time elapsed: 0.038 sec - in org.apache.activemq.security.CachedLDAPAuthorizationModuleLegacyOpenLDAPTest
Running org.apache.activemq.security.CachedLDAPAuthorizationModuleLegacyTest
Tests run: 12, Failures: 0, Errors: 0, Skipped: 0, Time elapsed: 33.29 sec - in org.apache.activemq.security.CachedLDAPAuthorizationModuleLegacyTest
Running org.apache.activemq.security.CachedLDAPAuthorizationModuleOpenLDAPTest
Tests run: 1, Failures: 0, Errors: 0, Skipped: 1, Time elapsed: 0.038 sec - in org.apache.activemq.security.CachedLDAPAuthorizationModuleOpenLDAPTest
Running org.apache.activemq.security.CachedLDAPAuthorizationModuleTest
Tests run: 12, Failures: 0, Errors: 0, Skipped: 0, Time elapsed: 29.022 sec - in org.apache.activemq.security.CachedLDAPAuthorizationModuleTest
Running org.apache.activemq.security.CachedLDAPSecurityLegacyTest
Tests run: 4, Failures: 0, Errors: 0, Skipped: 0, Time elapsed: 6.825 sec - in org.apache.activemq.security.CachedLDAPSecurityLegacyTest
Running org.apache.activemq.security.CachedLDAPSecurityTest
Tests run: 4, Failures: 0, Errors: 0, Skipped: 0, Time elapsed: 6.965 sec - in org.apache.activemq.security.CachedLDAPSecurityTest
Running org.apache.activemq.security.JaasCertificateAuthenticationBrokerTest
Tests run: 3, Failures: 0, Errors: 0, Skipped: 0, Time elapsed: 0.096 sec - in org.apache.activemq.security.JaasCertificateAuthenticationBrokerTest
Running org.apache.activemq.security.JaasDualAuthenticationBrokerTest
Tests run: 2, Failures: 0, Errors: 0, Skipped: 0, Time elapsed: 0.215 sec - in org.apache.activemq.security.JaasDualAuthenticationBrokerTest
Running org.apache.activemq.security.LDAPAuthorizationMapTest
Tests run: 7, Failures: 0, Errors: 0, Skipped: 0, Time elapsed: 4.775 sec - in org.apache.activemq.security.LDAPAuthorizationMapTest
Running org.apache.activemq.security.SimpleAnonymousPluginTest
Tests run: 45, Failures: 0, Errors: 0, Skipped: 0, Time elapsed: 27.3 sec - in org.apache.activemq.security.SimpleAnonymousPluginTest
Running org.apache.activemq.security.SimpleAuthenticationPluginSeparatorTest
Tests run: 29, Failures: 0, Errors: 0, Skipped: 0, Time elapsed: 18.991 sec - in org.apache.activemq.security.SimpleAuthenticationPluginSeparatorTest
Running org.apache.activemq.security.SimpleAuthenticationPluginTest
Tests run: 33, Failures: 0, Errors: 0, Skipped: 0, Time elapsed: 21.668 sec - in org.apache.activemq.security.SimpleAuthenticationPluginTest
Running org.apache.activemq.security.SimpleAuthorizationMapTest
Tests run: 4, Failures: 0, Errors: 0, Skipped: 0, Time elapsed: 0.188 sec - in org.apache.activemq.security.SimpleAuthorizationMapTest
Running org.apache.activemq.security.SimpleSecurityBrokerSystemTest
Tests run: 60, Failures: 0, Errors: 0, Skipped: 0, Time elapsed: 21.075 sec - in org.apache.activemq.security.SimpleSecurityBrokerSystemTest
Running org.apache.activemq.security.XBeanSecurityTest
Tests run: 29, Failures: 0, Errors: 0, Skipped: 0, Time elapsed: 13.413 sec - in org.apache.activemq.security.XBeanSecurityTest
Running org.apache.activemq.security.XBeanSecurityWithGuestTest
Tests run: 7, Failures: 0, Errors: 0, Skipped: 0, Time elapsed: 2.927 sec - in org.apache.activemq.security.XBeanSecurityWithGuestTest
Running org.apache.activemq.selector.SelectorParserTest
Tests run: 3, Failures: 0, Errors: 0, Skipped: 0, Time elapsed: 0.392 sec - in org.apache.activemq.selector.SelectorParserTest
Running org.apache.activemq.selector.SelectorTest
Tests run: 21, Failures: 0, Errors: 0, Skipped: 0, Time elapsed: 0.526 sec - in org.apache.activemq.selector.SelectorTest
Running org.apache.activemq.spring.ActiveMQConnectionFactoryFactoryBeanTest
Tests run: 6, Failures: 0, Errors: 0, Skipped: 0, Time elapsed: 0.238 sec - in org.apache.activemq.spring.ActiveMQConnectionFactoryFactoryBeanTest
Running org.apache.activemq.spring.SpringTest
Tests run: 7, Failures: 0, Errors: 0, Skipped: 0, Time elapsed: 14.87 sec - in org.apache.activemq.spring.SpringTest
Running org.apache.activemq.store.LevelDBStorePerDestinationTest
Tests run: 6, Failures: 0, Errors: 0, Skipped: 0, Time elapsed: 28.99 sec - in org.apache.activemq.store.LevelDBStorePerDestinationTest
Running org.apache.activemq.store.jdbc.DatabaseLockerConfigTest
Tests run: 4, Failures: 0, Errors: 0, Skipped: 0, Time elapsed: 0.191 sec - in org.apache.activemq.store.jdbc.DatabaseLockerConfigTest
Running org.apache.activemq.store.jdbc.JDBCIOExceptionHandlerMockeryTest
Tests run: 1, Failures: 0, Errors: 0, Skipped: 0, Time elapsed: 1.913 sec - in org.apache.activemq.store.jdbc.JDBCIOExceptionHandlerMockeryTest
Running org.apache.activemq.store.jdbc.JDBCIOExceptionHandlerTest
Tests run: 2, Failures: 0, Errors: 0, Skipped: 0, Time elapsed: 23.852 sec - in org.apache.activemq.store.jdbc.JDBCIOExceptionHandlerTest
Running org.apache.activemq.store.jdbc.JDBCLockTablePrefixTest
Tests run: 1, Failures: 0, Errors: 0, Skipped: 0, Time elapsed: 10.615 sec - in org.apache.activemq.store.jdbc.JDBCLockTablePrefixTest
Running org.apache.activemq.store.jdbc.JDBCTablePrefixAssignedTest
Tests run: 1, Failures: 0, Errors: 0, Skipped: 0, Time elapsed: 5.904 sec - in org.apache.activemq.store.jdbc.JDBCTablePrefixAssignedTest
Running org.apache.activemq.store.jdbc.LeaseDatabaseLockerTest
Tests run: 5, Failures: 0, Errors: 0, Skipped: 0, Time elapsed: 58.163 sec - in org.apache.activemq.store.jdbc.LeaseDatabaseLockerTest
Running org.apache.activemq.store.kahadb.CustomLockerTest
Tests run: 1, Failures: 0, Errors: 0, Skipped: 0, Time elapsed: 2.414 sec - in org.apache.activemq.store.kahadb.CustomLockerTest
Running org.apache.activemq.store.kahadb.KahaDBPersistenceAdapterTest
Tests run: 2, Failures: 0, Errors: 0, Skipped: 0, Time elapsed: 2.785 sec - in org.apache.activemq.store.kahadb.KahaDBPersistenceAdapterTest
Running org.apache.activemq.store.kahadb.KahaDBStoreBrokerTest
Tests run: 129, Failures: 0, Errors: 0, Skipped: 0, Time elapsed: 104.847 sec - in org.apache.activemq.store.kahadb.KahaDBStoreBrokerTest
Running org.apache.activemq.store.kahadb.KahaDBStoreOrderTest
Tests run: 2, Failures: 0, Errors: 0, Skipped: 0, Time elapsed: 4.479 sec - in org.apache.activemq.store.kahadb.KahaDBStoreOrderTest
Running org.apache.activemq.store.kahadb.NoSpaceIOTest
Tests run: 1, Failures: 0, Errors: 0, Skipped: 1, Time elapsed: 0.085 sec - in org.apache.activemq.store.kahadb.NoSpaceIOTest
Running org.apache.activemq.store.kahadb.PBMesssagesTest
Tests run: 1, Failures: 0, Errors: 0, Skipped: 0, Time elapsed: 0.077 sec - in org.apache.activemq.store.kahadb.PBMesssagesTest
Running org.apache.activemq.store.kahadb.TempKahaDBStoreBrokerTest
Tests run: 129, Failures: 0, Errors: 0, Skipped: 0, Time elapsed: 124.52 sec - in org.apache.activemq.store.kahadb.TempKahaDBStoreBrokerTest
Running org.apache.activemq.store.kahadb.plist.KahaDBFilePendingMessageCursorTest
Tests run: 3, Failures: 0, Errors: 0, Skipped: 0, Time elapsed: 3.767 sec - in org.apache.activemq.store.kahadb.plist.KahaDBFilePendingMessageCursorTest
Running org.apache.activemq.store.leveldb.LevelDBNegativeQueueTest
Tests run: 4, Failures: 0, Errors: 0, Skipped: 0, Time elapsed: 159.52 sec - in org.apache.activemq.store.leveldb.LevelDBNegativeQueueTest
Running org.apache.activemq.store.leveldb.LevelDBStoreBrokerTest
Tests run: 129, Failures: 0, Errors: 0, Skipped: 0, Time elapsed: 58.09 sec - in org.apache.activemq.store.leveldb.LevelDBStoreBrokerTest
Running org.apache.activemq.streams.JMSInputStreamTest
Tests run: 10, Failures: 0, Errors: 0, Skipped: 0, Time elapsed: 3.636 sec - in org.apache.activemq.streams.JMSInputStreamTest
Running org.apache.activemq.test.JmsTopicSendReceiveTest
Tests run: 1, Failures: 0, Errors: 0, Skipped: 0, Time elapsed: 2.116 sec - in org.apache.activemq.test.JmsTopicSendReceiveTest
Running org.apache.activemq.test.JmsTopicSendReceiveWithTwoConnectionsAndByteSelectorTest
Tests run: 1, Failures: 0, Errors: 0, Skipped: 0, Time elapsed: 2.169 sec - in org.apache.activemq.test.JmsTopicSendReceiveWithTwoConnectionsAndByteSelectorTest
Running org.apache.activemq.test.JmsTopicSendReceiveWithTwoConnectionsTest
Tests run: 1, Failures: 0, Errors: 0, Skipped: 0, Time elapsed: 2.159 sec - in org.apache.activemq.test.JmsTopicSendReceiveWithTwoConnectionsTest
Running org.apache.activemq.test.TemporaryDestinationToFromNameTest
Tests run: 2, Failures: 0, Errors: 0, Skipped: 0, Time elapsed: 1.14 sec - in org.apache.activemq.test.TemporaryDestinationToFromNameTest
Running org.apache.activemq.test.retroactive.RetroactiveConsumerTestWithDestinationBasedBufferTest
Tests run: 1, Failures: 0, Errors: 0, Skipped: 0, Time elapsed: 1.951 sec - in org.apache.activemq.test.retroactive.RetroactiveConsumerTestWithDestinationBasedBufferTest
Running org.apache.activemq.test.retroactive.RetroactiveConsumerTestWithLastImagePolicyWithWildcardTest
Tests run: 1, Failures: 0, Errors: 0, Skipped: 0, Time elapsed: 2.087 sec - in org.apache.activemq.test.retroactive.RetroactiveConsumerTestWithLastImagePolicyWithWildcardTest
Running org.apache.activemq.test.retroactive.RetroactiveConsumerTestWithSimpleMessageListTest
Tests run: 1, Failures: 0, Errors: 0, Skipped: 0, Time elapsed: 1.993 sec - in org.apache.activemq.test.retroactive.RetroactiveConsumerTestWithSimpleMessageListTest
Running org.apache.activemq.test.retroactive.RetroactiveConsumerTestWithTimePolicyTest
Tests run: 1, Failures: 0, Errors: 0, Skipped: 0, Time elapsed: 1.976 sec - in org.apache.activemq.test.retroactive.RetroactiveConsumerTestWithTimePolicyTest
Running org.apache.activemq.test.retroactive.RetroactiveConsumerWithMessageQueryTest
Tests run: 1, Failures: 0, Errors: 0, Skipped: 0, Time elapsed: 1.953 sec - in org.apache.activemq.test.retroactive.RetroactiveConsumerWithMessageQueryTest
Running org.apache.activemq.test.rollback.CloseRollbackRedeliveryQueueTest
Tests run: 3, Failures: 0, Errors: 0, Skipped: 0, Time elapsed: 1.366 sec - in org.apache.activemq.test.rollback.CloseRollbackRedeliveryQueueTest
Running org.apache.activemq.transport.failover.BadConnectionTest
Tests run: 1, Failures: 0, Errors: 0, Skipped: 0, Time elapsed: 0.768 sec - in org.apache.activemq.transport.failover.BadConnectionTest
Running org.apache.activemq.transport.failover.FailoverBackupLeakTest
Tests run: 2, Failures: 0, Errors: 0, Skipped: 0, Time elapsed: 1.102 sec - in org.apache.activemq.transport.failover.FailoverBackupLeakTest
Running org.apache.activemq.transport.failover.FailoverTransportTest
Tests run: 3, Failures: 0, Errors: 0, Skipped: 1, Time elapsed: 0.324 sec - in org.apache.activemq.transport.failover.FailoverTransportTest
Running org.apache.activemq.transport.failover.FailoverTransportUriHandlingTest
Tests run: 4, Failures: 0, Errors: 0, Skipped: 0, Time elapsed: 0.299 sec - in org.apache.activemq.transport.failover.FailoverTransportUriHandlingTest
Running org.apache.activemq.transport.failover.FailoverUriTest
Tests run: 16, Failures: 0, Errors: 0, Skipped: 0, Time elapsed: 1.35 sec - in org.apache.activemq.transport.failover.FailoverUriTest
Running org.apache.activemq.transport.failover.SlowConnectionTest
Tests run: 1, Failures: 0, Errors: 0, Skipped: 0, Time elapsed: 1.5 sec - in org.apache.activemq.transport.failover.SlowConnectionTest
Running org.apache.activemq.transport.failover.TwoBrokerFailoverClusterTest
Tests run: 1, Failures: 0, Errors: 0, Skipped: 0, Time elapsed: 19.438 sec - in org.apache.activemq.transport.failover.TwoBrokerFailoverClusterTest
Running org.apache.activemq.transport.reliable.ReliableTransportTest
Tests run: 7, Failures: 0, Errors: 0, Skipped: 0, Time elapsed: 0.186 sec - in org.apache.activemq.transport.reliable.ReliableTransportTest
Running org.apache.activemq.transport.tcp.QualityOfServiceUtilsTest
Tests run: 6, Failures: 0, Errors: 0, Skipped: 0, Time elapsed: 0.063 sec - in org.apache.activemq.transport.tcp.QualityOfServiceUtilsTest
Running org.apache.activemq.transport.tcp.SslTransportFactoryTest
Tests run: 2, Failures: 0, Errors: 0, Skipped: 0, Time elapsed: 0.733 sec - in org.apache.activemq.transport.tcp.SslTransportFactoryTest
Running org.apache.activemq.transport.tcp.SslTransportServerTest
Tests run: 2, Failures: 0, Errors: 0, Skipped: 0, Time elapsed: 0.187 sec - in org.apache.activemq.transport.tcp.SslTransportServerTest
Running org.apache.activemq.transport.tcp.SslTransportTest
Tests run: 1, Failures: 0, Errors: 0, Skipped: 0, Time elapsed: 0.187 sec - in org.apache.activemq.transport.tcp.SslTransportTest
Running org.apache.activemq.transport.tcp.TcpTransportBindTest
Tests run: 2, Failures: 0, Errors: 1, Skipped: 0, Time elapsed: 2.26 sec <<< FAILURE!
- in org.apache.activemq.transport.tcp.TcpTransportBindTest
testConnect(org.apache.activemq.transport.tcp.TcpTransportBindTest)  Time elapsed: 0.049 sec
 <<< ERROR!
javax.management.InstanceAlreadyExistsException: org.apache.activemq:type=Broker,brokerName=localhost
	at com.sun.jmx.mbeanserver.Repository.addMBean(Repository.java:437)
	at com.sun.jmx.interceptor.DefaultMBeanServerInterceptor.registerWithRepository(DefaultMBeanServerInterceptor.java:1898)
	at com.sun.jmx.interceptor.DefaultMBeanServerInterceptor.registerDynamicMBean(DefaultMBeanServerInterceptor.java:966)
	at com.sun.jmx.interceptor.DefaultMBeanServerInterceptor.registerObject(DefaultMBeanServerInterceptor.java:900)
	at com.sun.jmx.interceptor.DefaultMBeanServerInterceptor.registerMBean(DefaultMBeanServerInterceptor.java:324)
	at com.sun.jmx.mbeanserver.JmxMBeanServer.registerMBean(JmxMBeanServer.java:522)
	at org.apache.activemq.broker.jmx.ManagementContext.registerMBean(ManagementContext.java:380)
	at org.apache.activemq.broker.jmx.AnnotatedMBean.registerMBean(AnnotatedMBean.java:72)
	at org.apache.activemq.broker.BrokerService.startManagementContext(BrokerService.java:2434)
	at org.apache.activemq.broker.BrokerService.start(BrokerService.java:580)
	at org.apache.activemq.EmbeddedBrokerTestSupport.startBroker(EmbeddedBrokerTestSupport.java:124)
	at org.apache.activemq.EmbeddedBrokerTestSupport.setUp(EmbeddedBrokerTestSupport.java:47)
	at org.apache.activemq.transport.tcp.TcpTransportBindTest.setUp(TcpTransportBindTest.java:39)

Running org.apache.activemq.transport.tcp.TcpTransportServerTest
Tests run: 1, Failures: 0, Errors: 0, Skipped: 0, Time elapsed: 0.309 sec - in org.apache.activemq.transport.tcp.TcpTransportServerTest
Running org.apache.activemq.transport.tcp.TransportConnectorInvalidSocketOptionsTest
Tests run: 2, Failures: 0, Errors: 0, Skipped: 0, Time elapsed: 1.017 sec - in org.apache.activemq.transport.tcp.TransportConnectorInvalidSocketOptionsTest
Running org.apache.activemq.transport.tcp.TransportUriTest
Tests run: 14, Failures: 0, Errors: 0, Skipped: 0, Time elapsed: 1.318 sec - in org.apache.activemq.transport.tcp.TransportUriTest
Running org.apache.activemq.transport.tcp.WireformatNegociationTest
Tests run: 5, Failures: 0, Errors: 0, Skipped: 0, Time elapsed: 0.434 sec - in org.apache.activemq.transport.tcp.WireformatNegociationTest
Running org.apache.activemq.transport.udp.UdpSendReceiveWithTwoConnectionsAndLargeMessagesTest
Tests run: 1, Failures: 0, Errors: 0, Skipped: 0, Time elapsed: 2.036 sec - in org.apache.activemq.transport.udp.UdpSendReceiveWithTwoConnectionsAndLargeMessagesTest
Running org.apache.activemq.transport.udp.UdpSendReceiveWithTwoConnectionsTest
Tests run: 1, Failures: 0, Errors: 0, Skipped: 0, Time elapsed: 2.068 sec - in org.apache.activemq.transport.udp.UdpSendReceiveWithTwoConnectionsTest
Running org.apache.activemq.transport.udp.UdpTransportTest
Tests run: 3, Failures: 0, Errors: 0, Skipped: 0, Time elapsed: 0.318 sec - in org.apache.activemq.transport.udp.UdpTransportTest
Running org.apache.activemq.transport.udp.UdpTransportUsingServerTest
Tests run: 4, Failures: 0, Errors: 0, Skipped: 0, Time elapsed: 0.459 sec - in org.apache.activemq.transport.udp.UdpTransportUsingServerTest
Running org.apache.activemq.transport.udp.UpdTransportBindTest
Tests run: 1, Failures: 0, Errors: 0, Skipped: 0, Time elapsed: 1.061 sec - in org.apache.activemq.transport.udp.UpdTransportBindTest
Running org.apache.activemq.transport.vm.VMTransportEmbeddedBrokerTest
Tests run: 1, Failures: 0, Errors: 0, Skipped: 0, Time elapsed: 1.032 sec - in org.apache.activemq.transport.vm.VMTransportEmbeddedBrokerTest
Running org.apache.activemq.transport.vm.VMTransportThreadSafeTest
Tests run: 19, Failures: 0, Errors: 0, Skipped: 0, Time elapsed: 68.367 sec - in org.apache.activemq.transport.vm.VMTransportThreadSafeTest
Running org.apache.activemq.usage.CompositeMessageCursorUsageTest
Tests run: 1, Failures: 0, Errors: 0, Skipped: 0, Time elapsed: 1.191 sec - in org.apache.activemq.usage.CompositeMessageCursorUsageTest
Running org.apache.activemq.usage.JobSchedulerStoreUsageTest
Tests run: 1, Failures: 0, Errors: 0, Skipped: 0, Time elapsed: 32.309 sec - in org.apache.activemq.usage.JobSchedulerStoreUsageTest
Running org.apache.activemq.usage.StoreUsageLimitsTest
Tests run: 1, Failures: 0, Errors: 0, Skipped: 0, Time elapsed: 2.339 sec - in org.apache.activemq.usage.StoreUsageLimitsTest
Running org.apache.activemq.usecases.AdvisoryTopicDeletionTest
Tests run: 2, Failures: 0, Errors: 0, Skipped: 0, Time elapsed: 1.147 sec - in org.apache.activemq.usecases.AdvisoryTopicDeletionTest
Running org.apache.activemq.usecases.AuthorizationFromAdminViewTest
Tests run: 1, Failures: 0, Errors: 0, Skipped: 0, Time elapsed: 0.96 sec - in org.apache.activemq.usecases.AuthorizationFromAdminViewTest
Running org.apache.activemq.usecases.BacklogNetworkCrossTalkTest
Running org.apache.activemq.usecases.BrokerQueueNetworkWithDisconnectTest

Results :

Failed tests: 
  DbRestartJDBCQueueMasterSlaveLeaseQuiesceTest>CombinationTestSupport.runBare:113->CombinationTestSupport.runBare:107->QueueMasterSlaveTestSupport.testVirtualTopicFailover:132
slave started
  AMQ2149LevelDBTest>AMQ2149Test.tearDown:131 Teardown timed out
  AMQ4930Test.testBrowsePendingNonPersistent:61->doTestBrowsePending:108 No growth: 106055
  AMQ4889Test.testForConnectionLeak:108 expected:<27> but was:<28>

Tests in error: 
  AMQ2149LevelDBTest>AMQ2149Test.testQueueTransactionalOrderWithRestart:411->AMQ2149Test.doTestTransactionalOrderWithRestart:434->AMQ2149Test.verifyOrderedMessageReceipt:524->Object.wait:-2
? 
  AMQ2149LevelDBTest.testOrderWithRestart ? InvalidClientID Broker: testOrderWit...
  TcpTransportBindTest>CombinationTestSupport.runBare:113->CombinationTestSupport.runBare:107->setUp:39->EmbeddedBrokerTestSupport.setUp:47->EmbeddedBrokerTestSupport.startBroker:124
? InstanceAlreadyExists

Tests run: 2529, Failures: 4, Errors: 3, Skipped: 8

[JENKINS] Recording test results

Mime
View raw message