activemq-commits mailing list archives

Site index · List index
Message view « Date » · « Thread »
Top « Date » · « Thread »
From Apache Jenkins Server <jenk...@builds.apache.org>
Subject Build failed in Jenkins: ActiveMQ-Java7 » ActiveMQ :: Unit Tests #301
Date Wed, 26 Mar 2014 07:24:19 GMT
See <https://builds.apache.org/job/ActiveMQ-Java7/org.apache.activemq$activemq-unit-tests/301/>

------------------------------------------
[...truncated 516 lines...]
Tests run: 50, Failures: 0, Errors: 0, Skipped: 0, Time elapsed: 0.342 sec - in org.apache.activemq.command.ActiveMQMessageTest
Running org.apache.activemq.command.ActiveMQObjectMessageTest
Tests run: 5, Failures: 0, Errors: 0, Skipped: 0, Time elapsed: 0.202 sec - in org.apache.activemq.command.ActiveMQObjectMessageTest
Running org.apache.activemq.command.ActiveMQStreamMessageTest
Tests run: 18, Failures: 0, Errors: 0, Skipped: 0, Time elapsed: 0.415 sec - in org.apache.activemq.command.ActiveMQStreamMessageTest
Running org.apache.activemq.command.ActiveMQTextMessageTest
Tests run: 9, Failures: 0, Errors: 0, Skipped: 0, Time elapsed: 0.248 sec - in org.apache.activemq.command.ActiveMQTextMessageTest
Running org.apache.activemq.command.MessageSendTest
Tests run: 2, Failures: 0, Errors: 0, Skipped: 0, Time elapsed: 0.287 sec - in org.apache.activemq.command.MessageSendTest
Running org.apache.activemq.command.MessageTest
Tests run: 6, Failures: 0, Errors: 0, Skipped: 0, Time elapsed: 0.336 sec - in org.apache.activemq.command.MessageTest
Running org.apache.activemq.config.BrokerPropertiesTest
Tests run: 2, Failures: 0, Errors: 0, Skipped: 0, Time elapsed: 0.974 sec - in org.apache.activemq.config.BrokerPropertiesTest
Running org.apache.activemq.config.BrokerXmlConfigTest
Tests run: 1, Failures: 0, Errors: 0, Skipped: 0, Time elapsed: 6.949 sec - in org.apache.activemq.config.BrokerXmlConfigTest
Running org.apache.activemq.config.JDBCConfigTest
Tests run: 1, Failures: 0, Errors: 0, Skipped: 0, Time elapsed: 8.604 sec - in org.apache.activemq.config.JDBCConfigTest
Running org.apache.activemq.console.command.AMQ3410Test
Tests run: 5, Failures: 0, Errors: 0, Skipped: 0, Time elapsed: 19.343 sec - in org.apache.activemq.console.command.AMQ3410Test
Running org.apache.activemq.console.command.AMQ3411Test
Tests run: 5, Failures: 0, Errors: 0, Skipped: 0, Time elapsed: 11.699 sec - in org.apache.activemq.console.command.AMQ3411Test
Running org.apache.activemq.console.command.PurgeCommandTest
Tests run: 6, Failures: 0, Errors: 0, Skipped: 0, Time elapsed: 12.174 sec - in org.apache.activemq.console.command.PurgeCommandTest
Running org.apache.activemq.conversions.AmqpAndMqttTest
Tests run: 1, Failures: 0, Errors: 0, Skipped: 0, Time elapsed: 1.62 sec - in org.apache.activemq.conversions.AmqpAndMqttTest
Running org.apache.activemq.filter.DestinationFilterTest
Tests run: 5, Failures: 0, Errors: 0, Skipped: 0, Time elapsed: 0.082 sec - in org.apache.activemq.filter.DestinationFilterTest
Running org.apache.activemq.filter.DestinationMapMemoryTest
Tests run: 2, Failures: 0, Errors: 0, Skipped: 0, Time elapsed: 0.102 sec - in org.apache.activemq.filter.DestinationMapMemoryTest
Running org.apache.activemq.filter.DestinationMapTempDestinationTest
Tests run: 1, Failures: 0, Errors: 0, Skipped: 0, Time elapsed: 0.345 sec - in org.apache.activemq.filter.DestinationMapTempDestinationTest
Running org.apache.activemq.filter.DestinationMapTest
Tests run: 16, Failures: 0, Errors: 0, Skipped: 0, Time elapsed: 0.105 sec - in org.apache.activemq.filter.DestinationMapTest
Running org.apache.activemq.filter.DestinationPathTest
Tests run: 1, Failures: 0, Errors: 0, Skipped: 0, Time elapsed: 0.208 sec - in org.apache.activemq.filter.DestinationPathTest
Running org.apache.activemq.filter.DummyPolicyTest
Tests run: 1, Failures: 0, Errors: 0, Skipped: 0, Time elapsed: 0.63 sec - in org.apache.activemq.filter.DummyPolicyTest
Running org.apache.activemq.jmx.JmxCreateNCTest
Tests run: 1, Failures: 0, Errors: 0, Skipped: 0, Time elapsed: 1.467 sec - in org.apache.activemq.jmx.JmxCreateNCTest
Running org.apache.activemq.jmx.OpenTypeSupportTest
Tests run: 2, Failures: 0, Errors: 0, Skipped: 0, Time elapsed: 1.437 sec - in org.apache.activemq.jmx.OpenTypeSupportTest
Running org.apache.activemq.jndi.ActiveMQInitialContextFactoryTest
Tests run: 3, Failures: 0, Errors: 0, Skipped: 0, Time elapsed: 0.336 sec - in org.apache.activemq.jndi.ActiveMQInitialContextFactoryTest
Running org.apache.activemq.jndi.ActiveMQWASInitialContextFactoryTest
Tests run: 1, Failures: 0, Errors: 0, Skipped: 0, Time elapsed: 0.284 sec - in org.apache.activemq.jndi.ActiveMQWASInitialContextFactoryTest
Running org.apache.activemq.jndi.CustomConnectionFactoryNameTest
Tests run: 4, Failures: 0, Errors: 0, Skipped: 0, Time elapsed: 0.284 sec - in org.apache.activemq.jndi.CustomConnectionFactoryNameTest
Running org.apache.activemq.jndi.DestinationNameWithSlashTest
Tests run: 1, Failures: 0, Errors: 0, Skipped: 0, Time elapsed: 0.257 sec - in org.apache.activemq.jndi.DestinationNameWithSlashTest
Running org.apache.activemq.jndi.InitialContextTest
Tests run: 4, Failures: 0, Errors: 0, Skipped: 0, Time elapsed: 0.304 sec - in org.apache.activemq.jndi.InitialContextTest
Running org.apache.activemq.jndi.ObjectFactoryTest
Tests run: 2, Failures: 0, Errors: 0, Skipped: 0, Time elapsed: 0.27 sec - in org.apache.activemq.jndi.ObjectFactoryTest
Running org.apache.activemq.jndi.XAConnectionFactoryTest
Tests run: 4, Failures: 0, Errors: 0, Skipped: 0, Time elapsed: 0.291 sec - in org.apache.activemq.jndi.XAConnectionFactoryTest
Running org.apache.activemq.joramtests.JoramJmsTest
Tests run: 196, Failures: 0, Errors: 0, Skipped: 0, Time elapsed: 25.329 sec - in org.apache.activemq.joramtests.JoramJmsTest
Running org.apache.activemq.leveldb.LevelDBStoreBrokerTest
Tests run: 129, Failures: 0, Errors: 0, Skipped: 0, Time elapsed: 69.953 sec - in org.apache.activemq.leveldb.LevelDBStoreBrokerTest
Running org.apache.activemq.management.BoundaryStatisticTest
Tests run: 1, Failures: 0, Errors: 0, Skipped: 0, Time elapsed: 0.203 sec - in org.apache.activemq.management.BoundaryStatisticTest
Running org.apache.activemq.management.BoundedRangeStatisticTest
Tests run: 1, Failures: 0, Errors: 0, Skipped: 0, Time elapsed: 0.687 sec - in org.apache.activemq.management.BoundedRangeStatisticTest
Running org.apache.activemq.management.CountStatisticTest
Tests run: 1, Failures: 0, Errors: 0, Skipped: 0, Time elapsed: 0.708 sec - in org.apache.activemq.management.CountStatisticTest
Running org.apache.activemq.management.RangeStatisticTest
Tests run: 1, Failures: 0, Errors: 0, Skipped: 0, Time elapsed: 0.708 sec - in org.apache.activemq.management.RangeStatisticTest
Running org.apache.activemq.management.TimeStatisticTest
Tests run: 1, Failures: 0, Errors: 0, Skipped: 0, Time elapsed: 0.689 sec - in org.apache.activemq.management.TimeStatisticTest
Running org.apache.activemq.memory.MemoryPropertyTest
Tests run: 1, Failures: 0, Errors: 0, Skipped: 0, Time elapsed: 1.998 sec - in org.apache.activemq.memory.MemoryPropertyTest
Running org.apache.activemq.memory.buffer.OrderBasedMemoryBufferTest
Tests run: 1, Failures: 0, Errors: 0, Skipped: 0, Time elapsed: 0.232 sec - in org.apache.activemq.memory.buffer.OrderBasedMemoryBufferTest
Running org.apache.activemq.memory.buffer.SizeBasedMessageBufferTest
Tests run: 1, Failures: 0, Errors: 0, Skipped: 0, Time elapsed: 0.239 sec - in org.apache.activemq.memory.buffer.SizeBasedMessageBufferTest
Running org.apache.activemq.network.CheckDuplicateMessagesOnDuplexTest
Tests run: 1, Failures: 0, Errors: 0, Skipped: 0, Time elapsed: 14.828 sec - in org.apache.activemq.network.CheckDuplicateMessagesOnDuplexTest
Running org.apache.activemq.network.CompressionOverNetworkTest
Tests run: 6, Failures: 0, Errors: 0, Skipped: 0, Time elapsed: 24.232 sec - in org.apache.activemq.network.CompressionOverNetworkTest
Running org.apache.activemq.network.DemandForwardingBridgeTest
Tests run: 6, Failures: 0, Errors: 0, Skipped: 0, Time elapsed: 6.088 sec - in org.apache.activemq.network.DemandForwardingBridgeTest
Running org.apache.activemq.network.DynamicallyIncludedDestinationsDuplexNetworkTest
Tests run: 7, Failures: 0, Errors: 0, Skipped: 0, Time elapsed: 29.264 sec - in org.apache.activemq.network.DynamicallyIncludedDestinationsDuplexNetworkTest
Running org.apache.activemq.network.ForwardingBridgeTest
Tests run: 8, Failures: 0, Errors: 0, Skipped: 0, Time elapsed: 17.307 sec - in org.apache.activemq.network.ForwardingBridgeTest
Running org.apache.activemq.network.NetworkDestinationFilterTest
Tests run: 1, Failures: 0, Errors: 0, Skipped: 0, Time elapsed: 0.187 sec - in org.apache.activemq.network.NetworkDestinationFilterTest
Running org.apache.activemq.network.NetworkLoopBackTest
Tests run: 1, Failures: 0, Errors: 0, Skipped: 0, Time elapsed: 3.209 sec - in org.apache.activemq.network.NetworkLoopBackTest
Running org.apache.activemq.network.NetworkRouteTest
Tests run: 3, Failures: 0, Errors: 0, Skipped: 0, Time elapsed: 0.977 sec - in org.apache.activemq.network.NetworkRouteTest
Running org.apache.activemq.openwire.BooleanStreamTest
Tests run: 4, Failures: 0, Errors: 0, Skipped: 0, Time elapsed: 1.509 sec - in org.apache.activemq.openwire.BooleanStreamTest
Running org.apache.activemq.openwire.ItStillMarshallsTheSameTest
Tests run: 1, Failures: 0, Errors: 0, Skipped: 0, Time elapsed: 0.194 sec - in org.apache.activemq.openwire.ItStillMarshallsTheSameTest
Running org.apache.activemq.openwire.NumberRangesWhileMarshallingTest
Tests run: 3, Failures: 0, Errors: 0, Skipped: 0, Time elapsed: 0.645 sec - in org.apache.activemq.openwire.NumberRangesWhileMarshallingTest
Running org.apache.activemq.pool.JmsSendReceiveTwoConnectionsWithSenderUsingPoolTest
Tests run: 1, Failures: 0, Errors: 0, Skipped: 0, Time elapsed: 2.533 sec - in org.apache.activemq.pool.JmsSendReceiveTwoConnectionsWithSenderUsingPoolTest
Running org.apache.activemq.proxy.AMQ4889Test
Tests run: 1, Failures: 0, Errors: 0, Skipped: 0, Time elapsed: 2.547 sec - in org.apache.activemq.proxy.AMQ4889Test
Running org.apache.activemq.security.AuthorizationMapTest
Tests run: 4, Failures: 0, Errors: 0, Skipped: 0, Time elapsed: 0.089 sec - in org.apache.activemq.security.AuthorizationMapTest
Running org.apache.activemq.security.CachedLDAPAuthorizationModuleLegacyOpenLDAPTest
Tests run: 1, Failures: 0, Errors: 0, Skipped: 1, Time elapsed: 0.033 sec - in org.apache.activemq.security.CachedLDAPAuthorizationModuleLegacyOpenLDAPTest
Running org.apache.activemq.security.CachedLDAPAuthorizationModuleLegacyTest
Tests run: 12, Failures: 1, Errors: 0, Skipped: 0, Time elapsed: 60.735 sec <<< FAILURE!
- in org.apache.activemq.security.CachedLDAPAuthorizationModuleLegacyTest
testRestartAsync(org.apache.activemq.security.CachedLDAPAuthorizationModuleLegacyTest)  Time
elapsed: 33.161 sec  <<< FAILURE!
java.lang.AssertionError: did not get expected size. 
	at org.junit.Assert.fail(Assert.java:88)
	at org.junit.Assert.assertTrue(Assert.java:41)
	at org.apache.activemq.security.AbstractCachedLDAPAuthorizationMapLegacyTest.testRestart(AbstractCachedLDAPAuthorizationMapLegacyTest.java:344)
	at org.apache.activemq.security.AbstractCachedLDAPAuthorizationMapLegacyTest.testRestartAsync(AbstractCachedLDAPAuthorizationMapLegacyTest.java:291)
	at sun.reflect.NativeMethodAccessorImpl.invoke0(Native Method)
	at sun.reflect.NativeMethodAccessorImpl.invoke(NativeMethodAccessorImpl.java:57)
	at sun.reflect.DelegatingMethodAccessorImpl.invoke(DelegatingMethodAccessorImpl.java:43)
	at java.lang.reflect.Method.invoke(Method.java:606)
	at org.junit.runners.model.FrameworkMethod$1.runReflectiveCall(FrameworkMethod.java:47)
	at org.junit.internal.runners.model.ReflectiveCallable.run(ReflectiveCallable.java:12)
	at org.junit.runners.model.FrameworkMethod.invokeExplosively(FrameworkMethod.java:44)
	at org.junit.internal.runners.statements.InvokeMethod.evaluate(InvokeMethod.java:17)
	at org.junit.internal.runners.statements.RunBefores.evaluate(RunBefores.java:26)
	at org.junit.internal.runners.statements.RunAfters.evaluate(RunAfters.java:27)
	at org.junit.runners.ParentRunner.runLeaf(ParentRunner.java:271)
	at org.junit.runners.BlockJUnit4ClassRunner.runChild(BlockJUnit4ClassRunner.java:70)
	at org.apache.directory.server.core.integ.FrameworkRunner.runChild(FrameworkRunner.java:488)
	at org.apache.directory.server.core.integ.FrameworkRunner.runChild(FrameworkRunner.java:58)
	at org.junit.runners.ParentRunner$3.run(ParentRunner.java:238)
	at org.junit.runners.ParentRunner$1.schedule(ParentRunner.java:63)
	at org.junit.runners.ParentRunner.runChildren(ParentRunner.java:236)
	at org.junit.runners.ParentRunner.access$000(ParentRunner.java:53)
	at org.junit.runners.ParentRunner$2.evaluate(ParentRunner.java:229)
	at org.junit.runners.ParentRunner.run(ParentRunner.java:309)
	at org.apache.directory.server.core.integ.FrameworkRunner.run(FrameworkRunner.java:256)
	at org.apache.maven.surefire.junit4.JUnit4Provider.execute(JUnit4Provider.java:264)
	at org.apache.maven.surefire.junit4.JUnit4Provider.executeTestSet(JUnit4Provider.java:153)
	at org.apache.maven.surefire.junit4.JUnit4Provider.invoke(JUnit4Provider.java:124)
	at org.apache.maven.surefire.booter.ForkedBooter.invokeProviderInSameClassLoader(ForkedBooter.java:200)
	at org.apache.maven.surefire.booter.ForkedBooter.runSuitesInProcess(ForkedBooter.java:153)
	at org.apache.maven.surefire.booter.ForkedBooter.main(ForkedBooter.java:103)

Running org.apache.activemq.security.CachedLDAPAuthorizationModuleOpenLDAPTest
Tests run: 1, Failures: 0, Errors: 0, Skipped: 1, Time elapsed: 0.056 sec - in org.apache.activemq.security.CachedLDAPAuthorizationModuleOpenLDAPTest
Running org.apache.activemq.security.CachedLDAPAuthorizationModuleTest
Tests run: 12, Failures: 0, Errors: 0, Skipped: 0, Time elapsed: 32.171 sec - in org.apache.activemq.security.CachedLDAPAuthorizationModuleTest
Running org.apache.activemq.security.CachedLDAPSecurityLegacyTest
Tests run: 4, Failures: 0, Errors: 0, Skipped: 0, Time elapsed: 9.395 sec - in org.apache.activemq.security.CachedLDAPSecurityLegacyTest
Running org.apache.activemq.security.CachedLDAPSecurityTest
Tests run: 4, Failures: 0, Errors: 0, Skipped: 0, Time elapsed: 9.594 sec - in org.apache.activemq.security.CachedLDAPSecurityTest
Running org.apache.activemq.security.JaasCertificateAuthenticationBrokerTest
Tests run: 3, Failures: 0, Errors: 0, Skipped: 0, Time elapsed: 0.111 sec - in org.apache.activemq.security.JaasCertificateAuthenticationBrokerTest
Running org.apache.activemq.security.JaasDualAuthenticationBrokerTest
Tests run: 2, Failures: 0, Errors: 0, Skipped: 0, Time elapsed: 0.23 sec - in org.apache.activemq.security.JaasDualAuthenticationBrokerTest
Running org.apache.activemq.security.LDAPAuthorizationMapTest
Tests run: 7, Failures: 0, Errors: 0, Skipped: 0, Time elapsed: 5.746 sec - in org.apache.activemq.security.LDAPAuthorizationMapTest
Running org.apache.activemq.security.SimpleAnonymousPluginTest
Tests run: 45, Failures: 0, Errors: 0, Skipped: 0, Time elapsed: 32.194 sec - in org.apache.activemq.security.SimpleAnonymousPluginTest
Running org.apache.activemq.security.SimpleAuthenticationPluginSeparatorTest
Tests run: 29, Failures: 0, Errors: 0, Skipped: 0, Time elapsed: 22.142 sec - in org.apache.activemq.security.SimpleAuthenticationPluginSeparatorTest
Running org.apache.activemq.security.SimpleAuthenticationPluginTest
Tests run: 33, Failures: 0, Errors: 0, Skipped: 0, Time elapsed: 25.043 sec - in org.apache.activemq.security.SimpleAuthenticationPluginTest
Running org.apache.activemq.security.SimpleAuthorizationMapTest
Tests run: 4, Failures: 0, Errors: 0, Skipped: 0, Time elapsed: 0.192 sec - in org.apache.activemq.security.SimpleAuthorizationMapTest
Running org.apache.activemq.security.SimpleSecurityBrokerSystemTest
Tests run: 60, Failures: 0, Errors: 0, Skipped: 0, Time elapsed: 28.031 sec - in org.apache.activemq.security.SimpleSecurityBrokerSystemTest
Running org.apache.activemq.security.XBeanSecurityTest
Tests run: 29, Failures: 0, Errors: 0, Skipped: 0, Time elapsed: 16.537 sec - in org.apache.activemq.security.XBeanSecurityTest
Running org.apache.activemq.security.XBeanSecurityWithGuestTest
Tests run: 7, Failures: 0, Errors: 0, Skipped: 0, Time elapsed: 3.421 sec - in org.apache.activemq.security.XBeanSecurityWithGuestTest
Running org.apache.activemq.selector.SelectorParserTest
Tests run: 3, Failures: 0, Errors: 0, Skipped: 0, Time elapsed: 0.508 sec - in org.apache.activemq.selector.SelectorParserTest
Running org.apache.activemq.selector.SelectorTest
Tests run: 21, Failures: 0, Errors: 0, Skipped: 0, Time elapsed: 0.557 sec - in org.apache.activemq.selector.SelectorTest
Running org.apache.activemq.spring.ActiveMQConnectionFactoryFactoryBeanTest
Tests run: 6, Failures: 0, Errors: 0, Skipped: 0, Time elapsed: 0.286 sec - in org.apache.activemq.spring.ActiveMQConnectionFactoryFactoryBeanTest
Running org.apache.activemq.spring.SpringTest
Tests run: 7, Failures: 0, Errors: 0, Skipped: 0, Time elapsed: 17.553 sec - in org.apache.activemq.spring.SpringTest
Running org.apache.activemq.store.LevelDBStorePerDestinationTest
Tests run: 6, Failures: 0, Errors: 0, Skipped: 0, Time elapsed: 240.559 sec - in org.apache.activemq.store.LevelDBStorePerDestinationTest
Running org.apache.activemq.store.jdbc.DatabaseLockerConfigTest
Tests run: 4, Failures: 0, Errors: 0, Skipped: 0, Time elapsed: 0.228 sec - in org.apache.activemq.store.jdbc.DatabaseLockerConfigTest
Running org.apache.activemq.store.jdbc.JDBCIOExceptionHandlerMockeryTest
Tests run: 1, Failures: 0, Errors: 0, Skipped: 0, Time elapsed: 2.287 sec - in org.apache.activemq.store.jdbc.JDBCIOExceptionHandlerMockeryTest
Running org.apache.activemq.store.jdbc.JDBCIOExceptionHandlerTest
Tests run: 2, Failures: 1, Errors: 0, Skipped: 0, Time elapsed: 20.019 sec <<< FAILURE!
- in org.apache.activemq.store.jdbc.JDBCIOExceptionHandlerTest
testRecoverWithOutJMX(org.apache.activemq.store.jdbc.JDBCIOExceptionHandlerTest)  Time elapsed:
8.313 sec  <<< FAILURE!
junit.framework.AssertionFailedError: Transport connector should have been started
	at junit.framework.Assert.fail(Assert.java:57)
	at junit.framework.TestCase.fail(TestCase.java:227)
	at org.apache.activemq.store.jdbc.JDBCIOExceptionHandlerTest.checkTransportConnectorStarted(JDBCIOExceptionHandlerTest.java:145)
	at org.apache.activemq.store.jdbc.JDBCIOExceptionHandlerTest.recoverFromDisconnectDB(JDBCIOExceptionHandlerTest.java:119)
	at org.apache.activemq.store.jdbc.JDBCIOExceptionHandlerTest.testRecoverWithOutJMX(JDBCIOExceptionHandlerTest.java:85)

Running org.apache.activemq.store.jdbc.JDBCLockTablePrefixTest
Tests run: 1, Failures: 0, Errors: 0, Skipped: 0, Time elapsed: 14.624 sec - in org.apache.activemq.store.jdbc.JDBCLockTablePrefixTest
Running org.apache.activemq.store.jdbc.JDBCTablePrefixAssignedTest
Tests run: 1, Failures: 0, Errors: 0, Skipped: 0, Time elapsed: 8.774 sec - in org.apache.activemq.store.jdbc.JDBCTablePrefixAssignedTest
Running org.apache.activemq.store.jdbc.LeaseDatabaseLockerTest
Tests run: 5, Failures: 2, Errors: 0, Skipped: 0, Time elapsed: 18.128 sec <<< FAILURE!
- in org.apache.activemq.store.jdbc.LeaseDatabaseLockerTest
testLockInterleave(org.apache.activemq.store.jdbc.LeaseDatabaseLockerTest)  Time elapsed:
13.983 sec  <<< FAILURE!
java.lang.AssertionError: A is good
	at org.junit.Assert.fail(Assert.java:88)
	at org.junit.Assert.assertTrue(Assert.java:41)
	at org.apache.activemq.store.jdbc.LeaseDatabaseLockerTest.testLockInterleave(LeaseDatabaseLockerTest.java:114)

testLockAcquireRace(org.apache.activemq.store.jdbc.LeaseDatabaseLockerTest)  Time elapsed:
0.904 sec  <<< FAILURE!
java.lang.AssertionError: we got the lease expected:<1> but was:<0>
	at org.junit.Assert.fail(Assert.java:88)
	at org.junit.Assert.failNotEquals(Assert.java:743)
	at org.junit.Assert.assertEquals(Assert.java:118)
	at org.junit.Assert.assertEquals(Assert.java:555)
	at org.apache.activemq.store.jdbc.LeaseDatabaseLockerTest.testLockAcquireRace(LeaseDatabaseLockerTest.java:139)

Running org.apache.activemq.store.kahadb.CustomLockerTest
Tests run: 1, Failures: 0, Errors: 0, Skipped: 0, Time elapsed: 2.67 sec - in org.apache.activemq.store.kahadb.CustomLockerTest
Running org.apache.activemq.store.kahadb.KahaDBPersistenceAdapterTest
Tests run: 2, Failures: 0, Errors: 0, Skipped: 0, Time elapsed: 3.187 sec - in org.apache.activemq.store.kahadb.KahaDBPersistenceAdapterTest
Running org.apache.activemq.store.kahadb.KahaDBStoreBrokerTest
Tests run: 129, Failures: 0, Errors: 0, Skipped: 0, Time elapsed: 125.57 sec - in org.apache.activemq.store.kahadb.KahaDBStoreBrokerTest
Running org.apache.activemq.store.kahadb.KahaDBStoreOrderTest
Tests run: 2, Failures: 0, Errors: 0, Skipped: 0, Time elapsed: 4.842 sec - in org.apache.activemq.store.kahadb.KahaDBStoreOrderTest
Running org.apache.activemq.store.kahadb.NoSpaceIOTest
Tests run: 1, Failures: 0, Errors: 0, Skipped: 1, Time elapsed: 0.094 sec - in org.apache.activemq.store.kahadb.NoSpaceIOTest
Running org.apache.activemq.store.kahadb.PBMesssagesTest
Tests run: 1, Failures: 0, Errors: 0, Skipped: 0, Time elapsed: 0.08 sec - in org.apache.activemq.store.kahadb.PBMesssagesTest
Running org.apache.activemq.store.kahadb.TempKahaDBStoreBrokerTest
Tests run: 129, Failures: 0, Errors: 0, Skipped: 0, Time elapsed: 137.59 sec - in org.apache.activemq.store.kahadb.TempKahaDBStoreBrokerTest
Running org.apache.activemq.store.kahadb.plist.KahaDBFilePendingMessageCursorTest
Tests run: 3, Failures: 0, Errors: 0, Skipped: 0, Time elapsed: 3.625 sec - in org.apache.activemq.store.kahadb.plist.KahaDBFilePendingMessageCursorTest
Running org.apache.activemq.store.leveldb.LevelDBNegativeQueueTest
Tests run: 4, Failures: 0, Errors: 0, Skipped: 0, Time elapsed: 541.214 sec - in org.apache.activemq.store.leveldb.LevelDBNegativeQueueTest
Running org.apache.activemq.store.leveldb.LevelDBStoreBrokerTest

Results :

Failed tests: 
  AMQ4351Test>CombinationTestSupport.runBare:107->testAMQ4351:248 null
  DbRestartJDBCQueueMasterSlaveLeaseQuiesceTest>CombinationTestSupport.runBare:113->CombinationTestSupport.runBare:107->QueueMasterSlaveTestSupport.testVirtualTopicFailover:132
slave started
  AMQ4952Test.testConsumerBrokerRestart:226 number of messages received expected:<2>
but was:<1>
  TransactedStoreUsageSuspendResumeTest.testTransactedStoreUsageSuspendResume:143 Got all
messages: java.util.concurrent.CountDownLatch@19cc605[Count = 8878]
  CachedLDAPAuthorizationModuleLegacyTest>AbstractCachedLDAPAuthorizationMapLegacyTest.testRestartAsync:291->AbstractCachedLDAPAuthorizationMapLegacyTest.testRestart:344
did not get expected size. 
  JDBCIOExceptionHandlerTest.testRecoverWithOutJMX:85->recoverFromDisconnectDB:119->checkTransportConnectorStarted:145
Transport connector should have been started
  LeaseDatabaseLockerTest.testLockInterleave:114 A is good
  LeaseDatabaseLockerTest.testLockAcquireRace:139 we got the lease expected:<1> but
was:<0>

Tests run: 2279, Failures: 8, Errors: 0, Skipped: 7

[JENKINS] Recording test results
Tests run: 129, Failures: 0, Errors: 0, Skipped: 0, Time elapsed: 76.722 sec - in org.apache.activemq.store.leveldb.LevelDBStoreBrokerTest

Mime
View raw message