activemq-commits mailing list archives

Site index · List index
Message view « Date » · « Thread »
Top « Date » · « Thread »
From Apache Jenkins Server <jenk...@builds.apache.org>
Subject Build failed in Jenkins: ActiveMQ-Apollo #980
Date Wed, 31 Jul 2013 00:35:05 GMT
See <https://builds.apache.org/job/ActiveMQ-Apollo/980/changes>

Changes:

[ceposta] if there are transport failures, let's raise the level of logging so we see what
they are

------------------------------------------
[...truncated 15709 lines...]
[00:34:33] INFO  | main | Running test : testAckOfExpired {protocol=STOMP, destinationType=QUEUE_TYPE}
[00:34:33] INFO  | main | Loading broker configuration from the classpath with URI: xml:classpath:apollo.xml
[00:34:33] INFO  | hawtdispatch-DEFAULT-1 | OS     : Linux 3.2.0-38-generic (Ubuntu 12.04.2
LTS)
[00:34:33] INFO  | hawtdispatch-DEFAULT-1 | JVM    : Java HotSpot(TM) Server VM 1.6.0_45 (Sun
Microsystems Inc.)
[00:34:33] INFO  | hawtdispatch-DEFAULT-1 | Apollo : 99-trunk-SNAPSHOT
[00:34:33] INFO  | hawtdispatch-DEFAULT-1 | OS is restricting the open file limit to: 40000
[00:34:33] INFO  | hawtdispatch-DEFAULT-1 | Accepting connections at: tcp://0.0.0.0:52498
[00:34:33] INFO  | hawtdispatch-DEFAULT-1 | connected: local:/127.0.0.1:52498, remote:/127.0.0.1:36254
[00:34:33] INFO  | hawtdispatch-DEFAULT-1 | connected: local:/127.0.0.1:52498, remote:/127.0.0.1:36254
[00:34:35] INFO  | hawtdispatch-DEFAULT-2 | connected: local:/127.0.0.1:52498, remote:/127.0.0.1:36255
[00:34:35] INFO  | hawtdispatch-DEFAULT-2 | connected: local:/127.0.0.1:52498, remote:/127.0.0.1:36255
[00:34:35] INFO  | hawtdispatch-DEFAULT-2 | disconnected: local:/127.0.0.1:52498, remote:/127.0.0.1:36255
[00:34:35] INFO  | hawtdispatch-DEFAULT-4 | disconnected: local:/127.0.0.1:52498, remote:/127.0.0.1:36254
[00:34:35] INFO  | hawtdispatch-DEFAULT-1 | Stopped connector at: tcp://0.0.0.0:0
[00:34:35] INFO  | main | Running test : testAckOfExpired {protocol=OpenWire, destinationType=QUEUE_TYPE}
[00:34:35] INFO  | main | Loading broker configuration from the classpath with URI: xml:classpath:apollo.xml
[00:34:35] INFO  | hawtdispatch-DEFAULT-1 | OS     : Linux 3.2.0-38-generic (Ubuntu 12.04.2
LTS)
[00:34:35] INFO  | hawtdispatch-DEFAULT-1 | JVM    : Java HotSpot(TM) Server VM 1.6.0_45 (Sun
Microsystems Inc.)
[00:34:35] INFO  | hawtdispatch-DEFAULT-1 | Apollo : 99-trunk-SNAPSHOT
[00:34:35] INFO  | hawtdispatch-DEFAULT-1 | OS is restricting the open file limit to: 40000
[00:34:35] INFO  | hawtdispatch-DEFAULT-1 | Accepting connections at: tcp://0.0.0.0:48464
[00:34:35] INFO  | hawtdispatch-DEFAULT-1 | connected: local:/127.0.0.1:48464, remote:/127.0.0.1:36331
[00:34:35] INFO  | hawtdispatch-DEFAULT-1 | connected: local:/127.0.0.1:48464, remote:/127.0.0.1:36331
[00:34:37] INFO  | hawtdispatch-DEFAULT-2 | disconnected: local:/127.0.0.1:48464, remote:/127.0.0.1:36331
[00:34:37] INFO  | hawtdispatch-DEFAULT-1 | Stopped connector at: tcp://0.0.0.0:0
[00:34:37] INFO  | main | Running test : testAckOfExpired {protocol=STOMP, destinationType=TOPIC_TYPE}
[00:34:37] INFO  | main | Loading broker configuration from the classpath with URI: xml:classpath:apollo.xml
[00:34:37] INFO  | hawtdispatch-DEFAULT-2 | OS     : Linux 3.2.0-38-generic (Ubuntu 12.04.2
LTS)
[00:34:37] INFO  | hawtdispatch-DEFAULT-2 | JVM    : Java HotSpot(TM) Server VM 1.6.0_45 (Sun
Microsystems Inc.)
[00:34:37] INFO  | hawtdispatch-DEFAULT-2 | Apollo : 99-trunk-SNAPSHOT
[00:34:37] INFO  | hawtdispatch-DEFAULT-2 | OS is restricting the open file limit to: 40000
[00:34:37] INFO  | hawtdispatch-DEFAULT-2 | Accepting connections at: tcp://0.0.0.0:56804
[00:34:37] INFO  | hawtdispatch-DEFAULT-3 | connected: local:/127.0.0.1:56804, remote:/127.0.0.1:52120
[00:34:37] INFO  | hawtdispatch-DEFAULT-3 | connected: local:/127.0.0.1:56804, remote:/127.0.0.1:52120
[00:34:39] INFO  | hawtdispatch-DEFAULT-2 | connected: local:/127.0.0.1:56804, remote:/127.0.0.1:52121
[00:34:39] INFO  | hawtdispatch-DEFAULT-2 | connected: local:/127.0.0.1:56804, remote:/127.0.0.1:52121
[00:34:39] INFO  | hawtdispatch-DEFAULT-6 | disconnected: local:/127.0.0.1:56804, remote:/127.0.0.1:52121
[00:34:39] INFO  | hawtdispatch-DEFAULT-2 | disconnected: local:/127.0.0.1:56804, remote:/127.0.0.1:52120
[00:34:39] INFO  | hawtdispatch-DEFAULT-2 | Stopped connector at: tcp://0.0.0.0:0
[00:34:39] INFO  | main | Running test : testAckOfExpired {protocol=OpenWire, destinationType=TOPIC_TYPE}
[00:34:39] INFO  | main | Loading broker configuration from the classpath with URI: xml:classpath:apollo.xml
[00:34:39] INFO  | hawtdispatch-DEFAULT-2 | OS     : Linux 3.2.0-38-generic (Ubuntu 12.04.2
LTS)
[00:34:39] INFO  | hawtdispatch-DEFAULT-2 | JVM    : Java HotSpot(TM) Server VM 1.6.0_45 (Sun
Microsystems Inc.)
[00:34:39] INFO  | hawtdispatch-DEFAULT-2 | Apollo : 99-trunk-SNAPSHOT
[00:34:39] INFO  | hawtdispatch-DEFAULT-2 | OS is restricting the open file limit to: 40000
[00:34:39] INFO  | hawtdispatch-DEFAULT-2 | Accepting connections at: tcp://0.0.0.0:47945
[00:34:39] INFO  | hawtdispatch-DEFAULT-2 | connected: local:/127.0.0.1:47945, remote:/127.0.0.1:49191
[00:34:39] INFO  | hawtdispatch-DEFAULT-2 | connected: local:/127.0.0.1:47945, remote:/127.0.0.1:49191
[00:34:41] INFO  | hawtdispatch-DEFAULT-2 | disconnected: local:/127.0.0.1:47945, remote:/127.0.0.1:49191
[00:34:41] INFO  | hawtdispatch-DEFAULT-1 | Stopped connector at: tcp://0.0.0.0:0
[00:34:41] Tests run: 197, Failures: 2, Errors: 0, Skipped: 0, Time elapsed: 74.647 sec <<<
FAILURE!
[00:34:41] 
[00:34:41] Results :
[00:34:41] 
[00:34:41] Failed tests: [00:34:41]   testPrefetch1MessageNotDispatched {protocol=STOMP\u002C
deliveryMode=1}(org.apache.activemq.apollo.JMSConsumerTest)
[00:34:41]   testPrefetch1MessageNotDispatched {protocol=STOMP\u002C deliveryMode=2}(org.apache.activemq.apollo.JMSConsumerTest)
[00:34:41] 
[00:34:41] Tests run: 634, Failures: 2, Errors: 0, Skipped: 0
[00:34:41] 
[ERROR] There are test failures.

Please refer to <https://builds.apache.org/job/ActiveMQ-Apollo/ws/trunk/apollo-itests/target/surefire-reports>
for the individual test results.
[JENKINS] Recording test results
Jul 31, 2013 12:34:43 AM org.apache.maven.cli.event.ExecutionEventLogger mojoStarted
INFO: 
Jul 31, 2013 12:34:43 AM org.apache.maven.cli.event.ExecutionEventLogger mojoStarted
INFO: --- maven-jar-plugin:2.3.1:jar (default-jar) @ apollo-itests ---
[INFO] Building jar: <https://builds.apache.org/job/ActiveMQ-Apollo/ws/trunk/apollo-itests/target/apollo-itests-99-trunk-SNAPSHOT.jar>
Jul 31, 2013 12:34:43 AM org.apache.maven.cli.event.ExecutionEventLogger mojoStarted
INFO: 
Jul 31, 2013 12:34:43 AM org.apache.maven.cli.event.ExecutionEventLogger mojoStarted
INFO: --- maven-site-plugin:3.0:attach-descriptor (attach-descriptor) @ apollo-itests ---
Jul 31, 2013 12:34:43 AM org.apache.maven.cli.event.ExecutionEventLogger mojoStarted
INFO: 
Jul 31, 2013 12:34:43 AM org.apache.maven.cli.event.ExecutionEventLogger mojoStarted
INFO: --- maven-install-plugin:2.3.1:install (default-install) @ apollo-itests ---
[INFO] Installing <https://builds.apache.org/job/ActiveMQ-Apollo/ws/trunk/apollo-itests/target/apollo-itests-99-trunk-SNAPSHOT.jar>
to /home/jenkins/jenkins-slave/maven-repositories/1/org/apache/activemq/apollo-itests/99-trunk-SNAPSHOT/apollo-itests-99-trunk-SNAPSHOT.jar
[INFO] Installing <https://builds.apache.org/job/ActiveMQ-Apollo/ws/trunk/apollo-itests/pom.xml>
to /home/jenkins/jenkins-slave/maven-repositories/1/org/apache/activemq/apollo-itests/99-trunk-SNAPSHOT/apollo-itests-99-trunk-SNAPSHOT.pom
[00:34:43] Jul 31, 2013 12:34:43 AM org.apache.maven.cli.event.ExecutionEventLogger logReactorSummary
INFO: ------------------------------------------------------------------------
Jul 31, 2013 12:34:43 AM org.apache.maven.cli.event.ExecutionEventLogger logReactorSummary
INFO: Reactor Summary:
Jul 31, 2013 12:34:43 AM org.apache.maven.cli.event.ExecutionEventLogger logReactorSummary
INFO: 
Jul 31, 2013 12:34:43 AM org.apache.maven.cli.event.ExecutionEventLogger logReactorSummary
INFO: Apache ActiveMQ Apollo Project .................... SUCCESS [20.229s]
Jul 31, 2013 12:34:43 AM org.apache.maven.cli.event.ExecutionEventLogger logReactorSummary
INFO: apollo-boot ....................................... SUCCESS [8.386s]
Jul 31, 2013 12:34:43 AM org.apache.maven.cli.event.ExecutionEventLogger logReactorSummary
INFO: apollo-scala ...................................... SUCCESS [2.393s]
Jul 31, 2013 12:34:43 AM org.apache.maven.cli.event.ExecutionEventLogger logReactorSummary
INFO: apollo-util ....................................... SUCCESS [34.819s]
Jul 31, 2013 12:34:43 AM org.apache.maven.cli.event.ExecutionEventLogger logReactorSummary
INFO: apollo-dto ........................................ SUCCESS [7.791s]
Jul 31, 2013 12:34:43 AM org.apache.maven.cli.event.ExecutionEventLogger logReactorSummary
INFO: apollo-selector ................................... SUCCESS [3.527s]
Jul 31, 2013 12:34:43 AM org.apache.maven.cli.event.ExecutionEventLogger logReactorSummary
INFO: apollo-broker ..................................... SUCCESS [54.105s]
Jul 31, 2013 12:34:43 AM org.apache.maven.cli.event.ExecutionEventLogger logReactorSummary
INFO: apollo-web ........................................ SUCCESS [40.998s]
Jul 31, 2013 12:34:43 AM org.apache.maven.cli.event.ExecutionEventLogger logReactorSummary
INFO: apollo-leveldb .................................... SUCCESS [57.396s]
Jul 31, 2013 12:34:43 AM org.apache.maven.cli.event.ExecutionEventLogger logReactorSummary
INFO: apollo-bdb ........................................ SUCCESS [38.441s]
Jul 31, 2013 12:34:43 AM org.apache.maven.cli.event.ExecutionEventLogger logReactorSummary
INFO: apollo-stomp ...................................... SUCCESS [4:21.557s]
Jul 31, 2013 12:34:43 AM org.apache.maven.cli.event.ExecutionEventLogger logReactorSummary
INFO: apollo-amqp ....................................... FAILURE [1:28:02.986s]
Jul 31, 2013 12:34:43 AM org.apache.maven.cli.event.ExecutionEventLogger logReactorSummary
INFO: apollo-mqtt ....................................... SUCCESS [36.359s]
Jul 31, 2013 12:34:43 AM org.apache.maven.cli.event.ExecutionEventLogger logReactorSummary
INFO: apollo-openwire-generator ......................... SUCCESS [9.320s]
Jul 31, 2013 12:34:43 AM org.apache.maven.cli.event.ExecutionEventLogger logReactorSummary
INFO: apollo-openwire ................................... SUCCESS [1:12.740s]
Jul 31, 2013 12:34:43 AM org.apache.maven.cli.event.ExecutionEventLogger logReactorSummary
INFO: apollo-jmx ........................................ SUCCESS [22.486s]
Jul 31, 2013 12:34:43 AM org.apache.maven.cli.event.ExecutionEventLogger logReactorSummary
INFO: apollo-cli ........................................ SKIPPED
Jul 31, 2013 12:34:43 AM org.apache.maven.cli.event.ExecutionEventLogger logReactorSummary
INFO: apollo-website .................................... SUCCESS [25.274s]
Jul 31, 2013 12:34:43 AM org.apache.maven.cli.event.ExecutionEventLogger logReactorSummary
INFO: apache-apollo ..................................... SKIPPED
Jul 31, 2013 12:34:43 AM org.apache.maven.cli.event.ExecutionEventLogger logReactorSummary
INFO: apollo-war ........................................ SKIPPED
Jul 31, 2013 12:34:43 AM org.apache.maven.cli.event.ExecutionEventLogger logReactorSummary
INFO: apollo-itests ..................................... SUCCESS [2:28.616s]
Jul 31, 2013 12:34:43 AM org.apache.maven.cli.event.ExecutionEventLogger logResult
INFO: ------------------------------------------------------------------------
Jul 31, 2013 12:34:43 AM org.apache.maven.cli.event.ExecutionEventLogger logResult
INFO: BUILD FAILURE
Jul 31, 2013 12:34:43 AM org.apache.maven.cli.event.ExecutionEventLogger logStats
INFO: ------------------------------------------------------------------------
Jul 31, 2013 12:34:43 AM org.apache.maven.cli.event.ExecutionEventLogger logStats
INFO: Total time: 1:42:13.379s
Jul 31, 2013 12:34:43 AM org.apache.maven.cli.event.ExecutionEventLogger logStats
INFO: Finished at: Wed Jul 31 00:34:43 UTC 2013
Jul 31, 2013 12:34:44 AM org.apache.maven.cli.event.ExecutionEventLogger logStats
INFO: Final Memory: 119M/1079M
Jul 31, 2013 12:34:44 AM org.apache.maven.cli.event.ExecutionEventLogger sessionEnded
INFO: ------------------------------------------------------------------------
[JENKINS] Archiving disabled
[JENKINS] Archiving disabled
[JENKINS] Archiving disabled
[JENKINS] Archiving disabled
[JENKINS] Archiving disabled
[JENKINS] Archiving disabled
[JENKINS] Archiving disabled
[JENKINS] Archiving disabled
[JENKINS] Archiving disabled
[JENKINS] Archiving disabled
[JENKINS] Archiving disabled
[JENKINS] Archiving disabled
[JENKINS] Archiving disabled
[JENKINS] Archiving disabled
[JENKINS] Archiving disabled
[JENKINS] Archiving disabled
[JENKINS] Archiving disabled
[JENKINS] Archiving disabled
[JENKINS] Archiving disabled
[JENKINS] Archiving disabled
[JENKINS] Archiving disabled
Waiting for Jenkins to finish collecting data
mavenExecutionResult exceptions not empty
message : Internal error: hudson.remoting.RemotingSystemException: java.io.UTFDataFormatException
cause : java.io.UTFDataFormatException
Stack trace : 
org.apache.maven.InternalErrorException: Internal error: hudson.remoting.RemotingSystemException:
java.io.UTFDataFormatException
	at org.apache.maven.lifecycle.internal.BuilderCommon.handleBuildError(BuilderCommon.java:128)
	at org.apache.maven.lifecycle.internal.LifecycleModuleBuilder.buildProject(LifecycleModuleBuilder.java:95)
	at org.apache.maven.lifecycle.internal.LifecycleModuleBuilder.buildProject(LifecycleModuleBuilder.java:59)
	at org.apache.maven.lifecycle.internal.LifecycleStarter.singleThreadedBuild(LifecycleStarter.java:183)
	at org.apache.maven.lifecycle.internal.LifecycleStarter.execute(LifecycleStarter.java:161)
	at org.apache.maven.DefaultMaven.doExecute(DefaultMaven.java:319)
	at org.apache.maven.DefaultMaven.execute(DefaultMaven.java:156)
	at org.jvnet.hudson.maven3.launcher.Maven3Launcher.main(Maven3Launcher.java:117)
	at sun.reflect.NativeMethodAccessorImpl.invoke0(Native Method)
	at sun.reflect.NativeMethodAccessorImpl.invoke(NativeMethodAccessorImpl.java:39)
	at sun.reflect.DelegatingMethodAccessorImpl.invoke(DelegatingMethodAccessorImpl.java:25)
	at java.lang.reflect.Method.invoke(Method.java:597)
	at org.codehaus.plexus.classworlds.launcher.Launcher.launchStandard(Launcher.java:329)
	at org.codehaus.plexus.classworlds.launcher.Launcher.launch(Launcher.java:239)
	at org.jvnet.hudson.maven3.agent.Maven3Main.launch(Maven3Main.java:178)
	at sun.reflect.NativeMethodAccessorImpl.invoke0(Native Method)
	at sun.reflect.NativeMethodAccessorImpl.invoke(NativeMethodAccessorImpl.java:39)
	at sun.reflect.DelegatingMethodAccessorImpl.invoke(DelegatingMethodAccessorImpl.java:25)
	at java.lang.reflect.Method.invoke(Method.java:597)
	at hudson.maven.Maven3Builder.call(Maven3Builder.java:129)
	at hudson.maven.Maven3Builder.call(Maven3Builder.java:67)
	at hudson.remoting.UserRequest.perform(UserRequest.java:118)
	at hudson.remoting.UserRequest.perform(UserRequest.java:48)
	at hudson.remoting.Request$2.run(Request.java:326)
	at hudson.remoting.InterceptingExecutorService$1.call(InterceptingExecutorService.java:72)
	at java.util.concurrent.FutureTask$Sync.innerRun(FutureTask.java:303)
	at java.util.concurrent.FutureTask.run(FutureTask.java:138)
	at java.util.concurrent.ThreadPoolExecutor$Worker.runTask(ThreadPoolExecutor.java:895)
	at java.util.concurrent.ThreadPoolExecutor$Worker.run(ThreadPoolExecutor.java:918)
	at java.lang.Thread.run(Thread.java:662)
Caused by: hudson.remoting.RemotingSystemException: java.io.UTFDataFormatException
	at hudson.remoting.RemoteInvocationHandler.invoke(RemoteInvocationHandler.java:183)
	at com.sun.proxy.$Proxy7.setExecutedMojos(Unknown Source)
	at hudson.maven.MavenBuildProxy$Filter.setExecutedMojos(MavenBuildProxy.java:243)
	at hudson.maven.Maven3Builder$MavenExecutionListener.recordMojoEnded(Maven3Builder.java:574)
	at hudson.maven.Maven3Builder$MavenExecutionListener.mojoFailed(Maven3Builder.java:610)
	at org.apache.maven.lifecycle.internal.DefaultExecutionEventCatapult.fire(DefaultExecutionEventCatapult.java:90)
	at org.apache.maven.lifecycle.internal.MojoExecutor.execute(MojoExecutor.java:232)
	at org.apache.maven.lifecycle.internal.MojoExecutor.execute(MojoExecutor.java:153)
	at org.apache.maven.lifecycle.internal.MojoExecutor.execute(MojoExecutor.java:145)
	at org.apache.maven.lifecycle.internal.LifecycleModuleBuilder.buildProject(LifecycleModuleBuilder.java:84)
	... 28 more
Caused by: java.io.UTFDataFormatException
	at java.io.ObjectInputStream$BlockDataInputStream.readUTFSpan(ObjectInputStream.java:3124)
	at java.io.ObjectInputStream$BlockDataInputStream.readUTFBody(ObjectInputStream.java:3049)
	at java.io.ObjectInputStream$BlockDataInputStream.readUTF(ObjectInputStream.java:2862)
	at java.io.ObjectInputStream.readString(ObjectInputStream.java:1636)
	at java.io.ObjectInputStream.readObject0(ObjectInputStream.java:1339)
	at java.io.ObjectInputStream.defaultReadFields(ObjectInputStream.java:1989)
	at java.io.ObjectInputStream.readSerialData(ObjectInputStream.java:1913)
	at java.io.ObjectInputStream.readOrdinaryObject(ObjectInputStream.java:1796)
	at java.io.ObjectInputStream.readObject0(ObjectInputStream.java:1348)
	at java.io.ObjectInputStream.readObject(ObjectInputStream.java:370)
	at java.util.concurrent.CopyOnWriteArrayList.readObject(CopyOnWriteArrayList.java:879)
	at sun.reflect.GeneratedMethodAccessor475.invoke(Unknown Source)
	at sun.reflect.DelegatingMethodAccessorImpl.invoke(DelegatingMethodAccessorImpl.java:43)
	at java.lang.reflect.Method.invoke(Method.java:606)
	at java.io.ObjectStreamClass.invokeReadObject(ObjectStreamClass.java:1017)
	at java.io.ObjectInputStream.readSerialData(ObjectInputStream.java:1891)
	at java.io.ObjectInputStream.readOrdinaryObject(ObjectInputStream.java:1796)
	at java.io.ObjectInputStream.readObject0(ObjectInputStream.java:1348)
	at java.io.ObjectInputStream.readArray(ObjectInputStream.java:1704)
	at java.io.ObjectInputStream.readObject0(ObjectInputStream.java:1342)
	at java.io.ObjectInputStream.defaultReadFields(ObjectInputStream.java:1989)
	at java.io.ObjectInputStream.readSerialData(ObjectInputStream.java:1913)
	at java.io.ObjectInputStream.readOrdinaryObject(ObjectInputStream.java:1796)
	at java.io.ObjectInputStream.readObject0(ObjectInputStream.java:1348)
	at java.io.ObjectInputStream.readObject(ObjectInputStream.java:370)
	at hudson.remoting.UserRequest.deserialize(UserRequest.java:182)
	at hudson.remoting.UserRequest.perform(UserRequest.java:98)
	at hudson.remoting.UserRequest.perform(UserRequest.java:48)
	at hudson.remoting.Request$2.run(Request.java:326)
	at hudson.remoting.InterceptingExecutorService$1.call(InterceptingExecutorService.java:72)
	at java.util.concurrent.FutureTask$Sync.innerRun(FutureTask.java:334)
	at java.util.concurrent.FutureTask.run(FutureTask.java:166)
	at java.util.concurrent.ThreadPoolExecutor.runWorker(ThreadPoolExecutor.java:1145)
	at java.util.concurrent.ThreadPoolExecutor$Worker.run(ThreadPoolExecutor.java:615)
	at java.lang.Thread.run(Thread.java:724)
Maven failed with error.
Sending e-mails to: commits@activemq.apache.org
Sending e-mails to: commits@activemq.apache.org
channel stopped

Mime
View raw message